Uploaded image for project: 'Jackrabbit Oak'
  1. Jackrabbit Oak
  2. OAK-6219

Test failure: OSGiIT

    XMLWordPrintableJSON

    Details

      Description

      https://builds.apache.org/job/Jackrabbit%20Oak/289/

      Running org.apache.jackrabbit.oak.osgi.OSGiIT
      Tests run: 5, Failures: 0, Errors: 5, Skipped: 0, Time elapsed: 55.992 sec <<< FAILURE! - in org.apache.jackrabbit.oak.osgi.OSGiIT
      listServices(org.apache.jackrabbit.oak.osgi.OSGiIT)  Time elapsed: 13.781 sec  <<< ERROR!
      org.ops4j.pax.swissbox.tracker.ServiceLookupException: gave up waiting for service javax.jcr.Repository
      
      listBundles(org.apache.jackrabbit.oak.osgi.OSGiIT)  Time elapsed: 10.004 sec  <<< ERROR!
      org.ops4j.pax.swissbox.tracker.ServiceLookupException: gave up waiting for service javax.jcr.Repository
      
      bundleStates(org.apache.jackrabbit.oak.osgi.OSGiIT)  Time elapsed: 10.005 sec  <<< ERROR!
      org.ops4j.pax.swissbox.tracker.ServiceLookupException: gave up waiting for service javax.jcr.Repository
      
      testNodeStore(org.apache.jackrabbit.oak.osgi.OSGiIT)  Time elapsed: 10.003 sec  <<< ERROR!
      org.ops4j.pax.swissbox.tracker.ServiceLookupException: gave up waiting for service javax.jcr.Repository
      
      testRepository(org.apache.jackrabbit.oak.osgi.OSGiIT)  Time elapsed: 10.004 sec  <<< ERROR!
      org.ops4j.pax.swissbox.tracker.ServiceLookupException: gave up waiting for service javax.jcr.Repository
      

        Attachments

          Activity

            People

            • Assignee:
              Unassigned
              Reporter:
              hudson Hudson
            • Votes:
              0 Vote for this issue
              Watchers:
              3 Start watching this issue

              Dates

              • Created:
                Updated:
                Resolved: