Uploaded image for project: 'Apache NiFi'
  1. Apache NiFi
  2. NIFI-9487

Tests are failing on Android 11

Attach filesAttach ScreenshotAdd voteVotersWatch issueWatchersCreate sub-taskLinkCloneUpdate Comment AuthorReplace String in CommentUpdate Comment VisibilityDelete Comments
    XMLWordPrintableJSON

Details

    • Bug
    • Status: Open
    • Major
    • Resolution: Unresolved
    • None
    • None
    • MiNiFi
    • None

    Description

      [INFO] Running org.apache.nifi.minifi.bootstrap.configuration.ConfigurationChangeCoordinatorTest            [ERROR] Tests run: 3, Failures: 3, Errors: 0, Skipped: 0, Time elapsed: 1.009 s <<< FAILURE! - in org.apache.nifi.minifi.bootstrap.configuration.ConfigurationChangeCoordinatorTest                                     [ERROR] org.apache.nifi.minifi.bootstrap.configuration.ConfigurationChangeCoordinatorTest.testNotifyListeners  Time elapsed: 0.916 s  <<< FAILURE!                org.opentest4j.MultipleFailuresError:                 Multiple Failures (2 failures)                                java.lang.ExceptionInInitializerError: <no message>                                                         java.lang.NullPointerException: Cannot invoke "org.apache.nifi.minifi.bootstrap.configuration.ConfigurationChangeCoordinator.close()" because "this.coordinatorSpy" is null                                                                                           [ERROR] org.apache.nifi.minifi.bootstrap.configuration.ConfigurationChangeCoordinatorTest.testInit  Time elapsed: 0.004 s  <<< FAILURE!                           org.opentest4j.MultipleFailuresError:                 Multiple Failures (2 failures)                                java.lang.NoClassDefFoundError: Could not initialize class org.mockito.internal.creation.cglib.ClassImposterizer$3                                                java.lang.NullPointerException: Cannot invoke "org.apache.nifi.minifi.bootstrap.configuration.ConfigurationChangeCoordinator.close()" because "this.coordinatorSpy" is null                                                                                           [ERROR] org.apache.nifi.minifi.bootstrap.configuration.ConfigurationChangeCoordinatorTest.testRegisterListener  Time elapsed: 0.004 s  <<< FAILURE!               org.opentest4j.MultipleFailuresError:                 Multiple Failures (2 failures)                                java.lang.NoClassDefFoundError: Could not initialize class org.mockito.internal.creation.cglib.ClassImposterizer$3                                                java.lang.NullPointerException: Cannot invoke "org.apache.nifi.minifi.bootstrap.configuration.ConfigurationChangeCoordinator.close()" because "this.coordinatorSpy" is null                                                                                           [INFO] Running org.apache.nifi.minifi.bootstrap.configuration.differentiators.WholeConfigDifferentiatorTest [ERROR] Tests run: 1, Failures: 0, Errors: 1, Skipped: 0, Time elapsed: 0.211 s <<< FAILURE! - in org.apache.nifi.minifi.bootstrap.configuration.differentiators.WholeConfigDifferentiatorTest                          [ERROR] org.apache.nifi.minifi.bootstrap.configuration.differentiators.WholeConfigDifferentiatorTest  Time elapsed: 0.211 s  <<< ERROR!                           java.lang.NoClassDefFoundError: Could not initialize class org.mockito.internal.creation.cglib.ClassImposterizer$3                                                        at org.apache.nifi.minifi.bootstrap.configuration.differentiators.WholeConfigDifferentiatorTest.beforeClass(WholeConfigDifferentiatorTest.java:64)                                                              [INFO] Running org.apache.nifi.minifi.bootstrap.configuration.ingestors.FileChangeIngestorTest              [ERROR] Tests run: 7, Failures: 7, Errors: 0, Skipped: 0, Time elapsed: 0.058 s <<< FAILURE! - in org.apache.nifi.minifi.bootstrap.configuration.ingestors.FileChangeIngestorTest                                       [ERROR] org.apache.nifi.minifi.bootstrap.configuration.ingestors.FileChangeIngestorTest.testInitialize_invalidPollingPeriod  Time elapsed: 0.004 s  <<< FAILURE!  org.opentest4j.MultipleFailuresError:                 Multiple Failures (2 failures)                                java.lang.NoClassDefFoundError: Could not initialize class org.mockito.internal.creation.cglib.ClassImposterizer$3                                                java.lang.NullPointerException: Cannot invoke "org.apache.nifi.minifi.bootstrap.configuration.ingestors.FileChangeIngestor.close()" because "this.notifierSpy" is null                                                                                                [ERROR] org.apache.nifi.minifi.bootstrap.configuration.ingestors.FileChangeIngestorTest.testInitialize_useDefaultPolling  Time elapsed: 0.004 s  <<< FAILURE!     org.opentest4j.MultipleFailuresError:                 Multiple Failures (2 failures)                                java.lang.NoClassDefFoundError: Could not initialize class org.mockito.internal.creation.cglib.ClassImposterizer$3                                                java.lang.NullPointerException: Cannot invoke "org.apache.nifi.minifi.bootstrap.configuration.ingestors.FileChangeIngestor.close()" because "this.notifierSpy" is null                                                                                                [ERROR] org.apache.nifi.minifi.bootstrap.configuration.ingestors.FileChangeIngestorTest.testInitialize_validFile  Time elapsed: 0.005 s  <<< FAILURE!             org.opentest4j.MultipleFailuresError:                 Multiple Failures (2 failures)                                java.lang.NoClassDefFoundError: Could not initialize class org.mockito.internal.creation.cglib.ClassImposterizer$3                                                java.lang.NullPointerException: Cannot invoke "org.apache.nifi.minifi.bootstrap.configuration.ingestors.FileChangeIngestor.close()" because "this.notifierSpy" is null                                                                                                [ERROR] org.apache.nifi.minifi.bootstrap.configuration.ingestors.FileChangeIngestorTest.testTargetChangedNoModification  Time elapsed: 0.004 s  <<< FAILURE!      org.opentest4j.MultipleFailuresError:                 Multiple Failures (2 failures)                                java.lang.NoClassDefFoundError: Could not initialize class org.mockito.internal.creation.cglib.ClassImposterizer$3                                                java.lang.NullPointerException: Cannot invoke "org.apache.nifi.minifi.bootstrap.configuration.ingestors.FileChangeIngestor.close()" because "this.notifierSpy" is null                                                                                                [ERROR] org.apache.nifi.minifi.bootstrap.configuration.ingestors.FileChangeIngestorTest.testTargetChangedWithModificationEvent_nonConfigFile  Time elapsed: 0.004 s  <<< FAILURE!                                       org.opentest4j.MultipleFailuresError:                 Multiple Failures (2 failures)                                java.lang.NoClassDefFoundError: Could not initialize class org.mockito.internal.creation.cglib.ClassImposterizer$3                                                java.lang.NullPointerException: Cannot invoke "org.apache.nifi.minifi.bootstrap.configuration.ingestors.FileChangeIngestor.close()" because "this.notifierSpy" is null                                                                                                [ERROR] org.apache.nifi.minifi.bootstrap.configuration.ingestors.FileChangeIngestorTest.testInitialize_invalidFile  Time elapsed: 0.004 s  <<< FAILURE!           org.opentest4j.MultipleFailuresError:                 Multiple Failures (2 failures)                                java.lang.NoClassDefFoundError: Could not initialize class org.mockito.internal.creation.cglib.ClassImposterizer$3                                                java.lang.NullPointerException: Cannot invoke "org.apache.nifi.minifi.bootstrap.configuration.ingestors.FileChangeIngestor.close()" because "this.notifierSpy" is null                                                                                                [ERROR] org.apache.nifi.minifi.bootstrap.configuration.ingestors.FileChangeIngestorTest.testTargetChangedWithModificationEvent  Time elapsed: 0.005 s  <<< FAILURE!                                                     org.opentest4j.MultipleFailuresError:                 Multiple Failures (2 failures)                                java.lang.NoClassDefFoundError: Could not initialize class org.mockito.internal.creation.cglib.ClassImposterizer$3                                                java.lang.NullPointerException: Cannot invoke "org.apache.nifi.minifi.bootstrap.configuration.ingestors.FileChangeIngestor.close()" because "this.notifierSpy" is null                                                                                                [INFO] Running org.apache.nifi.minifi.bootstrap.configuration.ingestors.RestChangeIngestorTest              [ERROR] Tests run: 1, Failures: 1, Errors: 0, Skipped: 0, Time elapsed: 0.007 s <<< FAILURE! - in org.apache.nifi.minifi.bootstrap.configuration.ingestors.RestChangeIngestorTest                                       [ERROR] org.apache.nifi.minifi.bootstrap.configuration.ingestors.RestChangeIngestorTest  Time elapsed: 0.007 s  <<< FAILURE!                                      org.opentest4j.MultipleFailuresError:                 Multiple Failures (2 failures)                                java.lang.NoClassDefFoundError: Could not initialize class org.mockito.internal.creation.cglib.ClassImposterizer$3                                                java.lang.NoClassDefFoundError: Could not initialize class org.apache.nifi.minifi.bootstrap.configuration.ingestors.RestChangeIngestorTest                                                                      [INFO] Running org.apache.nifi.minifi.bootstrap.configuration.ingestors.PullHttpChangeIngestorSSLTest       [ERROR] Tests run: 1, Failures: 1, Errors: 0, Skipped: 0, Time elapsed: 0.003 s <<< FAILURE! - in org.apache.nifi.minifi.bootstrap.configuration.ingestors.PullHttpChangeIngestorSSLTest                                [ERROR] org.apache.nifi.minifi.bootstrap.configuration.ingestors.PullHttpChangeIngestorSSLTest  Time elapsed: 0.003 s  <<< FAILURE!                               org.opentest4j.MultipleFailuresError:                 Multiple Failures (2 failures)                                java.lang.NoClassDefFoundError: Could not initialize class org.mockito.internal.creation.cglib.ClassImposterizer$3                                                java.lang.NoClassDefFoundError: Could not initialize class org.apache.nifi.minifi.bootstrap.configuration.ingestors.common.PullHttpChangeIngestorCommonTest                                                                                                           [INFO] Running org.apache.nifi.minifi.bootstrap.configuration.ingestors.PullHttpChangeIngestorTest          [ERROR] Tests run: 1, Failures: 1, Errors: 0, Skipped: 0, Time elapsed: 0.004 s <<< FAILURE! - in org.apache.nifi.minifi.bootstrap.configuration.ingestors.PullHttpChangeIngestorTest                                   [ERROR] org.apache.nifi.minifi.bootstrap.configuration.ingestors.PullHttpChangeIngestorTest  Time elapsed: 0.004 s  <<< FAILURE!                                  org.opentest4j.MultipleFailuresError:                 Multiple Failures (2 failures)                                java.lang.NoClassDefFoundError: Could not initialize class org.apache.nifi.minifi.bootstrap.configuration.ingestors.common.PullHttpChangeIngestorCommonTest                                                             java.lang.NoClassDefFoundError: Could not initialize class org.apache.nifi.minifi.bootstrap.configuration.ingestors.common.PullHttpChangeIngestorCommonTest                                                                                                           [INFO] Running org.apache.nifi.minifi.bootstrap.configuration.ingestors.RestChangeIngestorSSLTest           [ERROR] Tests run: 1, Failures: 1, Errors: 0, Skipped: 0, Time elapsed: 0.003 s <<< FAILURE! - in org.apache.nifi.minifi.bootstrap.configuration.ingestors.RestChangeIngestorSSLTest                                    [ERROR] org.apache.nifi.minifi.bootstrap.configuration.ingestors.RestChangeIngestorSSLTest  Time elapsed: 0.003 s  <<< FAILURE!                                   org.opentest4j.MultipleFailuresError:                 Multiple Failures (2 failures)                                java.lang.NoClassDefFoundError: Could not initialize class org.apache.nifi.minifi.bootstrap.configuration.ingestors.common.RestChangeIngestorCommonTest           java.lang.NoClassDefFoundError: Could not initialize class org.apache.nifi.minifi.bootstrap.configuration.ingestors.RestChangeIngestorSSLTest                                                                   [INFO] Running org.apache.nifi.minifi.bootstrap.status.reporters.StatusLoggerTest                           [ERROR] Tests run: 13, Failures: 0, Errors: 13, Skipped: 0, Time elapsed: 0.092 s <<< FAILURE! - in org.apache.nifi.minifi.bootstrap.status.reporters.StatusLoggerTest                                                  [ERROR] org.apache.nifi.minifi.bootstrap.status.reporters.StatusLoggerTest.TestInfoException  Time elapsed: 0.003 s  <<< ERROR!                                   java.lang.NoClassDefFoundError: Could not initialize class org.mockito.internal.creation.cglib.ClassImposterizer$3                                                        at org.apache.nifi.minifi.bootstrap.status.reporters.StatusLoggerTest.init(StatusLoggerTest.java:57)                                                      [ERROR] org.apache.nifi.minifi.bootstrap.status.reporters.StatusLoggerTest.TestDebugException  Time elapsed: 0.003 s  <<< ERROR!                                  java.lang.NoClassDefFoundError: Could not initialize class org.mockito.internal.creation.cglib.ClassImposterizer$3                                                        at org.apache.nifi.minifi.bootstrap.status.reporters.StatusLoggerTest.init(StatusLoggerTest.java:57)                                                      [ERROR] org.apache.nifi.minifi.bootstrap.status.reporters.StatusLoggerTest.testFailedInitDueToNoPeriod  Time elapsed: 0.003 s  <<< ERROR!                         java.lang.NoClassDefFoundError: Could not initialize class org.mockito.internal.creation.cglib.ClassImposterizer$3                                                        at org.apache.nifi.minifi.bootstrap.status.reporters.StatusLoggerTest.init(StatusLoggerTest.java:57)                                                      [ERROR] org.apache.nifi.minifi.bootstrap.status.reporters.StatusLoggerTest.TestInfo  Time elapsed: 0.003 s  <<< ERROR!                                            java.lang.NoClassDefFoundError: Could not initialize class org.mockito.internal.creation.cglib.ClassImposterizer$3                                                        at org.apache.nifi.minifi.bootstrap.status.reporters.StatusLoggerTest.init(StatusLoggerTest.java:57)                                                      [ERROR] org.apache.nifi.minifi.bootstrap.status.reporters.StatusLoggerTest.TestWarn  Time elapsed: 0.003 s  <<< ERROR!                                            java.lang.NoClassDefFoundError: Could not initialize class org.mockito.internal.creation.cglib.ClassImposterizer$3                                                        at org.apache.nifi.minifi.bootstrap.status.reporters.StatusLoggerTest.init(StatusLoggerTest.java:57)                                                      [ERROR] org.apache.nifi.minifi.bootstrap.status.reporters.StatusLoggerTest.testFailedInitDueToNoQuery  Time elapsed: 0.003 s  <<< ERROR!                          java.lang.NoClassDefFoundError: Could not initialize class org.mockito.internal.creation.cglib.ClassImposterizer$3                                                        at org.apache.nifi.minifi.bootstrap.status.reporters.StatusLoggerTest.init(StatusLoggerTest.java:57)                                                      [ERROR] org.apache.nifi.minifi.bootstrap.status.reporters.StatusLoggerTest.TestErrorException  Time elapsed: 0.002 s  <<< ERROR!                                  java.lang.NoClassDefFoundError: Could not initialize class org.mockito.internal.creation.cglib.ClassImposterizer$3                                                        at org.apache.nifi.minifi.bootstrap.status.reporters.StatusLoggerTest.init(StatusLoggerTest.java:57)                                                      [ERROR] org.apache.nifi.minifi.bootstrap.status.reporters.StatusLoggerTest.testFailedInitDueToFatalLogLevel  Time elapsed: 0.003 s  <<< ERROR!                    java.lang.NoClassDefFoundError: Could not initialize class org.mockito.internal.creation.cglib.ClassImposterizer$3                                                        at org.apache.nifi.minifi.bootstrap.status.reporters.StatusLoggerTest.init(StatusLoggerTest.java:57)                                                      [ERROR] org.apache.nifi.minifi.bootstrap.status.reporters.StatusLoggerTest.TestDebug  Time elapsed: 0.004 s  <<< ERROR!                                           java.lang.NoClassDefFoundError: Could not initialize class org.mockito.internal.creation.cglib.ClassImposterizer$3                                                        at org.apache.nifi.minifi.bootstrap.status.reporters.StatusLoggerTest.init(StatusLoggerTest.java:57)                                                      [ERROR] org.apache.nifi.minifi.bootstrap.status.reporters.StatusLoggerTest.TestError  Time elapsed: 0.004 s  <<< ERROR!                                           java.lang.NoClassDefFoundError: Could not initialize class org.mockito.internal.creation.cglib.ClassImposterizer$3                                                        at org.apache.nifi.minifi.bootstrap.status.reporters.StatusLoggerTest.init(StatusLoggerTest.java:57)                                                      [ERROR] org.apache.nifi.minifi.bootstrap.status.reporters.StatusLoggerTest.TestTrace  Time elapsed: 0.004 s  <<< ERROR!                                           java.lang.NoClassDefFoundError: Could not initialize class org.mockito.internal.creation.cglib.ClassImposterizer$3                                                        at org.apache.nifi.minifi.bootstrap.status.reporters.StatusLoggerTest.init(StatusLoggerTest.java:57)                                                      [ERROR] org.apache.nifi.minifi.bootstrap.status.reporters.StatusLoggerTest.TestWarnException  Time elapsed: 0.004 s  <<< ERROR!                                   java.lang.NoClassDefFoundError: Could not initialize class org.mockito.internal.creation.cglib.ClassImposterizer$3                                                        at org.apache.nifi.minifi.bootstrap.status.reporters.StatusLoggerTest.init(StatusLoggerTest.java:57)                                                      [ERROR] org.apache.nifi.minifi.bootstrap.status.reporters.StatusLoggerTest.TestTraceException  Time elapsed: 0.003 s  <<< ERROR!                                  java.lang.NoClassDefFoundError: Could not initialize class org.mockito.internal.creation.cglib.ClassImposterizer$3                                                        at org.apache.nifi.minifi.bootstrap.status.reporters.StatusLoggerTest.init(StatusLoggerTest.java:57)                                                      [INFO] Running org.apache.nifi.minifi.bootstrap.util.ConfigTransformerTest                                                                                        [INFO] Tests run: 33, Failures: 0, Errors: 0, Skipped: 0, Time elapsed: 7.382 s - in org.apache.nifi.minifi.bootstrap.util.ConfigTransformerTest                  [INFO] Running org.apache.nifi.minifi.bootstrap.util.ParentGroupIdResolverTest                              [INFO] Tests run: 6, Failures: 0, Errors: 0, Skipped: 0, Time elapsed: 0.091 s - in org.apache.nifi.minifi.bootstrap.util.ParentGroupIdResolverTest               [INFO] Running org.apache.nifi.minifi.bootstrap.util.OrderedPropertiesTest                                  [INFO] Tests run: 1, Failures: 0, Errors: 0, Skipped: 0, Time elapsed: 0.008 s - in org.apache.nifi.minifi.bootstrap.util.OrderedPropertiesTest                   [INFO] Running org.apache.nifi.minifi.bootstrap.RunMiNiFiTest                                               [INFO] Tests run: 5, Failures: 0, Errors: 0, Skipped: 0, Time elapsed: 0.065 s - in org.apache.nifi.minifi.bootstrap.RunMiNiFiTest                                [INFO]                                                [INFO] Results:                                       [INFO]                                                [ERROR] Failures:                                     [ERROR]   ConfigurationChangeCoordinatorTest.testInit Multiple Failures (2 failures)                                java.lang.NoClassDefFoundError: Could not initialize class org.mockito.internal.creation.cglib.ClassImposterizer$3                                                java.lang.NullPointerException: Cannot invoke "org.apache.nifi.minifi.bootstrap.configuration.ConfigurationChangeCoordinator.close()" because "this.coordinatorSpy" is null                                     [ERROR]   ConfigurationChangeCoordinatorTest.testNotifyListeners Multiple Failures (2 failures)                     java.lang.ExceptionInInitializerError: <no message>                                                         java.lang.NullPointerException: Cannot invoke "org.apache.nifi.minifi.bootstrap.configuration.ConfigurationChangeCoordinator.close()" because "this.coordinatorSpy" is null                                     [ERROR]   ConfigurationChangeCoordinatorTest.testRegisterListener Multiple Failures (2 failures)                    java.lang.NoClassDefFoundError: Could not initialize class org.mockito.internal.creation.cglib.ClassImposterizer$3                                                java.lang.NullPointerException: Cannot invoke "org.apache.nifi.minifi.bootstrap.configuration.ConfigurationChangeCoordinator.close()" because "this.coordinatorSpy" is null                                     [ERROR]   FileChangeIngestorTest.testInitialize_invalidFile Multiple Failures (2 failures)                          java.lang.NoClassDefFoundError: Could not initialize class org.mockito.internal.creation.cglib.ClassImposterizer$3                                                java.lang.NullPointerException: Cannot invoke "org.apache.nifi.minifi.bootstrap.configuration.ingestors.FileChangeIngestor.close()" because "this.notifierSpy" is null                                          [ERROR]   FileChangeIngestorTest.testInitialize_invalidPollingPeriod Multiple Failures (2 failures)                 java.lang.NoClassDefFoundError: Could not initialize class org.mockito.internal.creation.cglib.ClassImposterizer$3                                                java.lang.NullPointerException: Cannot invoke "org.apache.nifi.minifi.bootstrap.configuration.ingestors.FileChangeIngestor.close()" because "this.notifierSpy" is null                                          [ERROR]   FileChangeIngestorTest.testInitialize_useDefaultPolling Multiple Failures (2 failures)                    java.lang.NoClassDefFoundError: Could not initialize class org.mockito.internal.creation.cglib.ClassImposterizer$3                                                java.lang.NullPointerException: Cannot invoke "org.apache.nifi.minifi.bootstrap.configuration.ingestors.FileChangeIngestor.close()" because "this.notifierSpy" is null                                          [ERROR]   FileChangeIngestorTest.testInitialize_validFile Multiple Failures (2 failures)                            java.lang.NoClassDefFoundError: Could not initialize class org.mockito.internal.creation.cglib.ClassImposterizer$3                                                java.lang.NullPointerException: Cannot invoke "org.apache.nifi.minifi.bootstrap.configuration.ingestors.FileChangeIngestor.close()" because "this.notifierSpy" is null                                          [ERROR]   FileChangeIngestorTest.testTargetChangedNoModification Multiple Failures (2 failures)                     java.lang.NoClassDefFoundError: Could not initialize class org.mockito.internal.creation.cglib.ClassImposterizer$3                                                java.lang.NullPointerException: Cannot invoke "org.apache.nifi.minifi.bootstrap.configuration.ingestors.FileChangeIngestor.close()" because "this.notifierSpy" is null                                          [ERROR]   FileChangeIngestorTest.testTargetChangedWithModificationEvent Multiple Failures (2 failures)              java.lang.NoClassDefFoundError: Could not initialize class org.mockito.internal.creation.cglib.ClassImposterizer$3                                                java.lang.NullPointerException: Cannot invoke "org.apache.nifi.minifi.bootstrap.configuration.ingestors.FileChangeIngestor.close()" because "this.notifierSpy" is null                                          [ERROR]   FileChangeIngestorTest.testTargetChangedWithModificationEvent_nonConfigFile Multiple Failures (2 failures)                                                      java.lang.NoClassDefFoundError: Could not initialize class org.mockito.internal.creation.cglib.ClassImposterizer$3                                                java.lang.NullPointerException: Cannot invoke "org.apache.nifi.minifi.bootstrap.configuration.ingestors.FileChangeIngestor.close()" because "this.notifierSpy" is null                                          [ERROR]   PullHttpChangeIngestorSSLTest Multiple Failures (2 failures)                                              java.lang.NoClassDefFoundError: Could not initialize class org.mockito.internal.creation.cglib.ClassImposterizer$3                                                java.lang.NoClassDefFoundError: Could not initialize class org.apache.nifi.minifi.bootstrap.configuration.ingestors.common.PullHttpChangeIngestorCommonTest                                                     [ERROR]   PullHttpChangeIngestorTest Multiple Failures (2 failures)                                                 java.lang.NoClassDefFoundError: Could not initialize class org.apache.nifi.minifi.bootstrap.configuration.ingestors.common.PullHttpChangeIngestorCommonTest                                                             java.lang.NoClassDefFoundError: Could not initialize class org.apache.nifi.minifi.bootstrap.configuration.ingestors.common.PullHttpChangeIngestorCommonTest                                                     [ERROR]   RestChangeIngestorSSLTest Multiple Failures (2 failures)                                                  java.lang.NoClassDefFoundError: Could not initialize class org.apache.nifi.minifi.bootstrap.configuration.ingestors.common.RestChangeIngestorCommonTest           java.lang.NoClassDefFoundError: Could not initialize class org.apache.nifi.minifi.bootstrap.configuration.ingestors.RestChangeIngestorSSLTest             [ERROR]   RestChangeIngestorTest Multiple Failures (2 failures)                                                     java.lang.NoClassDefFoundError: Could not initialize class org.mockito.internal.creation.cglib.ClassImposterizer$3                                                java.lang.NoClassDefFoundError: Could not initialize class org.apache.nifi.minifi.bootstrap.configuration.ingestors.RestChangeIngestorTest                [ERROR] Errors:                                       [ERROR]   WholeConfigDifferentiatorTest.beforeClass:64 » NoClassDefFound Could not initi...                 [ERROR]   StatusLoggerTest.init:57 » NoClassDefFound Could not initialize class org.mock...                 [ERROR]   StatusLoggerTest.init:57 » NoClassDefFound Could not initialize class org.mock...                 [ERROR]   StatusLoggerTest.init:57 » NoClassDefFound Could not initialize class org.mock...                 [ERROR]   StatusLoggerTest.init:57 » NoClassDefFound Could not initialize class org.mock...                 [ERROR]   StatusLoggerTest.init:57 » NoClassDefFound Could not initialize class org.mock...                 [ERROR]   StatusLoggerTest.init:57 » NoClassDefFound Could not initialize class org.mock...                 [ERROR]   StatusLoggerTest.init:57 » NoClassDefFound Could not initialize class org.mock...                 [ERROR]   StatusLoggerTest.init:57 » NoClassDefFound Could not initialize class org.mock...                 [ERROR]   StatusLoggerTest.init:57 » NoClassDefFound Could not initialize class org.mock...                 [ERROR]   StatusLoggerTest.init:57 » NoClassDefFound Could not initialize class org.mock...                 [ERROR]   StatusLoggerTest.init:57 » NoClassDefFound Could not initialize class org.mock...                 [ERROR]   StatusLoggerTest.init:57 » NoClassDefFound Could not initialize class org.mock...                 [ERROR]   StatusLoggerTest.init:57 » NoClassDefFound Could not initialize class org.mock...                 [INFO]                                                [ERROR] Tests run: 73, Failures: 14, Errors: 14, Skipped: 0                                                 [INFO]                                                [INFO] ------------------------------------------------------------------------                             [INFO] Reactor Summary for minifi 1.15.0:             [INFO]                                                [INFO] minifi ............................................. SUCCESS [03:19 min]                             [INFO] minifi-commons ..................................... SUCCESS [  0.517 s]                             [INFO] minifi-commons-schema .............................. SUCCESS [09:27 min]                             [INFO] minifi-utils ....................................... SUCCESS [ 17.916 s]                             [INFO] minifi-bootstrap ................................... FAILURE [ 31.315 s]                             [INFO] minifi-nar-bundles ................................. SKIPPED                                         [INFO] minifi-framework-bundle ............................ SKIPPED                                         [INFO] minifi-framework ................................... SKIPPED                                         [INFO] minifi-framework-api ............................... SKIPPED                                         [INFO] minifi-framework-core .............................. SKIPPED                                         [INFO] minifi-framework-nar ............................... SKIPPED                                         [INFO] minifi-runtime ..................................... SKIPPED                                         [INFO] minifi-resources ................................... SKIPPED                                         [INFO] minifi-server ...................................... SKIPPED                                         [INFO] minifi-server-nar .................................. SKIPPED                                         [INFO] minifi-provenance-repository-bundle ................ SKIPPED                                         [INFO] minifi-provenance-repositories ..................... SKIPPED                                         [INFO] minifi-provenance-repository-nar ................... SKIPPED                                         [INFO] minifi-update-attribute-nar ........................ SKIPPED                                         [INFO] minifi-standard-nar ................................ SKIPPED                                         [INFO] minifi-docs ........................................ SKIPPED                                         [INFO] minifi-assembly .................................... SKIPPED                                         [INFO] minifi-toolkit ..................................... SKIPPED                                         [INFO] minifi-toolkit-configuration ....................... SKIPPED                                         [INFO] minifi-toolkit-assembly ............................ SKIPPED                                         [INFO] minifi-docker ...................................... SKIPPED                                         [INFO] minifi-c2 .......................................... SKIPPED                                         [INFO] minifi-c2-api ...................................... SKIPPED                                         [INFO] minifi-c2-cache .................................... SKIPPED                                         [INFO] minifi-c2-cache-filesystem ......................... SKIPPED                                         [INFO] minifi-c2-cache-s3 ................................. SKIPPED                                         [INFO] minifi-c2-provider ................................. SKIPPED                                         [INFO] minifi-c2-provider-util ............................ SKIPPED                                         [INFO] minifi-c2-provider-cache ........................... SKIPPED                                         [INFO] minifi-c2-provider-delegating ...................... SKIPPED                                         [INFO] minifi-c2-provider-nifi-rest ....................... SKIPPED                                         [INFO] minifi-c2-service .................................. SKIPPED                                         [INFO] minifi-c2-jetty .................................... SKIPPED                                         [INFO] minifi-c2-assembly ................................. SKIPPED                                         [INFO] minifi-c2-docker ................................... SKIPPED                                         [INFO] minifi-c2-integration-tests ........................ SKIPPED                                         [INFO] minifi-integration-tests ........................... SKIPPED                                         [INFO] ------------------------------------------------------------------------                             [INFO] BUILD FAILURE                                  [INFO] ------------------------------------------------------------------------                             [INFO] Total time:  13:45 min                         [INFO] Finished at: 2021-12-14T23:05:45Z              [INFO] ------------------------------------------------------------------------                             [ERROR] Failed to execute goal org.apache.maven.plugins:maven-surefire-plugin:3.0.0-M5:test (default-test) on project minifi-bootstrap: There are test failures.  [ERROR]                                               [ERROR] Please refer to /data/data/com.termux/files/home/nifi-1.15.0/minifi/minifi-bootstrap/target/surefire-reports for the individual test results.             [ERROR] Please refer to dump files (if any exist) [date].dump, [date]-jvmRun[N].dump and [date].dumpstream. [ERROR] -> [Help 1]                                   [ERROR]                                               [ERROR] To see the full stack trace of the errors, re-run Maven with the -e switch.                         [ERROR] Re-run Maven using the -X switch to enable full debug logging.                                      [ERROR]                                               [ERROR] For more information about the errors and possible solutions, please read the following articles:   [ERROR] [Help 1] http://cwiki.apache.org/confluence/display/MAVEN/MojoFailureException                      [ERROR]                                               [ERROR] After correcting the problems, you can resume the build with the command                            [ERROR]   mvn <args> -rf :minifi-bootstrap            /nifi-1.15.0/minifi $                                /nifi-1.15.0/minifi $                                /nifi-1.15.0/minifi $                                /nifi-1.15.0/minifi $                                /nifi-1.15.0/minifi $                                /nifi-1.15.0/minifi $                                ~/nifi-1.15.0/minifi $

      Attachments

        Activity

          This comment will be Viewable by All Users Viewable by All Users
          Cancel

          People

            Unassigned Unassigned
            oceanfish81 Ivan Serdyuk

            Dates

              Created:
              Updated:

              Slack

                Issue deployment