Uploaded image for project: 'Apache NiFi'
  1. Apache NiFi
  2. NIFI-7620

Resolve failing unit test due to timeout in CI/CD environment

Agile BoardAttach filesAttach ScreenshotVotersWatch issueWatchersCreate sub-taskLinkCloneUpdate Comment AuthorReplace String in CommentUpdate Comment VisibilityDelete Comments
    XMLWordPrintableJSON

    Details

      Description

      There is a test failure on MacOS JP 1.8 for GitHub Actions:

      [ERROR] Tests run: 32, Failures: 1, Errors: 0, Skipped: 0, Time elapsed: 42.397 s <<< FAILURE! - in org.apache.nifi.remote.client.http.TestHttpClient
      [ERROR] testReceiveTimeoutAfterDataExchange(org.apache.nifi.remote.client.http.TestHttpClient)  Time elapsed: 21.275 s  <<< FAILURE!
      java.lang.AssertionError
      	at org.apache.nifi.remote.client.http.TestHttpClient.testReceiveTimeoutAfterDataExchange(TestHttpClient.java:1384)
      
      [WARNING] Tests run: 5, Failures: 0, Errors: 0, Skipped: 2, Time elapsed: 0.454 s - in org.apache.nifi.remote.client.socket.TestSiteToSiteClient
      [ERROR] Failures: 
      [ERROR]   TestHttpClient.testReceiveTimeoutAfterDataExchange:1384
      [ERROR] Tests run: 92, Failures: 1, Errors: 0, Skipped: 2
      

        Attachments

        Issue Links

          Activity

            People

            • Assignee:
              alopresto Andy LoPresto
              Reporter:
              alopresto Andy LoPresto

              Dates

              • Created:
                Updated:
                Resolved:

              Time Tracking

              Estimated:
              Original Estimate - Not Specified
              Not Specified
              Remaining:
              Remaining Estimate - 0h
              0h
              Logged:
              Time Spent - 0.5h
              0.5h

                Issue deployment