Maven Release Plugin
  1. Maven Release Plugin
  2. MRELEASE-140

Tests fail during release:perform but work elsewhere

    Details

    • Type: Bug Bug
    • Status: Open
    • Priority: Blocker Blocker
    • Resolution: Unresolved
    • Affects Version/s: 2.0-beta-4
    • Fix Version/s: None
    • Component/s: perform
    • Labels:
      None
    • Environment:
      Maven 2.0.4. Linux

      Description

      Summary

      I have a project that builds successfully when mvn clean install is executed.
      When mvn clean release:prepare is executed the integration tests run successfully too.
      When mvn release:perform is executed the junit tests using surefire fail.

      Details

      The project layout

      The project is an EJB 3 project. The unit tests bootstrap/startup an embedded EJB container to test the EJBs. The container is configured via a set of xml and property files that are specified in the testResources section of the pom. The embedded container is a dependency of the project with test scope.

      release:perform output

      The output of the release:perform goal is attached to this issue.

      surefire junit test report

      The output of the release:perform goal is attached to this issue. A snippet is shown here:

      -------------------------------------------------------------------------------
      Battery: com.dolby.pics.core.ejb.bean.CountryBeanTestCase
      -------------------------------------------------------------------------------
      Tests run: 11, Failures: 0, Errors: 11, Time elapsed: 7.234 sec 
      
      testGetAll(com.dolby.pics.core.ejb.bean.CountryBeanTestCase)  Time elapsed: 2.255 sec  <<< ERROR!
      
      [ stdout ] ---------------------------------------------------------------
      
      
      
      [ stderr ] ---------------------------------------------------------------
      
      
      
      [ stacktrace ] -----------------------------------------------------------
      
      java.lang.RuntimeException: org.jboss.xb.binding.JBossXBRuntimeException: Failed to create a new SAX parser
      	at org.jboss.ejb3.embedded.EJB3StandaloneBootstrap.boot(EJB3StandaloneBootstrap.java:391)
      	at com.dolby.pics.test.AbstractEJBTestCase.startupEmbeddedJboss(AbstractEJBTestCase.java:63)
      	at com.dolby.pics.test.AbstractEJBTestCase.setUp(AbstractEJBTestCase.java:145)
      	at com.dolby.pics.core.ejb.bean.CountryBeanTestCase.setUp(CountryBeanTestCase.java:43)
      	at junit.framework.TestCase.runBare(TestCase.java:128)
      	at junit.framework.TestResult$1.protect(TestResult.java:110)
      	at junit.framework.TestResult.runProtected(TestResult.java:128)
      	at junit.framework.TestResult.run(TestResult.java:113)
      	at junit.framework.TestCase.run(TestCase.java:120)
      	at junit.framework.TestSuite.runTest(TestSuite.java:228)
      	at junit.framework.TestSuite.run(TestSuite.java:223)
      	at sun.reflect.NativeMethodAccessorImpl.invoke0(Native Method)
      	at sun.reflect.NativeMethodAccessorImpl.invoke(NativeMethodAccessorImpl.java:64)
      	at sun.reflect.DelegatingMethodAccessorImpl.invoke(DelegatingMethodAccessorImpl.java:43)
      	at java.lang.reflect.Method.invoke(Method.java:615)
      	at org.apache.maven.surefire.battery.JUnitBattery.executeJUnit(JUnitBattery.java:242)
      	at org.apache.maven.surefire.battery.JUnitBattery.execute(JUnitBattery.java:216)
      	at org.apache.maven.surefire.Surefire.executeBattery(Surefire.java:215)
      	at org.apache.maven.surefire.Surefire.run(Surefire.java:163)
      	at org.apache.maven.surefire.Surefire.run(Surefire.java:87)
      	at sun.reflect.NativeMethodAccessorImpl.invoke0(Native Method)
      	at sun.reflect.NativeMethodAccessorImpl.invoke(NativeMethodAccessorImpl.java:64)
      	at sun.reflect.DelegatingMethodAccessorImpl.invoke(DelegatingMethodAccessorImpl.java:43)
      	at java.lang.reflect.Method.invoke(Method.java:615)
      	at org.apache.maven.surefire.SurefireBooter.runTestsInProcess(SurefireBooter.java:313)
      	at org.apache.maven.surefire.SurefireBooter.run(SurefireBooter.java:221)
      	at org.apache.maven.test.SurefirePlugin.execute(SurefirePlugin.java:371)
      	at org.apache.maven.plugin.DefaultPluginManager.executeMojo(DefaultPluginManager.java:412)
      	at org.apache.maven.lifecycle.DefaultLifecycleExecutor.executeGoals(DefaultLifecycleExecutor.java:534)
      	at org.apache.maven.lifecycle.DefaultLifecycleExecutor.executeGoalWithLifecycle(DefaultLifecycleExecutor.java:475)
      	at org.apache.maven.lifecycle.DefaultLifecycleExecutor.executeGoal(DefaultLifecycleExecutor.java:454)
      	at org.apache.maven.lifecycle.DefaultLifecycleExecutor.executeGoalAndHandleFailures(DefaultLifecycleExecutor.java:306)
      	at org.apache.maven.lifecycle.DefaultLifecycleExecutor.executeTaskSegments(DefaultLifecycleExecutor.java:273)
      	at org.apache.maven.lifecycle.DefaultLifecycleExecutor.execute(DefaultLifecycleExecutor.java:140)
      	at org.apache.maven.DefaultMaven.doExecute(DefaultMaven.java:322)
      	at org.apache.maven.DefaultMaven.execute(DefaultMaven.java:115)
      	at org.apache.maven.cli.MavenCli.main(MavenCli.java:256)
      	at sun.reflect.NativeMethodAccessorImpl.invoke0(Native Method)
      	at sun.reflect.NativeMethodAccessorImpl.invoke(NativeMethodAccessorImpl.java:64)
      	at sun.reflect.DelegatingMethodAccessorImpl.invoke(DelegatingMethodAccessorImpl.java:43)
      	at java.lang.reflect.Method.invoke(Method.java:615)
      	at org.codehaus.classworlds.Launcher.launchEnhanced(Launcher.java:315)
      	at org.codehaus.classworlds.Launcher.launch(Launcher.java:255)
      	at org.codehaus.classworlds.Launcher.mainWithExitCode(Launcher.java:430)
      	at org.codehaus.classworlds.Launcher.main(Launcher.java:375)
      Caused by: org.jboss.xb.binding.JBossXBRuntimeException: Failed to create a new SAX parser
      	at org.jboss.xb.binding.UnmarshallerFactory$UnmarshallerFactoryImpl.newUnmarshaller(UnmarshallerFactory.java:100)
      	at org.jboss.kernel.plugins.deployment.xml.BeanXMLDeployer.deploy(BeanXMLDeployer.java:84)
      	at org.jboss.ejb3.embedded.EJB3StandaloneBootstrap.boot(EJB3StandaloneBootstrap.java:380)
      	... 44 more
      Caused by: org.jboss.xb.binding.JBossXBException: Failed to create a new SAX parser
      	at org.jboss.xb.binding.parser.sax.SaxJBossXBParser.<init>(SaxJBossXBParser.java:69)
      	at org.jboss.xb.binding.UnmarshallerImpl.<init>(UnmarshallerImpl.java:55)
      	at org.jboss.xb.binding.UnmarshallerFactory$UnmarshallerFactoryImpl.newUnmarshaller(UnmarshallerFactory.java:96)
      	... 46 more
      Caused by: javax.xml.parsers.ParserConfigurationException: validation is not supported
      	at org.gjt.xpp.jaxp11.SAXParserFactoryImpl.newSAXParser(SAXParserFactoryImpl.java:100)
      	at org.jboss.xb.binding.parser.sax.SaxJBossXBParser.<init>(SaxJBossXBParser.java:65)
      	... 48 more
      

      I would guess the problem is regarding something not on the class path when the tests run within release:perform, but I am not sure. This is a eral blocker as we cannot release a working project.

        Issue Links

          Activity

          No work has yet been logged on this issue.

            People

            • Assignee:
              Unassigned
              Reporter:
              Adrian
            • Votes:
              7 Vote for this issue
              Watchers:
              7 Start watching this issue

              Dates

              • Created:
                Updated:

                Development