Uploaded image for project: 'Maven'
  1. Maven
  2. MNG-6488

JDK10 maven surefire commonslang3 SystemUtils.isJavaVersionAtLeast NullPointerException

    Details

    • Type: Bug
    • Status: Closed
    • Priority: Minor
    • Resolution: Invalid
    • Affects Version/s: 3.5.4
    • Fix Version/s: None
    • Component/s: None
    • Labels:
      None
    • Environment:
      Default locale: en_US, platform encoding: UTF-8
      OS name: "linux", version: "4.9.0-8-amd64", arch: "amd64", family: "unix"

      Description

      how to reproduce
      wget https://download.java.net/java/GA/jdk10/10.0.2/19aef61b38124481863b1413dce1855f/13/openjdk-10.0.2_linux-x64_bin.tar.gz
      tar -xzf openjdk-10.0.2_linux-x64_bin.tar.gz
      export JAVA_HOME=$(pwd)/jdk-10.0.2
      export PATH=$JAVA_HOME/bin:$PATH
      
      wget http://www.pirbot.com/mirrors/apache/maven/maven-3/3.5.4/binaries/apache-maven-3.5.4-bin.tar.gz
      tar -xzf apache-maven-3.5.4-bin.tar.gz
      export MVN_HOME=$(pwd)/apache-maven-3.5.4
      export PATH=$MVN_HOME/bin:$PATH
      
      git clone -b maven-3.5.4 https://gitbox.apache.org/repos/asf/maven.git
      cd maven/
      
      mvn clean verify
      

      produces

      failure
      $ mvn --version
      Apache Maven 3.5.4 (1edded0938998edf8bf061f1ceb3cfdeccf443fe; 2018-06-17T20:33:14+02:00)
      Maven home: .../apache-maven-3.5.4
      Java version: 10.0.2, vendor: Oracle Corporation, runtime: .../jdk-10.0.2
      Default locale: en_US, platform encoding: UTF-8
      OS name: "linux", version: "4.9.0-8-amd64", arch: "amd64", family: "unix"
      $ mvn clean verify
      ...
      [INFO] --- maven-compiler-plugin:3.7.0:testCompile (default-testCompile) @ maven-model ---
      [INFO] Changes detected - recompiling the module!
      [INFO] Compiling 37 source files to .../maven/maven-model/target/test-classes
      [INFO] 
      [INFO] --- maven-surefire-plugin:2.20.1:test (default-test) @ maven-model ---
      [INFO] ------------------------------------------------------------------------
      [INFO] Reactor Summary:
      [INFO] 
      [INFO] Apache Maven 3.5.4 ................................. SUCCESS [  2.853 s]
      [INFO] Maven Model ........................................ FAILURE [  2.625 s]
      [INFO] Maven Artifact ..................................... SKIPPED
      [INFO] Maven Plugin API ................................... SKIPPED
      [INFO] Maven Builder Support .............................. SKIPPED
      [INFO] Maven Model Builder ................................ SKIPPED
      [INFO] Maven Settings ..................................... SKIPPED
      [INFO] Maven Settings Builder ............................. SKIPPED
      [INFO] Maven Repository Metadata Model .................... SKIPPED
      [INFO] Maven Artifact Resolver Provider ................... SKIPPED
      [INFO] Maven Core ......................................... SKIPPED
      [INFO] Maven SLF4J Simple Provider ........................ SKIPPED
      [INFO] Maven Embedder ..................................... SKIPPED
      [INFO] Maven Compat ....................................... SKIPPED
      [INFO] Apache Maven Distribution 3.5.4 .................... SKIPPED
      [INFO] ------------------------------------------------------------------------
      [INFO] BUILD FAILURE
      [INFO] ------------------------------------------------------------------------
      [INFO] Total time: 5.749 s
      [INFO] Finished at: 2018-10-06T15:51:51+02:00
      [INFO] ------------------------------------------------------------------------
      [ERROR] Failed to execute goal org.apache.maven.plugins:maven-surefire-plugin:2.20.1:test (default-test) on project maven-model: Execution default-test of goal org.apache.maven.plugins:maven-surefire-plugin:2.20.1:test failed.: NullPointerException -> [Help 1]
      [ERROR] 
      [ERROR] To see the full stack trace of the errors, re-run Maven with the -e switch.
      [ERROR] Re-run Maven using the -X switch to enable full debug logging.
      [ERROR] 
      [ERROR] For more information about the errors and possible solutions, please read the following articles:
      [ERROR] [Help 1] http://cwiki.apache.org/confluence/display/MAVEN/PluginExecutionException
      [ERROR] 
      [ERROR] After correcting the problems, you can resume the build with the command
      [ERROR]   mvn <goals> -rf :maven-model
      

      and with more details

      mvn -X clean verify
      [ERROR] Failed to execute goal org.apache.maven.plugins:maven-surefire-plugin:2.20.1:test (default-test) on project maven-model: Execution default-test of goal org.apache.maven.plugins:maven-surefire-plugin:2.20.1:test failed.: NullPointerException -> [Help 1]
      org.apache.maven.lifecycle.LifecycleExecutionException: Failed to execute goal org.apache.maven.plugins:maven-surefire-plugin:2.20.1:test (default-test) on project maven-model: Execution default-test of goal org.apache.maven.plugins:maven-surefire-plugin:2.20.1:test failed.
          at org.apache.maven.lifecycle.internal.MojoExecutor.execute (MojoExecutor.java:213)
          at org.apache.maven.lifecycle.internal.MojoExecutor.execute (MojoExecutor.java:154)
          at org.apache.maven.lifecycle.internal.MojoExecutor.execute (MojoExecutor.java:146)
          at org.apache.maven.lifecycle.internal.LifecycleModuleBuilder.buildProject (LifecycleModuleBuilder.java:117)
          at org.apache.maven.lifecycle.internal.LifecycleModuleBuilder.buildProject (LifecycleModuleBuilder.java:81)
          at org.apache.maven.lifecycle.internal.builder.singlethreaded.SingleThreadedBuilder.build (SingleThreadedBuilder.java:56)
          at org.apache.maven.lifecycle.internal.LifecycleStarter.execute (LifecycleStarter.java:128)
          at org.apache.maven.DefaultMaven.doExecute (DefaultMaven.java:305)
          at org.apache.maven.DefaultMaven.doExecute (DefaultMaven.java:192)
          at org.apache.maven.DefaultMaven.execute (DefaultMaven.java:105)
          at org.apache.maven.cli.MavenCli.execute (MavenCli.java:954)
          at org.apache.maven.cli.MavenCli.doMain (MavenCli.java:288)
          at org.apache.maven.cli.MavenCli.main (MavenCli.java:192)
          at jdk.internal.reflect.NativeMethodAccessorImpl.invoke0 (Native Method)
          at jdk.internal.reflect.NativeMethodAccessorImpl.invoke (NativeMethodAccessorImpl.java:62)
          at jdk.internal.reflect.DelegatingMethodAccessorImpl.invoke (DelegatingMethodAccessorImpl.java:43)
          at java.lang.reflect.Method.invoke (Method.java:564)
          at org.codehaus.plexus.classworlds.launcher.Launcher.launchEnhanced (Launcher.java:289)
          at org.codehaus.plexus.classworlds.launcher.Launcher.launch (Launcher.java:229)
          at org.codehaus.plexus.classworlds.launcher.Launcher.mainWithExitCode (Launcher.java:415)
          at org.codehaus.plexus.classworlds.launcher.Launcher.main (Launcher.java:356)
      Caused by: org.apache.maven.plugin.PluginExecutionException: Execution default-test of goal org.apache.maven.plugins:maven-surefire-plugin:2.20.1:test failed.
          at org.apache.maven.plugin.DefaultBuildPluginManager.executeMojo (DefaultBuildPluginManager.java:148)
          at org.apache.maven.lifecycle.internal.MojoExecutor.execute (MojoExecutor.java:208)
          at org.apache.maven.lifecycle.internal.MojoExecutor.execute (MojoExecutor.java:154)
          at org.apache.maven.lifecycle.internal.MojoExecutor.execute (MojoExecutor.java:146)
          at org.apache.maven.lifecycle.internal.LifecycleModuleBuilder.buildProject (LifecycleModuleBuilder.java:117)
          at org.apache.maven.lifecycle.internal.LifecycleModuleBuilder.buildProject (LifecycleModuleBuilder.java:81)
          at org.apache.maven.lifecycle.internal.builder.singlethreaded.SingleThreadedBuilder.build (SingleThreadedBuilder.java:56)
          at org.apache.maven.lifecycle.internal.LifecycleStarter.execute (LifecycleStarter.java:128)
          at org.apache.maven.DefaultMaven.doExecute (DefaultMaven.java:305)
          at org.apache.maven.DefaultMaven.doExecute (DefaultMaven.java:192)
          at org.apache.maven.DefaultMaven.execute (DefaultMaven.java:105)
          at org.apache.maven.cli.MavenCli.execute (MavenCli.java:954)
          at org.apache.maven.cli.MavenCli.doMain (MavenCli.java:288)
          at org.apache.maven.cli.MavenCli.main (MavenCli.java:192)
          at jdk.internal.reflect.NativeMethodAccessorImpl.invoke0 (Native Method)
          at jdk.internal.reflect.NativeMethodAccessorImpl.invoke (NativeMethodAccessorImpl.java:62)
          at jdk.internal.reflect.DelegatingMethodAccessorImpl.invoke (DelegatingMethodAccessorImpl.java:43)
          at java.lang.reflect.Method.invoke (Method.java:564)
          at org.codehaus.plexus.classworlds.launcher.Launcher.launchEnhanced (Launcher.java:289)
          at org.codehaus.plexus.classworlds.launcher.Launcher.launch (Launcher.java:229)
          at org.codehaus.plexus.classworlds.launcher.Launcher.mainWithExitCode (Launcher.java:415)
          at org.codehaus.plexus.classworlds.launcher.Launcher.main (Launcher.java:356)
      Caused by: java.lang.NullPointerException
          at org.apache.maven.surefire.shade.org.apache.commons.lang3.SystemUtils.isJavaVersionAtLeast (SystemUtils.java:1626)
          at org.apache.maven.plugin.surefire.AbstractSurefireMojo.getEffectiveJvm (AbstractSurefireMojo.java:2107)
          at org.apache.maven.plugin.surefire.AbstractSurefireMojo.getForkConfiguration (AbstractSurefireMojo.java:1976)
          at org.apache.maven.plugin.surefire.AbstractSurefireMojo.executeProvider (AbstractSurefireMojo.java:1111)
          at org.apache.maven.plugin.surefire.AbstractSurefireMojo.executeAfterPreconditionsChecked (AbstractSurefireMojo.java:954)
          at org.apache.maven.plugin.surefire.AbstractSurefireMojo.execute (AbstractSurefireMojo.java:832)
          at org.apache.maven.plugin.DefaultBuildPluginManager.executeMojo (DefaultBuildPluginManager.java:137)
          at org.apache.maven.lifecycle.internal.MojoExecutor.execute (MojoExecutor.java:208)
          at org.apache.maven.lifecycle.internal.MojoExecutor.execute (MojoExecutor.java:154)
          at org.apache.maven.lifecycle.internal.MojoExecutor.execute (MojoExecutor.java:146)
          at org.apache.maven.lifecycle.internal.LifecycleModuleBuilder.buildProject (LifecycleModuleBuilder.java:117)
          at org.apache.maven.lifecycle.internal.LifecycleModuleBuilder.buildProject (LifecycleModuleBuilder.java:81)
          at org.apache.maven.lifecycle.internal.builder.singlethreaded.SingleThreadedBuilder.build (SingleThreadedBuilder.java:56)
          at org.apache.maven.lifecycle.internal.LifecycleStarter.execute (LifecycleStarter.java:128)
          at org.apache.maven.DefaultMaven.doExecute (DefaultMaven.java:305)
          at org.apache.maven.DefaultMaven.doExecute (DefaultMaven.java:192)
          at org.apache.maven.DefaultMaven.execute (DefaultMaven.java:105)
          at org.apache.maven.cli.MavenCli.execute (MavenCli.java:954)
          at org.apache.maven.cli.MavenCli.doMain (MavenCli.java:288)
          at org.apache.maven.cli.MavenCli.main (MavenCli.java:192)
          at jdk.internal.reflect.NativeMethodAccessorImpl.invoke0 (Native Method)
          at jdk.internal.reflect.NativeMethodAccessorImpl.invoke (NativeMethodAccessorImpl.java:62)
          at jdk.internal.reflect.DelegatingMethodAccessorImpl.invoke (DelegatingMethodAccessorImpl.java:43)
          at java.lang.reflect.Method.invoke (Method.java:564)
          at org.codehaus.plexus.classworlds.launcher.Launcher.launchEnhanced (Launcher.java:289)
          at org.codehaus.plexus.classworlds.launcher.Launcher.launch (Launcher.java:229)
          at org.codehaus.plexus.classworlds.launcher.Launcher.mainWithExitCode (Launcher.java:415)
          at org.codehaus.plexus.classworlds.launcher.Launcher.main (Launcher.java:356)
      

      I figure it is supposed to support JDK10 or do so sooner or later based on https://maven.apache.org/download.cgi

      Java Development Kit (JDK) - Maven 3.3+ require JDK 1.7 or above to execute

      it works with jdk9 from https://download.java.net/java/GA/jdk9/9.0.4/binaries/openjdk-9.0.4_linux-x64_bin.tar.gz

        Attachments

        1. MNG-6488.patch
          0.5 kB
          Philipp Kunz

          Issue Links

            Activity

              People

              • Assignee:
                khmarbaise Karl Heinz Marbaise
                Reporter:
                philipp.kunz@paratix.ch Philipp Kunz
              • Votes:
                0 Vote for this issue
                Watchers:
                3 Start watching this issue

                Dates

                • Created:
                  Updated:
                  Resolved: