Uploaded image for project: 'Apache NiFi MiNiFi'
  1. Apache NiFi MiNiFi
  2. MINIFI-522

Fixed Access denied to: http://jcenter.bintray.com which caused Failed to execute goal on project minifi-standard-nar

    XMLWordPrintableJSON

    Details

    • Type: Bug
    • Status: Resolved
    • Priority: Blocker
    • Resolution: Fixed
    • Affects Version/s: None
    • Fix Version/s: 0.6.0
    • Component/s: None
    • Labels:
      None

      Description

      mvn clean install 

      throws below error

      [INFO] minifi-update-attribute-nar ........................ SUCCESS [  0.326 s]
      [INFO] minifi-standard-nar ................................ FAILURE [  1.198 s]
      [INFO] minifi-ssl-context-service-nar ..................... SKIPPED
      [INFO] minifi-docs ........................................ SKIPPED
      [INFO] minifi-assembly .................................... SKIPPED
      [INFO] minifi-toolkit ..................................... SKIPPED
      [INFO] minifi-toolkit-configuration ....................... SKIPPED
      [INFO] minifi-toolkit-assembly ............................ SKIPPED
      [INFO] minifi-docker ...................................... SKIPPED
      [INFO] minifi-c2 .......................................... SKIPPED
      [INFO] minifi-c2-api ...................................... SKIPPED
      [INFO] minifi-c2-cache .................................... SKIPPED
      [INFO] minifi-c2-cache-filesystem ......................... SKIPPED
      [INFO] minifi-c2-cache-s3 ................................. SKIPPED
      [INFO] minifi-c2-provider ................................. SKIPPED
      [INFO] minifi-c2-provider-util ............................ SKIPPED
      [INFO] minifi-c2-provider-cache ........................... SKIPPED
      [INFO] minifi-c2-provider-delegating ...................... SKIPPED
      [INFO] minifi-c2-provider-nifi-rest ....................... SKIPPED
      [INFO] minifi-c2-service .................................. SKIPPED
      [INFO] minifi-c2-jetty .................................... SKIPPED
      [INFO] minifi-c2-assembly ................................. SKIPPED
      [INFO] minifi-c2-docker ................................... SKIPPED
      [INFO] minifi-c2-integration-tests ........................ SKIPPED
      [INFO] minifi-integration-tests ........................... SKIPPED
      [INFO] ------------------------------------------------------------------------
      [INFO] BUILD FAILURE
      [INFO] ------------------------------------------------------------------------
      [INFO] Total time:  29.209 s
      [INFO] Finished at: 2020-01-14T14:02:00-08:00
      [INFO] ------------------------------------------------------------------------
      [ERROR] Failed to execute goal on project minifi-standard-nar: Could not resolve dependencies for project org.apache.nifi.minifi:minifi-standard-nar:nar:0.6.0-SNAPSHOT: Failed to collect dependencies at org.apache.nifi:nifi-standard-processors:jar:1.8.0 -> org.apache.nifi:nifi-syslog-utils:jar:1.8.0 -> com.github.palindromicity:simple-syslog-5424:jar:0.0.8: Failed to read artifact descriptor for com.github.palindromicity:simple-syslog-5424:jar:0.0.8: Could not transfer artifact com.github.palindromicity:simple-syslog-5424:pom:0.0.8 from/to jcenter (http://jcenter.bintray.com): Access denied to: http://jcenter.bintray.com/com/github/palindromicity/simple-syslog-5424/0.0.8/simple-syslog-5424-0.0.8.pom -> [Help 1]
       

       

      From Jan13th : 2020 , access to jcenter.bintray.com is only allowed over https protocol (previously it use to support http and https).

        Attachments

          Issue Links

            Activity

              People

              • Assignee:
                samin sapinkumar amin
                Reporter:
                samin sapinkumar amin
              • Votes:
                0 Vote for this issue
                Watchers:
                1 Start watching this issue

                Dates

                • Created:
                  Updated:
                  Resolved:

                  Time Tracking

                  Estimated:
                  Original Estimate - Not Specified
                  Not Specified
                  Remaining:
                  Remaining Estimate - 0h
                  0h
                  Logged:
                  Time Spent - 0.5h
                  0.5h