Uploaded image for project: 'Metron'
  1. Metron
  2. METRON-2254

Intermittent Test Failure in RestFunctionsIntegrationTest

    XMLWordPrintableJSON

    Details

    • Type: Bug
    • Status: Done
    • Priority: Major
    • Resolution: Done
    • Affects Version/s: None
    • Fix Version/s: Next + 1
    • Labels:
      None

      Description

      Tests run: 21, Failures: 1, Errors: 0, Skipped: 0, Time elapsed: 12.368 sec <<< FAILURE! - in org.apache.metron.stellar.dsl.functions.RestFunctionsIntegrationTest
      restGetShouldTimeoutWithSuppliedTimeout(org.apache.metron.stellar.dsl.functions.RestFunctionsIntegrationTest)  Time elapsed: 0.349 sec  <<< FAILURE!
      java.lang.AssertionError: expected null, but was:<{get=success}>
      	at org.junit.Assert.fail(Assert.java:88)
      	at org.junit.Assert.failNotNull(Assert.java:755)
      	at org.junit.Assert.assertNull(Assert.java:737)
      	at org.junit.Assert.assertNull(Assert.java:747)
      	at org.apache.metron.stellar.dsl.functions.RestFunctionsIntegrationTest.restGetShouldTimeoutWithSuppliedTimeout(RestFunctionsIntegrationTest.java:279)
      	at sun.reflect.NativeMethodAccessorImpl.invoke0(Native Method)
      	at sun.reflect.NativeMethodAccessorImpl.invoke(NativeMethodAccessorImpl.java:62)
      	at sun.reflect.DelegatingMethodAccessorImpl.invoke(DelegatingMethodAccessorImpl.java:43)
      	at java.lang.reflect.Method.invoke(Method.java:498)
      	at org.junit.runners.model.FrameworkMethod$1.runReflectiveCall(FrameworkMethod.java:50)
      	at org.junit.internal.runners.model.ReflectiveCallable.run(ReflectiveCallable.java:12)
      	at org.junit.runners.model.FrameworkMethod.invokeExplosively(FrameworkMethod.java:47)
      	at org.junit.internal.runners.statements.InvokeMethod.evaluate(InvokeMethod.java:17)
      	at org.junit.internal.runners.statements.RunBefores.evaluate(RunBefores.java:26)
      	at org.mockserver.junit.MockServerRule$1.evaluate(MockServerRule.java:107)
      	at org.mockserver.junit.ProxyRule$1.evaluate(ProxyRule.java:102)
      	at org.junit.rules.ExternalResource$1.evaluate(ExternalResource.java:48)
      	at org.junit.rules.ExpectedException$ExpectedExceptionStatement.evaluate(ExpectedException.java:239)
      	at org.junit.rules.RunRules.evaluate(RunRules.java:20)
      	at org.junit.runners.ParentRunner.runLeaf(ParentRunner.java:325)
      	at org.junit.runners.BlockJUnit4ClassRunner.runChild(BlockJUnit4ClassRunner.java:78)
      	at org.junit.runners.BlockJUnit4ClassRunner.runChild(BlockJUnit4ClassRunner.java:57)
      	at org.junit.runners.ParentRunner$3.run(ParentRunner.java:290)
      	at org.junit.runners.ParentRunner$1.schedule(ParentRunner.java:71)
      	at org.junit.runners.ParentRunner.runChildren(ParentRunner.java:288)
      	at org.junit.runners.ParentRunner.access$000(ParentRunner.java:58)
      	at org.junit.runners.ParentRunner$2.evaluate(ParentRunner.java:268)
      	at org.junit.runners.ParentRunner.run(ParentRunner.java:363)
      	at org.apache.maven.surefire.junit4.JUnit4Provider.execute(JUnit4Provider.java:283)
      	at org.apache.maven.surefire.junit4.JUnit4Provider.executeWithRerun(JUnit4Provider.java:173)
      	at org.apache.maven.surefire.junit4.JUnit4Provider.executeTestSet(JUnit4Provider.java:153)
      	at org.apache.maven.surefire.junit4.JUnit4Provider.invoke(JUnit4Provider.java:128)
      	at org.apache.maven.surefire.booter.ForkedBooter.invokeProviderInSameClassLoader(ForkedBooter.java:203)
      	at org.apache.maven.surefire.booter.ForkedBooter.runSuitesInProcess(ForkedBooter.java:155)
      	at org.apache.maven.surefire.booter.ForkedBooter.main(ForkedBooter.java:103)
      
      
      Results :
      
      Failed tests: 
        RestFunctionsIntegrationTest.restGetShouldTimeoutWithSuppliedTimeout:279 expected null, but was:<{get=success}>
      
      

        Attachments

          Issue Links

            Activity

              People

              • Assignee:
                nickwallen Nick Allen
                Reporter:
                nickwallen Nick Allen
              • Votes:
                0 Vote for this issue
                Watchers:
                1 Start watching this issue

                Dates

                • Created:
                  Updated:
                  Resolved:

                  Time Tracking

                  Estimated:
                  Original Estimate - Not Specified
                  Not Specified
                  Remaining:
                  Remaining Estimate - 0h
                  0h
                  Logged:
                  Time Spent - 0.5h
                  0.5h