Uploaded image for project: 'Hadoop Map/Reduce'
  1. Hadoop Map/Reduce
  2. MAPREDUCE-7269

TestNetworkedJob fails

    XMLWordPrintableJSON

    Details

    • Type: Bug
    • Status: Resolved
    • Priority: Major
    • Resolution: Fixed
    • Affects Version/s: None
    • Fix Version/s: 3.3.0
    • Component/s: test
    • Labels:
      None
    • Target Version/s:

      Description

      https://builds.apache.org/job/hadoop-qbt-trunk-java8-linux-x86/1460/artifact/out/patch-unit-hadoop-mapreduce-project_hadoop-mapreduce-client_hadoop-mapreduce-client-jobclient.txt

      [INFO] Running org.apache.hadoop.mapred.TestNetworkedJob
      [ERROR] Tests run: 5, Failures: 1, Errors: 0, Skipped: 0, Time elapsed: 20.981 s <<< FAILURE! - in org.apache.hadoop.mapred.TestNetworkedJob
      [ERROR] testNetworkedJob(org.apache.hadoop.mapred.TestNetworkedJob)  Time elapsed: 4.588 s  <<< FAILURE!
      org.junit.ComparisonFailure: expected:<[]default> but was:<[root.]default>
      	at org.junit.Assert.assertEquals(Assert.java:115)
      	at org.junit.Assert.assertEquals(Assert.java:144)
      	at org.apache.hadoop.mapred.TestNetworkedJob.testNetworkedJob(TestNetworkedJob.java:250)
      	at sun.reflect.NativeMethodAccessorImpl.invoke0(Native Method)
      	at sun.reflect.NativeMethodAccessorImpl.invoke(NativeMethodAccessorImpl.java:62)
      	at sun.reflect.DelegatingMethodAccessorImpl.invoke(DelegatingMethodAccessorImpl.java:43)
      	at java.lang.reflect.Method.invoke(Method.java:498)
      	at org.junit.runners.model.FrameworkMethod$1.runReflectiveCall(FrameworkMethod.java:50)
      	at org.junit.internal.runners.model.ReflectiveCallable.run(ReflectiveCallable.java:12)
      	at org.junit.runners.model.FrameworkMethod.invokeExplosively(FrameworkMethod.java:47)
      	at org.junit.internal.runners.statements.InvokeMethod.evaluate(InvokeMethod.java:17)
      	at org.junit.internal.runners.statements.FailOnTimeout$CallableStatement.call(FailOnTimeout.java:298)
      	at org.junit.internal.runners.statements.FailOnTimeout$CallableStatement.call(FailOnTimeout.java:292)
      	at java.util.concurrent.FutureTask.run(FutureTask.java:266)
      	at java.lang.Thread.run(Thread.java:748)
      

        Attachments

          Issue Links

            Activity

              People

              • Assignee:
                aajisaka Akira Ajisaka
                Reporter:
                aajisaka Akira Ajisaka
              • Votes:
                0 Vote for this issue
                Watchers:
                4 Start watching this issue

                Dates

                • Created:
                  Updated:
                  Resolved: