Details

    • Type: Test
    • Status: Resolved
    • Priority: Major
    • Resolution: Fixed
    • Affects Version/s: None
    • Fix Version/s: 3.2.0, 3.1.1
    • Component/s: test
    • Labels:
      None
    • Environment:
    • Hadoop Flags:
      Reviewed

      Description

      [INFO] Running org.apache.hadoop.mapred.TestQueue
      [ERROR] Tests run: 1, Failures: 1, Errors: 0, Skipped: 0, Time elapsed: 1.353 s <<< FAILURE! - in org.apache.hadoop.mapred.TestQueue
      [ERROR] testQueue(org.apache.hadoop.mapred.TestQueue)  Time elapsed: 1.186 s  <<< FAILURE!
      org.junit.ComparisonFailure: expected:<...roperties":[{"key":"[capacity","value":"20"},{"key":"user-limit","value":"3]0"}],"children":[]}]...> but was:<...roperties":[{"key":"[user-limit","value":"30"},{"key":"capacity","value":"2]0"}],"children":[]}]...>
      	at org.junit.Assert.assertEquals(Assert.java:115)
      	at org.junit.Assert.assertEquals(Assert.java:144)
      	at org.apache.hadoop.mapred.TestQueue.testQueue(TestQueue.java:156)
      	at java.base/jdk.internal.reflect.NativeMethodAccessorImpl.invoke0(Native Method)
      	at java.base/jdk.internal.reflect.NativeMethodAccessorImpl.invoke(NativeMethodAccessorImpl.java:62)
      	at java.base/jdk.internal.reflect.DelegatingMethodAccessorImpl.invoke(DelegatingMethodAccessorImpl.java:43)
      	at java.base/java.lang.reflect.Method.invoke(Method.java:564)
      	at org.junit.runners.model.FrameworkMethod$1.runReflectiveCall(FrameworkMethod.java:47)
      	at org.junit.internal.runners.model.ReflectiveCallable.run(ReflectiveCallable.java:12)
      	at org.junit.runners.model.FrameworkMethod.invokeExplosively(FrameworkMethod.java:44)
      	at org.junit.internal.runners.statements.InvokeMethod.evaluate(InvokeMethod.java:17)
      	at org.junit.internal.runners.statements.FailOnTimeout$StatementThread.run(FailOnTimeout.java:74)
      
      

        Attachments

          Issue Links

            Activity

              People

              • Assignee:
                tasanuma0829 Takanobu Asanuma
                Reporter:
                tasanuma0829 Takanobu Asanuma
              • Votes:
                0 Vote for this issue
                Watchers:
                4 Start watching this issue

                Dates

                • Created:
                  Updated:
                  Resolved: