Uploaded image for project: 'Hadoop Map/Reduce'
  1. Hadoop Map/Reduce
  2. MAPREDUCE-4571

TestHsWebServicesJobs fails on jdk7

    XMLWordPrintableJSON

    Details

    • Type: Bug
    • Status: Closed
    • Priority: Major
    • Resolution: Fixed
    • Affects Version/s: 0.23.3, 2.0.2-alpha, 3.0.0-alpha1
    • Fix Version/s: 2.1.0-beta, 0.23.10
    • Component/s: webapps
    • Labels:
    • Target Version/s:
    • Hadoop Flags:
      Reviewed

      Description

      TestHsWebServicesJobs fails on jdk7.

      Tests run: 22, Failures: 1, Errors: 0, Skipped: 0, Time elapsed: 7.561 sec <<< FAILURE!testJobIdSlash(org.apache.hadoop.mapreduce.v2.hs.webapp.TestHsWebServicesJobs) Time elapsed: 0.334 sec <<< FAILURE!
      java.lang.AssertionError: mapsTotal incorrect expected:<0> but was:<1>

        Attachments

        1. MAPREDUCE-4571.patch
          5 kB
          Thomas Graves

          Activity

            People

            • Assignee:
              tgraves Thomas Graves
              Reporter:
              tgraves Thomas Graves
            • Votes:
              0 Vote for this issue
              Watchers:
              6 Start watching this issue

              Dates

              • Created:
                Updated:
                Resolved: