Hadoop Map/Reduce
  1. Hadoop Map/Reduce
  2. MAPREDUCE-3437

Branch 23 fails to build with Failure to find org.apache.hadoop:hadoop-project:pom:0.24.0-SNAPSHOT

    Details

    • Type: Bug Bug
    • Status: Closed
    • Priority: Blocker Blocker
    • Resolution: Fixed
    • Affects Version/s: 0.23.1
    • Fix Version/s: 0.23.1
    • Component/s: build, mrv2
    • Labels:
      None
    • Target Version/s:
    • Hadoop Flags:
      Reviewed

      Description

      [INFO] Scanning for projects...
      [ERROR] The build could not read 1 project -> [Help 1]
      [ERROR]
      [ERROR] The project org.apache.hadoop:hadoop-mapreduce-examples:0.24.0-SNAPSHOT (/home/jeagles/hadoop/trunk/hadoop-mapreduce-project/hadoop-mapreduce-examples/pom.xml) has 1 error
      [ERROR] Non-resolvable parent POM: Failure to find org.apache.hadoop:hadoop-project:pom:0.24.0-SNAPSHOT in http://stormwalk.champ.corp.yahoo.com:8081/nexus/content/groups/public was cached in the local repository, resolution will not be reattempted until the update interval of nexus has elapsed or updates are forced and 'parent.relativePath' points at wrong local POM @ line 17, column 11 -> [Help 2]
      [ERROR]
      [ERROR] To see the full stack trace of the errors, re-run Maven with the -e switch.
      [ERROR] Re-run Maven using the -X switch to enable full debug logging.
      [ERROR]
      [ERROR] For more information about the errors and possible solutions, please read the following articles:
      [ERROR] [Help 1] http://cwiki.apache.org/confluence/display/MAVEN/ProjectBuildingException
      [ERROR] [Help 2] http://cwiki.apache.org/confluence/display/MAVEN/UnresolvableModelException

        Activity

        Hide
        Hudson added a comment -

        Integrated in Hadoop-Hdfs-0.23-Build #83 (See https://builds.apache.org/job/Hadoop-Hdfs-0.23-Build/83/)
        MAPREDUCE-3437. Fix examples pom to refer to the correct 0.23 snapshot version. Contributed by Jonathan Eagles.

        todd : http://svn.apache.org/viewcvs.cgi/?root=Apache-SVN&view=rev&rev=1204368
        Files :

        • /hadoop/common/branches/branch-0.23/hadoop-mapreduce-project/CHANGES.txt
        • /hadoop/common/branches/branch-0.23/hadoop-mapreduce-project/hadoop-mapreduce-examples/pom.xml
        Show
        Hudson added a comment - Integrated in Hadoop-Hdfs-0.23-Build #83 (See https://builds.apache.org/job/Hadoop-Hdfs-0.23-Build/83/ ) MAPREDUCE-3437 . Fix examples pom to refer to the correct 0.23 snapshot version. Contributed by Jonathan Eagles. todd : http://svn.apache.org/viewcvs.cgi/?root=Apache-SVN&view=rev&rev=1204368 Files : /hadoop/common/branches/branch-0.23/hadoop-mapreduce-project/CHANGES.txt /hadoop/common/branches/branch-0.23/hadoop-mapreduce-project/hadoop-mapreduce-examples/pom.xml
        Hide
        Hudson added a comment -

        Integrated in Hadoop-Mapreduce-0.23-Build #100 (See https://builds.apache.org/job/Hadoop-Mapreduce-0.23-Build/100/)
        MAPREDUCE-3437. Fix examples pom to refer to the correct 0.23 snapshot version. Contributed by Jonathan Eagles.

        todd : http://svn.apache.org/viewcvs.cgi/?root=Apache-SVN&view=rev&rev=1204368
        Files :

        • /hadoop/common/branches/branch-0.23/hadoop-mapreduce-project/CHANGES.txt
        • /hadoop/common/branches/branch-0.23/hadoop-mapreduce-project/hadoop-mapreduce-examples/pom.xml
        Show
        Hudson added a comment - Integrated in Hadoop-Mapreduce-0.23-Build #100 (See https://builds.apache.org/job/Hadoop-Mapreduce-0.23-Build/100/ ) MAPREDUCE-3437 . Fix examples pom to refer to the correct 0.23 snapshot version. Contributed by Jonathan Eagles. todd : http://svn.apache.org/viewcvs.cgi/?root=Apache-SVN&view=rev&rev=1204368 Files : /hadoop/common/branches/branch-0.23/hadoop-mapreduce-project/CHANGES.txt /hadoop/common/branches/branch-0.23/hadoop-mapreduce-project/hadoop-mapreduce-examples/pom.xml
        Hide
        Hudson added a comment -

        Integrated in Hadoop-Mapreduce-0.23-Commit #202 (See https://builds.apache.org/job/Hadoop-Mapreduce-0.23-Commit/202/)
        MAPREDUCE-3437. Fix examples pom to refer to the correct 0.23 snapshot version. Contributed by Jonathan Eagles.

        todd : http://svn.apache.org/viewcvs.cgi/?root=Apache-SVN&view=rev&rev=1204368
        Files :

        • /hadoop/common/branches/branch-0.23/hadoop-mapreduce-project/CHANGES.txt
        • /hadoop/common/branches/branch-0.23/hadoop-mapreduce-project/hadoop-mapreduce-examples/pom.xml
        Show
        Hudson added a comment - Integrated in Hadoop-Mapreduce-0.23-Commit #202 (See https://builds.apache.org/job/Hadoop-Mapreduce-0.23-Commit/202/ ) MAPREDUCE-3437 . Fix examples pom to refer to the correct 0.23 snapshot version. Contributed by Jonathan Eagles. todd : http://svn.apache.org/viewcvs.cgi/?root=Apache-SVN&view=rev&rev=1204368 Files : /hadoop/common/branches/branch-0.23/hadoop-mapreduce-project/CHANGES.txt /hadoop/common/branches/branch-0.23/hadoop-mapreduce-project/hadoop-mapreduce-examples/pom.xml
        Hide
        Hudson added a comment -

        Integrated in Hadoop-Hdfs-0.23-Commit #189 (See https://builds.apache.org/job/Hadoop-Hdfs-0.23-Commit/189/)
        MAPREDUCE-3437. Fix examples pom to refer to the correct 0.23 snapshot version. Contributed by Jonathan Eagles.

        todd : http://svn.apache.org/viewcvs.cgi/?root=Apache-SVN&view=rev&rev=1204368
        Files :

        • /hadoop/common/branches/branch-0.23/hadoop-mapreduce-project/CHANGES.txt
        • /hadoop/common/branches/branch-0.23/hadoop-mapreduce-project/hadoop-mapreduce-examples/pom.xml
        Show
        Hudson added a comment - Integrated in Hadoop-Hdfs-0.23-Commit #189 (See https://builds.apache.org/job/Hadoop-Hdfs-0.23-Commit/189/ ) MAPREDUCE-3437 . Fix examples pom to refer to the correct 0.23 snapshot version. Contributed by Jonathan Eagles. todd : http://svn.apache.org/viewcvs.cgi/?root=Apache-SVN&view=rev&rev=1204368 Files : /hadoop/common/branches/branch-0.23/hadoop-mapreduce-project/CHANGES.txt /hadoop/common/branches/branch-0.23/hadoop-mapreduce-project/hadoop-mapreduce-examples/pom.xml
        Hide
        Hudson added a comment -

        Integrated in Hadoop-Common-0.23-Commit #191 (See https://builds.apache.org/job/Hadoop-Common-0.23-Commit/191/)
        MAPREDUCE-3437. Fix examples pom to refer to the correct 0.23 snapshot version. Contributed by Jonathan Eagles.

        todd : http://svn.apache.org/viewcvs.cgi/?root=Apache-SVN&view=rev&rev=1204368
        Files :

        • /hadoop/common/branches/branch-0.23/hadoop-mapreduce-project/CHANGES.txt
        • /hadoop/common/branches/branch-0.23/hadoop-mapreduce-project/hadoop-mapreduce-examples/pom.xml
        Show
        Hudson added a comment - Integrated in Hadoop-Common-0.23-Commit #191 (See https://builds.apache.org/job/Hadoop-Common-0.23-Commit/191/ ) MAPREDUCE-3437 . Fix examples pom to refer to the correct 0.23 snapshot version. Contributed by Jonathan Eagles. todd : http://svn.apache.org/viewcvs.cgi/?root=Apache-SVN&view=rev&rev=1204368 Files : /hadoop/common/branches/branch-0.23/hadoop-mapreduce-project/CHANGES.txt /hadoop/common/branches/branch-0.23/hadoop-mapreduce-project/hadoop-mapreduce-examples/pom.xml
        Hide
        Todd Lipcon added a comment -

        Committed to branch-0.23

        Show
        Todd Lipcon added a comment - Committed to branch-0.23
        Hide
        Todd Lipcon added a comment -

        +1, thanks Jonathan.

        Show
        Todd Lipcon added a comment - +1, thanks Jonathan.
        Hide
        Hadoop QA added a comment -

        -1 overall. Here are the results of testing the latest attachment
        http://issues.apache.org/jira/secure/attachment/12504371/MAPREDUCE-3437-branch-0.23.patch
        against trunk revision .

        +1 @author. The patch does not contain any @author tags.

        -1 tests included. The patch doesn't appear to include any new or modified tests.
        Please justify why no new tests are needed for this patch.
        Also please list what manual steps were performed to verify this patch.

        +1 javadoc. The javadoc tool did not generate any warning messages.

        +1 javac. The applied patch does not increase the total number of javac compiler warnings.

        -1 findbugs. The patch appears to introduce 12 new Findbugs (version 1.3.9) warnings.

        +1 release audit. The applied patch does not increase the total number of release audit warnings.

        -1 core tests. The patch failed these unit tests:
        org.apache.hadoop.mapreduce.v2.TestMRJobs
        org.apache.hadoop.mapred.TestMiniMRClientCluster
        org.apache.hadoop.mapred.TestClientRedirect
        org.apache.hadoop.mapreduce.v2.TestUberAM

        +1 contrib tests. The patch passed contrib unit tests.

        Test results: https://builds.apache.org/job/PreCommit-MAPREDUCE-Build/1329//testReport/
        Findbugs warnings: https://builds.apache.org/job/PreCommit-MAPREDUCE-Build/1329//artifact/trunk/hadoop-mapreduce-project/patchprocess/newPatchFindbugsWarningshadoop-mapreduce-examples.html
        Console output: https://builds.apache.org/job/PreCommit-MAPREDUCE-Build/1329//console

        This message is automatically generated.

        Show
        Hadoop QA added a comment - -1 overall. Here are the results of testing the latest attachment http://issues.apache.org/jira/secure/attachment/12504371/MAPREDUCE-3437-branch-0.23.patch against trunk revision . +1 @author. The patch does not contain any @author tags. -1 tests included. The patch doesn't appear to include any new or modified tests. Please justify why no new tests are needed for this patch. Also please list what manual steps were performed to verify this patch. +1 javadoc. The javadoc tool did not generate any warning messages. +1 javac. The applied patch does not increase the total number of javac compiler warnings. -1 findbugs. The patch appears to introduce 12 new Findbugs (version 1.3.9) warnings. +1 release audit. The applied patch does not increase the total number of release audit warnings. -1 core tests. The patch failed these unit tests: org.apache.hadoop.mapreduce.v2.TestMRJobs org.apache.hadoop.mapred.TestMiniMRClientCluster org.apache.hadoop.mapred.TestClientRedirect org.apache.hadoop.mapreduce.v2.TestUberAM +1 contrib tests. The patch passed contrib unit tests. Test results: https://builds.apache.org/job/PreCommit-MAPREDUCE-Build/1329//testReport/ Findbugs warnings: https://builds.apache.org/job/PreCommit-MAPREDUCE-Build/1329//artifact/trunk/hadoop-mapreduce-project/patchprocess/newPatchFindbugsWarningshadoop-mapreduce-examples.html Console output: https://builds.apache.org/job/PreCommit-MAPREDUCE-Build/1329//console This message is automatically generated.
        Hide
        Hadoop QA added a comment -

        -1 overall. Here are the results of testing the latest attachment
        http://issues.apache.org/jira/secure/attachment/12504375/MAPREDUCE-3437.patch
        against trunk revision .

        +1 @author. The patch does not contain any @author tags.

        -1 tests included. The patch doesn't appear to include any new or modified tests.
        Please justify why no new tests are needed for this patch.
        Also please list what manual steps were performed to verify this patch.

        +1 javadoc. The javadoc tool did not generate any warning messages.

        +1 javac. The applied patch does not increase the total number of javac compiler warnings.

        -1 findbugs. The patch appears to introduce 12 new Findbugs (version 1.3.9) warnings.

        +1 release audit. The applied patch does not increase the total number of release audit warnings.

        -1 core tests. The patch failed these unit tests:
        org.apache.hadoop.mapreduce.v2.TestMRJobs
        org.apache.hadoop.mapred.TestMiniMRClientCluster
        org.apache.hadoop.mapred.TestClientRedirect
        org.apache.hadoop.mapreduce.v2.TestUberAM

        +1 contrib tests. The patch passed contrib unit tests.

        Test results: https://builds.apache.org/job/PreCommit-MAPREDUCE-Build/1328//testReport/
        Findbugs warnings: https://builds.apache.org/job/PreCommit-MAPREDUCE-Build/1328//artifact/trunk/hadoop-mapreduce-project/patchprocess/newPatchFindbugsWarningshadoop-mapreduce-examples.html
        Console output: https://builds.apache.org/job/PreCommit-MAPREDUCE-Build/1328//console

        This message is automatically generated.

        Show
        Hadoop QA added a comment - -1 overall. Here are the results of testing the latest attachment http://issues.apache.org/jira/secure/attachment/12504375/MAPREDUCE-3437.patch against trunk revision . +1 @author. The patch does not contain any @author tags. -1 tests included. The patch doesn't appear to include any new or modified tests. Please justify why no new tests are needed for this patch. Also please list what manual steps were performed to verify this patch. +1 javadoc. The javadoc tool did not generate any warning messages. +1 javac. The applied patch does not increase the total number of javac compiler warnings. -1 findbugs. The patch appears to introduce 12 new Findbugs (version 1.3.9) warnings. +1 release audit. The applied patch does not increase the total number of release audit warnings. -1 core tests. The patch failed these unit tests: org.apache.hadoop.mapreduce.v2.TestMRJobs org.apache.hadoop.mapred.TestMiniMRClientCluster org.apache.hadoop.mapred.TestClientRedirect org.apache.hadoop.mapreduce.v2.TestUberAM +1 contrib tests. The patch passed contrib unit tests. Test results: https://builds.apache.org/job/PreCommit-MAPREDUCE-Build/1328//testReport/ Findbugs warnings: https://builds.apache.org/job/PreCommit-MAPREDUCE-Build/1328//artifact/trunk/hadoop-mapreduce-project/patchprocess/newPatchFindbugsWarningshadoop-mapreduce-examples.html Console output: https://builds.apache.org/job/PreCommit-MAPREDUCE-Build/1328//console This message is automatically generated.
        Hide
        Hadoop QA added a comment -

        -1 overall. Here are the results of testing the latest attachment
        http://issues.apache.org/jira/secure/attachment/12504372/MAPREDUCE-3437.patch
        against trunk revision .

        +1 @author. The patch does not contain any @author tags.

        -1 tests included. The patch doesn't appear to include any new or modified tests.
        Please justify why no new tests are needed for this patch.
        Also please list what manual steps were performed to verify this patch.

        -1 patch. The patch command could not apply the patch.

        Console output: https://builds.apache.org/job/PreCommit-MAPREDUCE-Build/1327//console

        This message is automatically generated.

        Show
        Hadoop QA added a comment - -1 overall. Here are the results of testing the latest attachment http://issues.apache.org/jira/secure/attachment/12504372/MAPREDUCE-3437.patch against trunk revision . +1 @author. The patch does not contain any @author tags. -1 tests included. The patch doesn't appear to include any new or modified tests. Please justify why no new tests are needed for this patch. Also please list what manual steps were performed to verify this patch. -1 patch. The patch command could not apply the patch. Console output: https://builds.apache.org/job/PreCommit-MAPREDUCE-Build/1327//console This message is automatically generated.
        Hide
        Jonathan Eagles added a comment -

        This patch is only for branch-0.23

        Show
        Jonathan Eagles added a comment - This patch is only for branch-0.23
        Hide
        Jonathan Eagles added a comment -

        The find bugs warnings are not from this patch and exist in branch-23
        The core test failures are not from this patch and exist in branch-23
        No tests are needed for this build change.

        Show
        Jonathan Eagles added a comment - The find bugs warnings are not from this patch and exist in branch-23 The core test failures are not from this patch and exist in branch-23 No tests are needed for this build change.
        Hide
        Hadoop QA added a comment -

        -1 overall. Here are the results of testing the latest attachment
        http://issues.apache.org/jira/secure/attachment/12504342/MAPREDUCE-3437.patch
        against trunk revision .

        +1 @author. The patch does not contain any @author tags.

        -1 tests included. The patch doesn't appear to include any new or modified tests.
        Please justify why no new tests are needed for this patch.
        Also please list what manual steps were performed to verify this patch.

        +1 javadoc. The javadoc tool did not generate any warning messages.

        +1 javac. The applied patch does not increase the total number of javac compiler warnings.

        -1 findbugs. The patch appears to introduce 12 new Findbugs (version 1.3.9) warnings.

        +1 release audit. The applied patch does not increase the total number of release audit warnings.

        -1 core tests. The patch failed these unit tests:
        org.apache.hadoop.mapreduce.v2.TestMRJobs
        org.apache.hadoop.mapred.TestMiniMRClientCluster
        org.apache.hadoop.mapred.TestClientRedirect
        org.apache.hadoop.mapreduce.v2.TestUberAM

        +1 contrib tests. The patch passed contrib unit tests.

        Test results: https://builds.apache.org/job/PreCommit-MAPREDUCE-Build/1326//testReport/
        Findbugs warnings: https://builds.apache.org/job/PreCommit-MAPREDUCE-Build/1326//artifact/trunk/hadoop-mapreduce-project/patchprocess/newPatchFindbugsWarningshadoop-mapreduce-examples.html
        Console output: https://builds.apache.org/job/PreCommit-MAPREDUCE-Build/1326//console

        This message is automatically generated.

        Show
        Hadoop QA added a comment - -1 overall. Here are the results of testing the latest attachment http://issues.apache.org/jira/secure/attachment/12504342/MAPREDUCE-3437.patch against trunk revision . +1 @author. The patch does not contain any @author tags. -1 tests included. The patch doesn't appear to include any new or modified tests. Please justify why no new tests are needed for this patch. Also please list what manual steps were performed to verify this patch. +1 javadoc. The javadoc tool did not generate any warning messages. +1 javac. The applied patch does not increase the total number of javac compiler warnings. -1 findbugs. The patch appears to introduce 12 new Findbugs (version 1.3.9) warnings. +1 release audit. The applied patch does not increase the total number of release audit warnings. -1 core tests. The patch failed these unit tests: org.apache.hadoop.mapreduce.v2.TestMRJobs org.apache.hadoop.mapred.TestMiniMRClientCluster org.apache.hadoop.mapred.TestClientRedirect org.apache.hadoop.mapreduce.v2.TestUberAM +1 contrib tests. The patch passed contrib unit tests. Test results: https://builds.apache.org/job/PreCommit-MAPREDUCE-Build/1326//testReport/ Findbugs warnings: https://builds.apache.org/job/PreCommit-MAPREDUCE-Build/1326//artifact/trunk/hadoop-mapreduce-project/patchprocess/newPatchFindbugsWarningshadoop-mapreduce-examples.html Console output: https://builds.apache.org/job/PreCommit-MAPREDUCE-Build/1326//console This message is automatically generated.
        Hide
        Hadoop QA added a comment -

        -1 overall. Here are the results of testing the latest attachment
        http://issues.apache.org/jira/secure/attachment/12504337/MAPREDUCE-3437.patch
        against trunk revision .

        +1 @author. The patch does not contain any @author tags.

        -1 tests included. The patch doesn't appear to include any new or modified tests.
        Please justify why no new tests are needed for this patch.
        Also please list what manual steps were performed to verify this patch.

        +1 javadoc. The javadoc tool did not generate any warning messages.

        -1 javac. The patch appears to cause tar ant target to fail.

        -1 findbugs. The patch appears to cause Findbugs (version 1.3.9) to fail.

        +1 release audit. The applied patch does not increase the total number of release audit warnings.

        -1 core tests. The patch failed the unit tests build

        +1 contrib tests. The patch passed contrib unit tests.

        Test results: https://builds.apache.org/job/PreCommit-MAPREDUCE-Build/1325//testReport/
        Console output: https://builds.apache.org/job/PreCommit-MAPREDUCE-Build/1325//console

        This message is automatically generated.

        Show
        Hadoop QA added a comment - -1 overall. Here are the results of testing the latest attachment http://issues.apache.org/jira/secure/attachment/12504337/MAPREDUCE-3437.patch against trunk revision . +1 @author. The patch does not contain any @author tags. -1 tests included. The patch doesn't appear to include any new or modified tests. Please justify why no new tests are needed for this patch. Also please list what manual steps were performed to verify this patch. +1 javadoc. The javadoc tool did not generate any warning messages. -1 javac. The patch appears to cause tar ant target to fail. -1 findbugs. The patch appears to cause Findbugs (version 1.3.9) to fail. +1 release audit. The applied patch does not increase the total number of release audit warnings. -1 core tests. The patch failed the unit tests build +1 contrib tests. The patch passed contrib unit tests. Test results: https://builds.apache.org/job/PreCommit-MAPREDUCE-Build/1325//testReport/ Console output: https://builds.apache.org/job/PreCommit-MAPREDUCE-Build/1325//console This message is automatically generated.

          People

          • Assignee:
            Jonathan Eagles
            Reporter:
            Jonathan Eagles
          • Votes:
            0 Vote for this issue
            Watchers:
            1 Start watching this issue

            Dates

            • Created:
              Updated:
              Resolved:

              Development