Uploaded image for project: 'Hadoop Map/Reduce'
  1. Hadoop Map/Reduce
  2. MAPREDUCE-2881

mapreduce ant compilation fails "java.lang.IllegalStateException: impossible to get artifacts"

    Details

      Description

      [ivy:resolve] found com.cenqua.clover#clover;3.0.2 in fs
      [ivy:resolve]
      [ivy:resolve] :: problems summary ::
      [ivy:resolve] :::: ERRORS
      [ivy:resolve] impossible to get artifacts when data has not been loaded. IvyNode = log4j#log4j;1.2.16
      [ivy:resolve]
      [ivy:resolve] :: USE VERBOSE OR DEBUG MESSAGE LEVEL FOR MORE DETAILS

      BUILD FAILED
      /home/jenkins/jenkins-slave/workspace/Hadoop-Mapreduce-trunk-Commit/trunk/hadoop-mapreduce-project/build.xml:451: The following error occurred while executing this line:
      /home/jenkins/jenkins-slave/workspace/Hadoop-Mapreduce-trunk-Commit/trunk/hadoop-mapreduce-project/src/contrib/build.xml:30: The following error occurred while executing this line:
      /home/jenkins/jenkins-slave/workspace/Hadoop-Mapreduce-trunk-Commit/trunk/hadoop-mapreduce-project/src/contrib/build-contrib.xml:511: impossible to resolve dependencies:
      java.lang.IllegalStateException: impossible to get artifacts when data has not been loaded. IvyNode = log4j#log4j;1.2.16

        Attachments

        1. mr-2881.patch
          2 kB
          Giridharan Kesavan

          Activity

            People

            • Assignee:
              gkesavan Giridharan Kesavan
              Reporter:
              gkesavan Giridharan Kesavan
            • Votes:
              0 Vote for this issue
              Watchers:
              1 Start watching this issue

              Dates

              • Created:
                Updated:
                Resolved: