Uploaded image for project: 'Log4cxx'
  1. Log4cxx
  2. LOGCXX-273

filenamepatterntestcase fails

    XMLWordPrintableJSON

    Details

    • Type: Bug
    • Status: Resolved
    • Priority: Major
    • Resolution: Fixed
    • Affects Version/s: 0.10.0
    • Fix Version/s: 0.11.0
    • Component/s: Tests
    • Labels:
      None
    • Environment:
      libaprutil1-devel-1.2.12-alt1
      libapr1-devel-1.2.12-alt2
      libaprutil1-1.2.12-alt1
      gcc4.1-c++-4.1.2-alt1
      libapr1-1.2.12-alt2

      Description

      When I try to build log4cxx 0.10.0 I got error in make check phase:

      filenamepatterntestcase: /Line 104: expected <foo2003.05.20>, but saw <foo2003.05.21>

      Line 104: expected <foo2003-05-20yyyy.MM.dd}>, but saw <foo2003-05-21yyyy.MM.dd}>
      -Line 104: expected <foo2003-05-20{yyyy.MM.dd>, but saw <foo2003-05-21{yyyy.MM.dd>
      FAILED 3 of 14
      [skip]
      Failed Tests Total Fail Failed %
      ===================================================
      filenamepatterntestcase 14 3 21.43%
      make[3]: *** [run-unittest] Error 1
      make[2]: *** [check-recursive] Error 1
      make[1]: *** [check-recursive] Error 1
      make: *** [check-recursive] Error 1

        Attachments

          Issue Links

            Activity

              People

              • Assignee:
                carnold@apache.org Curt Arnold
                Reporter:
                php-coder Slava Semushin
              • Votes:
                0 Vote for this issue
                Watchers:
                1 Start watching this issue

                Dates

                • Created:
                  Updated:
                  Resolved: