Uploaded image for project: 'Kafka'
  1. Kafka
  2. KAFKA-5720

In Jenkins, kafka.api.SaslSslAdminClientIntegrationTest failed with org.apache.kafka.common.errors.TimeoutException

    Details

    • Type: Bug
    • Status: Resolved
    • Priority: Minor
    • Resolution: Fixed
    • Affects Version/s: None
    • Fix Version/s: 1.0.0
    • Component/s: None
    • Labels:
      None

      Description

      In Jenkins, kafka.api.SaslSslAdminClientIntegrationTest failed with org.apache.kafka.common.errors.TimeoutException.

      java.util.concurrent.ExecutionException: org.apache.kafka.common.errors.TimeoutException: Aborted due to timeout.
      	at org.apache.kafka.common.internals.KafkaFutureImpl.wrapAndThrow(KafkaFutureImpl.java:45)
      	at org.apache.kafka.common.internals.KafkaFutureImpl.access$000(KafkaFutureImpl.java:32)
      	at org.apache.kafka.common.internals.KafkaFutureImpl$SingleWaiter.await(KafkaFutureImpl.java:89)
      	at org.apache.kafka.common.internals.KafkaFutureImpl.get(KafkaFutureImpl.java:213)
      	at kafka.api.AdminClientIntegrationTest.testCallInFlightTimeouts(AdminClientIntegrationTest.scala:399)
      	at sun.reflect.NativeMethodAccessorImpl.invoke0(Native Method)
      	at sun.reflect.NativeMethodAccessorImpl.invoke(NativeMethodAccessorImpl.java:62)
      	at sun.reflect.DelegatingMethodAccessorImpl.invoke(DelegatingMethodAccessorImpl.java:43)
      	at java.lang.reflect.Method.invoke(Method.java:498)
      	at org.junit.runners.model.FrameworkMethod$1.runReflectiveCall(FrameworkMethod.java:50)
      	at org.junit.internal.runners.model.ReflectiveCallable.run(ReflectiveCallable.java:12)
      	at org.junit.runners.model.FrameworkMethod.invokeExplosively(FrameworkMethod.java:47)
      	at org.junit.internal.runners.statements.InvokeMethod.evaluate(InvokeMethod.java:17)
      	at org.junit.internal.runners.statements.RunBefores.evaluate(RunBefores.java:26)
      	at org.junit.internal.runners.statements.RunAfters.evaluate(RunAfters.java:27)
      	at org.junit.internal.runners.statements.FailOnTimeout$CallableStatement.call(FailOnTimeout.java:298)
      	at org.junit.internal.runners.statements.FailOnTimeout$CallableStatement.call(FailOnTimeout.java:292)
      	at java.util.concurrent.FutureTask.run(FutureTask.java:266)
      	at java.lang.Thread.run(Thread.java:748)
      Caused by: org.apache.kafka.common.errors.TimeoutException: Aborted due to timeout.
      

      It's unclear whether this was an environment error or test bug.

        Attachments

          Issue Links

            Activity

              People

              • Assignee:
                cmccabe Colin P. McCabe
                Reporter:
                cmccabe Colin P. McCabe
              • Votes:
                0 Vote for this issue
                Watchers:
                3 Start watching this issue

                Dates

                • Created:
                  Updated:
                  Resolved: