Uploaded image for project: 'IMPALA'
  1. IMPALA
  2. IMPALA-8118

ASAN build failure: query_test/test_scanners.py

    XMLWordPrintableJSON

    Details

    • Epic Color:
      ghx-label-4

      Description

      Build of latest master, with ASAN, failed with the following error, which to my newbie eyes looks like a connection failure:

      05:42:04 =================================== FAILURES ===================================
      05:42:04  TestQueriesTextTables.test_data_source_tables[protocol: beeswax | exec_option: {'batch_size': 0, 'num_nodes': 0, 'disable_codegen_rows_threshold': 0, 'disable_codegen': False, 'abort_on_error': 1, 'exec_single_node_rows_threshold': 0} | table_format: text/none] 
      05:42:04 [gw5] linux2 -- Python 2.7.5 /data/jenkins/workspace/impala-cdh6.x-core-asan/repos/Impala/bin/../infra/python/env/bin/python
      05:42:04 query_test/test_queries.py:174: in test_data_source_tables
      05:42:04     self.run_test_case('QueryTest/data-source-tables', vector)
      05:42:04 common/impala_test_suite.py:472: in run_test_case
      05:42:04     result = self.__execute_query(target_impalad_client, query, user=user)
      ...
      05:42:04     handle = self.execute_query_async(query_string, user=user)
      05:42:04 beeswax/impala_beeswax.py:351: in execute_query_async
      05:42:04     handle = self.__do_rpc(lambda: self.imp_service.query(query,))
      05:42:04 beeswax/impala_beeswax.py:512: in __do_rpc
      05:42:04     raise ImpalaBeeswaxException(self.__build_error_message(e), e)
      05:42:04 E   ImpalaBeeswaxException: ImpalaBeeswaxException:
      05:42:04 E    INNER EXCEPTION: <class 'thrift.transport.TTransport.TTransportException'>
      05:42:04 E    MESSAGE: TSocket read 0 bytes
      05:42:04 ----------------------------- Captured stderr call -----------------------------
      ...
      05:42:04 -- executing against localhost:21000
      05:42:04 select *
      05:42:04 from alltypes_datasource
      05:42:04 where float_col != 0 and
      05:42:04       int_col >= 1990 limit 5;
      

      A similar error appears for multiple other tests. Then:

      05:42:04 TTransportException: Could not connect to localhost:21050
      05:42:04 !!!!!!!!!!!!!!!!!!! Interrupted: stopping after 10 failures !!!!!!!!!!!!!!!!!!!!
      

      I wonder if these are just symptoms of a failure in the BE code due to ASAN being enabled.

      Similar error in the latest build:

      05:20:05 =================================== FAILURES ===================================
      05:20:05  TestHdfsQueries.test_hdfs_scan_node[protocol: beeswax | exec_option: {'batch_size': 0, 'num_nodes': 0, 'disable_codegen_rows_threshold': 0, 'disable_codegen': False, 'abort_on_error': 1, 'exec_single_node_rows_threshold': 0} | table_format: hbase/none] 
      05:20:05 [gw4] linux2 -- Python 2.7.5 /data/jenkins/workspace/impala-cdh6.x-core-asan/repos/Impala/bin/../infra/python/env/bin/python
      05:20:05 query_test/test_queries.py:240: in test_hdfs_scan_node
      05:20:05     self.run_test_case('QueryTest/hdfs-scan-node', vector)
      ...
      05:20:05     exec_result = self.__fetch_results(query_handle, max_rows)
      05:20:05 beeswax/impala_beeswax.py:456: in __fetch_results
      05:20:05     results = self.__do_rpc(lambda: self.imp_service.fetch(handle, False, fetch_rows))
      05:20:05 beeswax/impala_beeswax.py:512: in __do_rpc
      05:20:05     raise ImpalaBeeswaxException(self.__build_error_message(e), e)
      05:20:05 E   ImpalaBeeswaxException: ImpalaBeeswaxException:
      05:20:05 E    INNER EXCEPTION: <class 'thrift.transport.TTransport.TTransportException'>
      05:20:05 E    MESSAGE: TSocket read 0 bytes
      

        Attachments

          Issue Links

            Activity

              People

              • Assignee:
                lv Lars Volker
                Reporter:
                Paul.Rogers Paul Rogers
              • Votes:
                0 Vote for this issue
                Watchers:
                4 Start watching this issue

                Dates

                • Created:
                  Updated:
                  Resolved: