Uploaded image for project: 'IMPALA'
  1. IMPALA
  2. IMPALA-6584

TestKuduOperations::test_column_storage_attributes broken on exhaustive build

    Details

      Description

      Command to repro:

      impala-py.test tests/query_test/test_kudu.py -k column_storage_attr --workload_exploration_strategy=functional-query:exhaustive
      

      Output (on commit 7112d05e5c95905613aa08d5bf7ff7fc20a402bc):

      ==============================
      platform linux2 -- Python 2.7.6, pytest-2.9.2, py-1.4.32, pluggy-0.3.1 -- /home/tarmstrong/Impala/incubator-impala/bin/../infra/python/env/bin/python
      cachedir: tests/.cache
      rootdir: /home/tarmstrong/Impala/incubator-impala/tests, inifile: pytest.ini
      plugins: xdist-1.15.0, random-0.2
      collected 56 items 
      
      tests/query_test/test_kudu.py::TestKuduOperations::test_column_storage_attributes FAILED
      ============================================================================================= short test summary info ==============================================================================================
      FAIL tests/query_test/test_kudu.py::TestKuduOperations::()::test_column_storage_attributes
      
      ===================================================================================================== FAILURES =====================================================================================================
      ________________________________________________________________________________ TestKuduOperations.test_column_storage_attributes _________________________________________________________________________________
      tests/query_test/test_kudu.py:366: in test_column_storage_attributes
          cursor.execute(create_query)
      infra/python/env/local/lib/python2.7/site-packages/impala/hiveserver2.py:302: in execute
          configuration=configuration)
      infra/python/env/local/lib/python2.7/site-packages/impala/hiveserver2.py:343: in execute_async
          self._execute_async(op)
      infra/python/env/local/lib/python2.7/site-packages/impala/hiveserver2.py:362: in _execute_async
          operation_fn()
      infra/python/env/local/lib/python2.7/site-packages/impala/hiveserver2.py:340: in op
          async=True)
      infra/python/env/local/lib/python2.7/site-packages/impala/hiveserver2.py:1027: in execute
          return self._operation('ExecuteStatement', req)
      infra/python/env/local/lib/python2.7/site-packages/impala/hiveserver2.py:957: in _operation
          resp = self._rpc(kind, request)
      infra/python/env/local/lib/python2.7/site-packages/impala/hiveserver2.py:925: in _rpc
          err_if_rpc_not_ok(response)
      infra/python/env/local/lib/python2.7/site-packages/impala/hiveserver2.py:704: in err_if_rpc_not_ok
          raise HiveServer2Error(resp.status.errorMessage)
      E   HiveServer2Error: AnalysisException: Syntax error in line 1:
      E   ... timestamp_col timestamp, decimal(9, 2)_col decimal(9,...
      E                                ^
      E   Encountered: DECIMAL
      E   Expected: DEFAULT, PRIMARY, IDENTIFIER
      E   
      E   CAUSED BY: Exception: Syntax error
      ---------------------------------------------------------------------------------------------- Captured stderr setup -----------------------------------------------------------------------------------------------
      -- connecting to: localhost:21000
      MainThread: Closing active operation
      MainThread: Using database nnjyv0 as default
      SET sync_ddl=False;
      -- executing against localhost:21000
      DROP DATABASE IF EXISTS `test_column_storage_attributes_b9040aa` CASCADE;
      
      SET sync_ddl=False;
      -- executing against localhost:21000
      CREATE DATABASE `test_column_storage_attributes_b9040aa`;
      
      MainThread: Created database "test_column_storage_attributes_b9040aa" for test ID "query_test/test_kudu.py::TestKuduOperations::()::test_column_storage_attributes"
      ================================================================================== 55 tests deselected by '-kcolumn_storage_attr' ==================================================================================
      ===================================================================================== 1 failed, 55 deselected in 4.24 seconds ======================================================================================
      

        Attachments

          Issue Links

            Activity

              People

              • Assignee:
                granthenke Grant Henke
                Reporter:
                tarmstrong Tim Armstrong
              • Votes:
                0 Vote for this issue
                Watchers:
                4 Start watching this issue

                Dates

                • Created:
                  Updated:
                  Resolved: