Uploaded image for project: 'IMPALA'
  1. IMPALA
  2. IMPALA-5453

TestCreateTableLikeFile fails on 'enum.parquet'

    XMLWordPrintableJSON

Details

    • Bug
    • Status: Resolved
    • Blocker
    • Resolution: Fixed
    • Impala 2.10.0
    • Impala 2.10.0
    • None
    • ghx-label-5

    Description

      Seen in a Jenkins build. I can also repro locally.

      Tests run: 45, Failures: 1, Errors: 0, Skipped: 0, Time elapsed: 2.476 sec <<< FAILURE! - in org.apache.impala.analysis.AnalyzeDDLTest
      TestCreateTableLikeFile(org.apache.impala.analysis.AnalyzeDDLTest)  Time elapsed: 0.035 sec  <<< FAILURE!
      java.lang.AssertionError: Error:
      org.apache.impala.common.AnalysisException: Cannot infer schema, path is not a file: hdfs://localhost:20500/test-warehouse/schemas/enum/enum.parquet
      	at org.junit.Assert.fail(Assert.java:88)
      	at org.apache.impala.common.FrontendTestBase.AnalyzesOk(FrontendTestBase.java:294)
      	at org.apache.impala.common.FrontendTestBase.AnalyzesOk(FrontendTestBase.java:252)
      	at org.apache.impala.analysis.AnalyzeDDLTest.TestCreateTableLikeFile(AnalyzeDDLTest.java:1409)
      

      Appears to be related to IMPALA-2525, which just went in.

      Attachments

        Activity

          People

            twmarshall Thomas Tauber-Marshall
            twmarshall Thomas Tauber-Marshall
            Votes:
            0 Vote for this issue
            Watchers:
            4 Start watching this issue

            Dates

              Created:
              Updated:
              Resolved: