Uploaded image for project: 'Hive'
  1. Hive
  2. HIVE-7681

qualified tablenames usage does not work with several alter-table commands

    Details

    • Type: Bug
    • Status: Closed
    • Priority: Major
    • Resolution: Fixed
    • Affects Version/s: None
    • Fix Version/s: 0.14.0
    • Component/s: None
    • Labels:

      Description

      Changes were made in HIVE-4064 for use of qualified table names in more types of queries. But several alter table commands don't work with qualified

      • alter table default.tmpfoo set tblproperties ("bar" = "bar value")
      • ALTER TABLE default.kv_rename_test CHANGE a a STRING
      • add,drop partition
      • alter index rebuild
      1. HIVE-7681.4.patch.txt
        254 kB
        Navis
      2. HIVE-7681.4.patch.txt
        254 kB
        Thejas M Nair
      3. HIVE-7681.3.patch.txt
        252 kB
        Navis
      4. HIVE-7681.2.patch.txt
        246 kB
        Navis
      5. HIVE-7681.1.patch.txt
        239 kB
        Navis

        Issue Links

          Activity

          Hide
          navis Navis added a comment -

          My bad. I'm on this.

          Show
          navis Navis added a comment - My bad. I'm on this.
          Hide
          navis Navis added a comment -

          Running preliminary test

          Show
          navis Navis added a comment - Running preliminary test
          Hide
          chenchun Chun Chen added a comment -

          Left-factoring is really quit a easy way to remove left recursion, learned !

          Show
          chenchun Chun Chen added a comment - Left-factoring is really quit a easy way to remove left recursion, learned !
          Hide
          hiveqa Hive QA added a comment -

          Overall: -1 at least one tests failed

          Here are the results of testing the latest attachment:
          https://issues.apache.org/jira/secure/attachment/12661395/HIVE-7681.1.patch.txt

          ERROR: -1 due to 29 failed/errored test(s), 5890 tests executed
          Failed tests:

          org.apache.hadoop.hive.cli.TestCliDriver.testCliDriver_authorization_8
          org.apache.hadoop.hive.cli.TestCliDriver.testCliDriver_create_view
          org.apache.hadoop.hive.cli.TestCliDriver.testCliDriver_create_view_partitioned
          org.apache.hadoop.hive.cli.TestCliDriver.testCliDriver_dbtxnmgr_ddl1
          org.apache.hadoop.hive.cli.TestCliDriver.testCliDriver_describe_formatted_view_partitioned
          org.apache.hadoop.hive.cli.TestCliDriver.testCliDriver_describe_formatted_view_partitioned_json
          org.apache.hadoop.hive.cli.TestCliDriver.testCliDriver_list_bucket_dml_8
          org.apache.hadoop.hive.cli.TestMiniTezCliDriver.testCliDriver_dynpart_sort_opt_vectorization
          org.apache.hadoop.hive.cli.TestMiniTezCliDriver.testCliDriver_dynpart_sort_optimization
          org.apache.hadoop.hive.cli.TestNegativeCliDriver.testNegativeCliDriver_alter_view_as_select_with_partition
          org.apache.hadoop.hive.cli.TestNegativeCliDriver.testNegativeCliDriver_create_or_replace_view1
          org.apache.hadoop.hive.cli.TestNegativeCliDriver.testNegativeCliDriver_create_or_replace_view2
          org.apache.hadoop.hive.cli.TestNegativeCliDriver.testNegativeCliDriver_recursive_view
          org.apache.hadoop.hive.cli.TestNegativeCliDriver.testNegativeCliDriver_unset_view_property
          org.apache.hive.hcatalog.cli.TestSemanticAnalysis.testAddDriverInfo
          org.apache.hive.hcatalog.cli.TestSemanticAnalysis.testAddReplaceCols
          org.apache.hive.hcatalog.cli.TestSemanticAnalysis.testAlterTableSetFF
          org.apache.hive.hcatalog.cli.TestSemanticAnalysis.testAlterTblClusteredBy
          org.apache.hive.hcatalog.cli.TestSemanticAnalysis.testCTLPass
          org.apache.hive.hcatalog.cli.TestSemanticAnalysis.testChangeColumns
          org.apache.hive.hcatalog.cli.TestSemanticAnalysis.testCreateTableIfNotExists
          org.apache.hive.hcatalog.cli.TestSemanticAnalysis.testDatabaseOperations
          org.apache.hive.hcatalog.cli.TestSemanticAnalysis.testDescDB
          org.apache.hive.hcatalog.cli.TestSemanticAnalysis.testInvalidateClusteredBy
          org.apache.hive.hcatalog.cli.TestSemanticAnalysis.testInvalidateSeqFileStoredAs
          org.apache.hive.hcatalog.cli.TestSemanticAnalysis.testInvalidateTextFileStoredAs
          org.apache.hive.hcatalog.cli.TestSemanticAnalysis.testStoredAs
          org.apache.hive.hcatalog.cli.TestSemanticAnalysis.testUsNonExistentDB
          org.apache.hive.hcatalog.pig.TestOrcHCatLoader.testReadDataPrimitiveTypes
          

          Test results: http://ec2-174-129-184-35.compute-1.amazonaws.com/jenkins/job/PreCommit-HIVE-TRUNK-Build/291/testReport
          Console output: http://ec2-174-129-184-35.compute-1.amazonaws.com/jenkins/job/PreCommit-HIVE-TRUNK-Build/291/console
          Test logs: http://ec2-174-129-184-35.compute-1.amazonaws.com/logs/PreCommit-HIVE-TRUNK-Build-291/

          Messages:

          Executing org.apache.hive.ptest.execution.PrepPhase
          Executing org.apache.hive.ptest.execution.ExecutionPhase
          Executing org.apache.hive.ptest.execution.ReportingPhase
          Tests exited with: TestsFailedException: 29 tests failed
          

          This message is automatically generated.

          ATTACHMENT ID: 12661395

          Show
          hiveqa Hive QA added a comment - Overall : -1 at least one tests failed Here are the results of testing the latest attachment: https://issues.apache.org/jira/secure/attachment/12661395/HIVE-7681.1.patch.txt ERROR: -1 due to 29 failed/errored test(s), 5890 tests executed Failed tests: org.apache.hadoop.hive.cli.TestCliDriver.testCliDriver_authorization_8 org.apache.hadoop.hive.cli.TestCliDriver.testCliDriver_create_view org.apache.hadoop.hive.cli.TestCliDriver.testCliDriver_create_view_partitioned org.apache.hadoop.hive.cli.TestCliDriver.testCliDriver_dbtxnmgr_ddl1 org.apache.hadoop.hive.cli.TestCliDriver.testCliDriver_describe_formatted_view_partitioned org.apache.hadoop.hive.cli.TestCliDriver.testCliDriver_describe_formatted_view_partitioned_json org.apache.hadoop.hive.cli.TestCliDriver.testCliDriver_list_bucket_dml_8 org.apache.hadoop.hive.cli.TestMiniTezCliDriver.testCliDriver_dynpart_sort_opt_vectorization org.apache.hadoop.hive.cli.TestMiniTezCliDriver.testCliDriver_dynpart_sort_optimization org.apache.hadoop.hive.cli.TestNegativeCliDriver.testNegativeCliDriver_alter_view_as_select_with_partition org.apache.hadoop.hive.cli.TestNegativeCliDriver.testNegativeCliDriver_create_or_replace_view1 org.apache.hadoop.hive.cli.TestNegativeCliDriver.testNegativeCliDriver_create_or_replace_view2 org.apache.hadoop.hive.cli.TestNegativeCliDriver.testNegativeCliDriver_recursive_view org.apache.hadoop.hive.cli.TestNegativeCliDriver.testNegativeCliDriver_unset_view_property org.apache.hive.hcatalog.cli.TestSemanticAnalysis.testAddDriverInfo org.apache.hive.hcatalog.cli.TestSemanticAnalysis.testAddReplaceCols org.apache.hive.hcatalog.cli.TestSemanticAnalysis.testAlterTableSetFF org.apache.hive.hcatalog.cli.TestSemanticAnalysis.testAlterTblClusteredBy org.apache.hive.hcatalog.cli.TestSemanticAnalysis.testCTLPass org.apache.hive.hcatalog.cli.TestSemanticAnalysis.testChangeColumns org.apache.hive.hcatalog.cli.TestSemanticAnalysis.testCreateTableIfNotExists org.apache.hive.hcatalog.cli.TestSemanticAnalysis.testDatabaseOperations org.apache.hive.hcatalog.cli.TestSemanticAnalysis.testDescDB org.apache.hive.hcatalog.cli.TestSemanticAnalysis.testInvalidateClusteredBy org.apache.hive.hcatalog.cli.TestSemanticAnalysis.testInvalidateSeqFileStoredAs org.apache.hive.hcatalog.cli.TestSemanticAnalysis.testInvalidateTextFileStoredAs org.apache.hive.hcatalog.cli.TestSemanticAnalysis.testStoredAs org.apache.hive.hcatalog.cli.TestSemanticAnalysis.testUsNonExistentDB org.apache.hive.hcatalog.pig.TestOrcHCatLoader.testReadDataPrimitiveTypes Test results: http://ec2-174-129-184-35.compute-1.amazonaws.com/jenkins/job/PreCommit-HIVE-TRUNK-Build/291/testReport Console output: http://ec2-174-129-184-35.compute-1.amazonaws.com/jenkins/job/PreCommit-HIVE-TRUNK-Build/291/console Test logs: http://ec2-174-129-184-35.compute-1.amazonaws.com/logs/PreCommit-HIVE-TRUNK-Build-291/ Messages: Executing org.apache.hive.ptest.execution.PrepPhase Executing org.apache.hive.ptest.execution.ExecutionPhase Executing org.apache.hive.ptest.execution.ReportingPhase Tests exited with: TestsFailedException: 29 tests failed This message is automatically generated. ATTACHMENT ID: 12661395
          Hide
          navis Navis added a comment -

          Fixed test fails

          Show
          navis Navis added a comment - Fixed test fails
          Hide
          hiveqa Hive QA added a comment -

          Overall: -1 no tests executed

          Here are the results of testing the latest attachment:
          https://issues.apache.org/jira/secure/attachment/12661607/HIVE-7681.2.patch.txt

          Test results: http://ec2-174-129-184-35.compute-1.amazonaws.com/jenkins/job/PreCommit-HIVE-TRUNK-Build/307/testReport
          Console output: http://ec2-174-129-184-35.compute-1.amazonaws.com/jenkins/job/PreCommit-HIVE-TRUNK-Build/307/console
          Test logs: http://ec2-174-129-184-35.compute-1.amazonaws.com/logs/PreCommit-HIVE-TRUNK-Build-307/

          Messages:

          Executing org.apache.hive.ptest.execution.PrepPhase
          Tests exited with: NonZeroExitCodeException
          Command 'bash /data/hive-ptest/working/scratch/source-prep.sh' failed with exit status 1 and output '+ [[ -n /usr/java/jdk1.7.0_45-cloudera ]]
          + export JAVA_HOME=/usr/java/jdk1.7.0_45-cloudera
          + JAVA_HOME=/usr/java/jdk1.7.0_45-cloudera
          + export PATH=/usr/java/jdk1.7.0_45-cloudera/bin/:/usr/java/jdk1.6.0_34/bin:/usr/local/apache-maven-3.0.5/bin:/usr/local/apache-maven-3.0.5/bin:/usr/java/jdk1.6.0_34/bin:/usr/local/apache-ant-1.9.1/bin:/usr/local/bin:/bin:/usr/bin:/usr/local/sbin:/usr/sbin:/sbin:/home/hiveptest/bin
          + PATH=/usr/java/jdk1.7.0_45-cloudera/bin/:/usr/java/jdk1.6.0_34/bin:/usr/local/apache-maven-3.0.5/bin:/usr/local/apache-maven-3.0.5/bin:/usr/java/jdk1.6.0_34/bin:/usr/local/apache-ant-1.9.1/bin:/usr/local/bin:/bin:/usr/bin:/usr/local/sbin:/usr/sbin:/sbin:/home/hiveptest/bin
          + export 'ANT_OPTS=-Xmx1g -XX:MaxPermSize=256m '
          + ANT_OPTS='-Xmx1g -XX:MaxPermSize=256m '
          + export 'M2_OPTS=-Xmx1g -XX:MaxPermSize=256m -Dhttp.proxyHost=localhost -Dhttp.proxyPort=3128'
          + M2_OPTS='-Xmx1g -XX:MaxPermSize=256m -Dhttp.proxyHost=localhost -Dhttp.proxyPort=3128'
          + cd /data/hive-ptest/working/
          + tee /data/hive-ptest/logs/PreCommit-HIVE-TRUNK-Build-307/source-prep.txt
          + [[ false == \t\r\u\e ]]
          + mkdir -p maven ivy
          + [[ svn = \s\v\n ]]
          + [[ -n '' ]]
          + [[ -d apache-svn-trunk-source ]]
          + [[ ! -d apache-svn-trunk-source/.svn ]]
          + [[ ! -d apache-svn-trunk-source ]]
          + cd apache-svn-trunk-source
          + svn revert -R .
          Reverted 'serde/src/test/org/apache/hadoop/hive/serde2/lazy/TestLazyPrimitive.java'
          Reverted 'serde/src/java/org/apache/hadoop/hive/serde2/lazy/LazyBinary.java'
          Reverted 'serde/src/java/org/apache/hadoop/hive/serde2/lazy/LazyStruct.java'
          ++ egrep -v '^X|^Performing status on external'
          ++ awk '{print $2}'
          ++ svn status --no-ignore
          + rm -rf target datanucleus.log ant/target shims/target shims/0.20/target shims/0.20S/target shims/0.23/target shims/aggregator/target shims/common/target shims/common-secure/target packaging/target hbase-handler/target testutils/target jdbc/target metastore/target itests/target itests/hcatalog-unit/target itests/test-serde/target itests/qtest/target itests/hive-unit-hadoop2/target itests/hive-minikdc/target itests/hive-unit/target itests/custom-serde/target itests/util/target hcatalog/target hcatalog/core/target hcatalog/streaming/target hcatalog/server-extensions/target hcatalog/webhcat/svr/target hcatalog/webhcat/java-client/target hcatalog/hcatalog-pig-adapter/target hwi/target common/target common/src/gen service/target contrib/target contrib/src/java/org/apache/hadoop/hive/contrib/serde2/MultiDelimitSerDe.java serde/target beeline/target odbc/target cli/target ql/dependency-reduced-pom.xml ql/target
          + svn update
          
          Fetching external item into 'hcatalog/src/test/e2e/harness'
          External at revision 1617907.
          
          At revision 1617907.
          + patchCommandPath=/data/hive-ptest/working/scratch/smart-apply-patch.sh
          + patchFilePath=/data/hive-ptest/working/scratch/build.patch
          + [[ -f /data/hive-ptest/working/scratch/build.patch ]]
          + chmod +x /data/hive-ptest/working/scratch/smart-apply-patch.sh
          + /data/hive-ptest/working/scratch/smart-apply-patch.sh /data/hive-ptest/working/scratch/build.patch
          The patch does not appear to apply with p0, p1, or p2
          + exit 1
          '
          

          This message is automatically generated.

          ATTACHMENT ID: 12661607

          Show
          hiveqa Hive QA added a comment - Overall : -1 no tests executed Here are the results of testing the latest attachment: https://issues.apache.org/jira/secure/attachment/12661607/HIVE-7681.2.patch.txt Test results: http://ec2-174-129-184-35.compute-1.amazonaws.com/jenkins/job/PreCommit-HIVE-TRUNK-Build/307/testReport Console output: http://ec2-174-129-184-35.compute-1.amazonaws.com/jenkins/job/PreCommit-HIVE-TRUNK-Build/307/console Test logs: http://ec2-174-129-184-35.compute-1.amazonaws.com/logs/PreCommit-HIVE-TRUNK-Build-307/ Messages: Executing org.apache.hive.ptest.execution.PrepPhase Tests exited with: NonZeroExitCodeException Command 'bash /data/hive-ptest/working/scratch/source-prep.sh' failed with exit status 1 and output '+ [[ -n /usr/java/jdk1.7.0_45-cloudera ]] + export JAVA_HOME=/usr/java/jdk1.7.0_45-cloudera + JAVA_HOME=/usr/java/jdk1.7.0_45-cloudera + export PATH=/usr/java/jdk1.7.0_45-cloudera/bin/:/usr/java/jdk1.6.0_34/bin:/usr/local/apache-maven-3.0.5/bin:/usr/local/apache-maven-3.0.5/bin:/usr/java/jdk1.6.0_34/bin:/usr/local/apache-ant-1.9.1/bin:/usr/local/bin:/bin:/usr/bin:/usr/local/sbin:/usr/sbin:/sbin:/home/hiveptest/bin + PATH=/usr/java/jdk1.7.0_45-cloudera/bin/:/usr/java/jdk1.6.0_34/bin:/usr/local/apache-maven-3.0.5/bin:/usr/local/apache-maven-3.0.5/bin:/usr/java/jdk1.6.0_34/bin:/usr/local/apache-ant-1.9.1/bin:/usr/local/bin:/bin:/usr/bin:/usr/local/sbin:/usr/sbin:/sbin:/home/hiveptest/bin + export 'ANT_OPTS=-Xmx1g -XX:MaxPermSize=256m ' + ANT_OPTS='-Xmx1g -XX:MaxPermSize=256m ' + export 'M2_OPTS=-Xmx1g -XX:MaxPermSize=256m -Dhttp.proxyHost=localhost -Dhttp.proxyPort=3128' + M2_OPTS='-Xmx1g -XX:MaxPermSize=256m -Dhttp.proxyHost=localhost -Dhttp.proxyPort=3128' + cd /data/hive-ptest/working/ + tee /data/hive-ptest/logs/PreCommit-HIVE-TRUNK-Build-307/source-prep.txt + [[ false == \t\r\u\e ]] + mkdir -p maven ivy + [[ svn = \s\v\n ]] + [[ -n '' ]] + [[ -d apache-svn-trunk-source ]] + [[ ! -d apache-svn-trunk-source/.svn ]] + [[ ! -d apache-svn-trunk-source ]] + cd apache-svn-trunk-source + svn revert -R . Reverted 'serde/src/test/org/apache/hadoop/hive/serde2/lazy/TestLazyPrimitive.java' Reverted 'serde/src/java/org/apache/hadoop/hive/serde2/lazy/LazyBinary.java' Reverted 'serde/src/java/org/apache/hadoop/hive/serde2/lazy/LazyStruct.java' ++ egrep -v '^X|^Performing status on external' ++ awk '{print $2}' ++ svn status --no-ignore + rm -rf target datanucleus.log ant/target shims/target shims/0.20/target shims/0.20S/target shims/0.23/target shims/aggregator/target shims/common/target shims/common-secure/target packaging/target hbase-handler/target testutils/target jdbc/target metastore/target itests/target itests/hcatalog-unit/target itests/test-serde/target itests/qtest/target itests/hive-unit-hadoop2/target itests/hive-minikdc/target itests/hive-unit/target itests/custom-serde/target itests/util/target hcatalog/target hcatalog/core/target hcatalog/streaming/target hcatalog/server-extensions/target hcatalog/webhcat/svr/target hcatalog/webhcat/java-client/target hcatalog/hcatalog-pig-adapter/target hwi/target common/target common/src/gen service/target contrib/target contrib/src/java/org/apache/hadoop/hive/contrib/serde2/MultiDelimitSerDe.java serde/target beeline/target odbc/target cli/target ql/dependency-reduced-pom.xml ql/target + svn update Fetching external item into 'hcatalog/src/test/e2e/harness' External at revision 1617907. At revision 1617907. + patchCommandPath=/data/hive-ptest/working/scratch/smart-apply-patch.sh + patchFilePath=/data/hive-ptest/working/scratch/build.patch + [[ -f /data/hive-ptest/working/scratch/build.patch ]] + chmod +x /data/hive-ptest/working/scratch/smart-apply-patch.sh + /data/hive-ptest/working/scratch/smart-apply-patch.sh /data/hive-ptest/working/scratch/build.patch The patch does not appear to apply with p0, p1, or p2 + exit 1 ' This message is automatically generated. ATTACHMENT ID: 12661607
          Hide
          hiveqa Hive QA added a comment -

          Overall: -1 at least one tests failed

          Here are the results of testing the latest attachment:
          https://issues.apache.org/jira/secure/attachment/12662409/HIVE-7681.3.patch.txt

          ERROR: -1 due to 5 failed/errored test(s), 5817 tests executed
          Failed tests:

          org.apache.hadoop.hive.cli.TestCliDriver.testCliDriver_alter_view_as_select
          org.apache.hadoop.hive.cli.TestCliDriver.testCliDriver_alter_view_rename
          org.apache.hadoop.hive.cli.TestCliDriver.testCliDriver_create_or_replace_view
          org.apache.hadoop.hive.ql.security.authorization.plugin.TestHiveOperationType.checkHiveOperationTypeMatch
          org.apache.hive.jdbc.miniHS2.TestHiveServer2.testConnection
          

          Test results: http://ec2-174-129-184-35.compute-1.amazonaws.com/jenkins/job/PreCommit-HIVE-TRUNK-Build/371/testReport
          Console output: http://ec2-174-129-184-35.compute-1.amazonaws.com/jenkins/job/PreCommit-HIVE-TRUNK-Build/371/console
          Test logs: http://ec2-174-129-184-35.compute-1.amazonaws.com/logs/PreCommit-HIVE-TRUNK-Build-371/

          Messages:

          Executing org.apache.hive.ptest.execution.PrepPhase
          Executing org.apache.hive.ptest.execution.ExecutionPhase
          Executing org.apache.hive.ptest.execution.ReportingPhase
          Tests exited with: TestsFailedException: 5 tests failed
          

          This message is automatically generated.

          ATTACHMENT ID: 12662409

          Show
          hiveqa Hive QA added a comment - Overall : -1 at least one tests failed Here are the results of testing the latest attachment: https://issues.apache.org/jira/secure/attachment/12662409/HIVE-7681.3.patch.txt ERROR: -1 due to 5 failed/errored test(s), 5817 tests executed Failed tests: org.apache.hadoop.hive.cli.TestCliDriver.testCliDriver_alter_view_as_select org.apache.hadoop.hive.cli.TestCliDriver.testCliDriver_alter_view_rename org.apache.hadoop.hive.cli.TestCliDriver.testCliDriver_create_or_replace_view org.apache.hadoop.hive.ql.security.authorization.plugin.TestHiveOperationType.checkHiveOperationTypeMatch org.apache.hive.jdbc.miniHS2.TestHiveServer2.testConnection Test results: http://ec2-174-129-184-35.compute-1.amazonaws.com/jenkins/job/PreCommit-HIVE-TRUNK-Build/371/testReport Console output: http://ec2-174-129-184-35.compute-1.amazonaws.com/jenkins/job/PreCommit-HIVE-TRUNK-Build/371/console Test logs: http://ec2-174-129-184-35.compute-1.amazonaws.com/logs/PreCommit-HIVE-TRUNK-Build-371/ Messages: Executing org.apache.hive.ptest.execution.PrepPhase Executing org.apache.hive.ptest.execution.ExecutionPhase Executing org.apache.hive.ptest.execution.ReportingPhase Tests exited with: TestsFailedException: 5 tests failed This message is automatically generated. ATTACHMENT ID: 12662409
          Hide
          navis Navis added a comment -

          Updated test results

          Show
          navis Navis added a comment - Updated test results
          Hide
          hiveqa Hive QA added a comment -

          Overall: +1 all checks pass

          Here are the results of testing the latest attachment:
          https://issues.apache.org/jira/secure/attachment/12662424/HIVE-7681.4.patch.txt

          SUCCESS: +1 5817 tests passed

          Test results: http://ec2-174-129-184-35.compute-1.amazonaws.com/jenkins/job/PreCommit-HIVE-TRUNK-Build/372/testReport
          Console output: http://ec2-174-129-184-35.compute-1.amazonaws.com/jenkins/job/PreCommit-HIVE-TRUNK-Build/372/console
          Test logs: http://ec2-174-129-184-35.compute-1.amazonaws.com/logs/PreCommit-HIVE-TRUNK-Build-372/

          Messages:

          Executing org.apache.hive.ptest.execution.PrepPhase
          Executing org.apache.hive.ptest.execution.ExecutionPhase
          Executing org.apache.hive.ptest.execution.ReportingPhase
          

          This message is automatically generated.

          ATTACHMENT ID: 12662424

          Show
          hiveqa Hive QA added a comment - Overall : +1 all checks pass Here are the results of testing the latest attachment: https://issues.apache.org/jira/secure/attachment/12662424/HIVE-7681.4.patch.txt SUCCESS: +1 5817 tests passed Test results: http://ec2-174-129-184-35.compute-1.amazonaws.com/jenkins/job/PreCommit-HIVE-TRUNK-Build/372/testReport Console output: http://ec2-174-129-184-35.compute-1.amazonaws.com/jenkins/job/PreCommit-HIVE-TRUNK-Build/372/console Test logs: http://ec2-174-129-184-35.compute-1.amazonaws.com/logs/PreCommit-HIVE-TRUNK-Build-372/ Messages: Executing org.apache.hive.ptest.execution.PrepPhase Executing org.apache.hive.ptest.execution.ExecutionPhase Executing org.apache.hive.ptest.execution.ReportingPhase This message is automatically generated. ATTACHMENT ID: 12662424
          Hide
          navis Navis added a comment -

          Thejas M Nair Could you review this? It goes stale frequently.

          Show
          navis Navis added a comment - Thejas M Nair Could you review this? It goes stale frequently.
          Hide
          thejas Thejas M Nair added a comment - - edited

          Thanks for the changes and for updating all those tests!

          +1. Pending some minor comments in review board to be addressed.

          Show
          thejas Thejas M Nair added a comment - - edited Thanks for the changes and for updating all those tests! +1. Pending some minor comments in review board to be addressed.
          Hide
          thejas Thejas M Nair added a comment -

          HIVE-7681.4.patch.txt - Uploading the patch to kick off tests and make sure that no new tests need update.

          Show
          thejas Thejas M Nair added a comment - HIVE-7681 .4.patch.txt - Uploading the patch to kick off tests and make sure that no new tests need update.
          Hide
          hiveqa Hive QA added a comment -

          Overall: -1 at least one tests failed

          Here are the results of testing the latest attachment:
          https://issues.apache.org/jira/secure/attachment/12664183/HIVE-7681.4.patch.txt

          ERROR: -1 due to 1 failed/errored test(s), 6118 tests executed
          Failed tests:

          org.apache.hadoop.hive.cli.TestMiniTezCliDriver.testCliDriver_dynpart_sort_opt_vectorization
          

          Test results: http://ec2-174-129-184-35.compute-1.amazonaws.com/jenkins/job/PreCommit-HIVE-TRUNK-Build/490/testReport
          Console output: http://ec2-174-129-184-35.compute-1.amazonaws.com/jenkins/job/PreCommit-HIVE-TRUNK-Build/490/console
          Test logs: http://ec2-174-129-184-35.compute-1.amazonaws.com/logs/PreCommit-HIVE-TRUNK-Build-490/

          Messages:

          Executing org.apache.hive.ptest.execution.PrepPhase
          Executing org.apache.hive.ptest.execution.ExecutionPhase
          Executing org.apache.hive.ptest.execution.ReportingPhase
          Tests exited with: TestsFailedException: 1 tests failed
          

          This message is automatically generated.

          ATTACHMENT ID: 12664183

          Show
          hiveqa Hive QA added a comment - Overall : -1 at least one tests failed Here are the results of testing the latest attachment: https://issues.apache.org/jira/secure/attachment/12664183/HIVE-7681.4.patch.txt ERROR: -1 due to 1 failed/errored test(s), 6118 tests executed Failed tests: org.apache.hadoop.hive.cli.TestMiniTezCliDriver.testCliDriver_dynpart_sort_opt_vectorization Test results: http://ec2-174-129-184-35.compute-1.amazonaws.com/jenkins/job/PreCommit-HIVE-TRUNK-Build/490/testReport Console output: http://ec2-174-129-184-35.compute-1.amazonaws.com/jenkins/job/PreCommit-HIVE-TRUNK-Build/490/console Test logs: http://ec2-174-129-184-35.compute-1.amazonaws.com/logs/PreCommit-HIVE-TRUNK-Build-490/ Messages: Executing org.apache.hive.ptest.execution.PrepPhase Executing org.apache.hive.ptest.execution.ExecutionPhase Executing org.apache.hive.ptest.execution.ReportingPhase Tests exited with: TestsFailedException: 1 tests failed This message is automatically generated. ATTACHMENT ID: 12664183
          Hide
          thejas Thejas M Nair added a comment -

          Patch committed to trunk.
          Thanks Navis!

          Show
          thejas Thejas M Nair added a comment - Patch committed to trunk. Thanks Navis!
          Hide
          sushanth Sushanth Sowmyan added a comment -

          Hi, this patch created a small regression, I've opened HIVE-8212 to track its fix.

          Show
          sushanth Sushanth Sowmyan added a comment - Hi, this patch created a small regression, I've opened HIVE-8212 to track its fix.
          Hide
          thejas Thejas M Nair added a comment -

          This has been fixed in 0.14 release. Please open new jira if you see any issues.

          Show
          thejas Thejas M Nair added a comment - This has been fixed in 0.14 release. Please open new jira if you see any issues.

            People

            • Assignee:
              navis Navis
              Reporter:
              thejas Thejas M Nair
            • Votes:
              0 Vote for this issue
              Watchers:
              5 Start watching this issue

              Dates

              • Created:
                Updated:
                Resolved:

                Development