Details

    • Type: Sub-task Sub-task
    • Status: Resolved
    • Priority: Major Major
    • Resolution: Fixed
    • Affects Version/s: None
    • Fix Version/s: 0.13.0
    • Component/s: Tests
    • Labels:
      None

      Description

      Seems like – SORT_BEFORE_DIFF directive is required for test.

      1. HIVE-6407.1.patch
        7 kB
        Thejas M Nair
      2. HIVE-6407.2.patch
        6 kB
        Thejas M Nair
      3. HIVE-6407.3.patch
        7 kB
        Thejas M Nair
      4. HIVE-6407.patch
        1 kB
        Ashutosh Chauhan

        Activity

        Hide
        Ashutosh Chauhan added a comment -

        Simple fix.

        Show
        Ashutosh Chauhan added a comment - Simple fix.
        Hide
        Thejas M Nair added a comment -

        HIVE-6407.1.patch - Takes a different approach - sorts the 'show grant' and 'show role' outputs before printing.

        Show
        Thejas M Nair added a comment - HIVE-6407 .1.patch - Takes a different approach - sorts the 'show grant' and 'show role' outputs before printing.
        Hide
        Ashutosh Chauhan added a comment -

        LGTM +1

        Show
        Ashutosh Chauhan added a comment - LGTM +1
        Hide
        Hive QA added a comment -

        Overall: -1 no tests executed

        Here are the results of testing the latest attachment:
        https://issues.apache.org/jira/secure/attachment/12628356/HIVE-6407.1.patch

        Test results: http://bigtop01.cloudera.org:8080/job/PreCommit-HIVE-Build/1291/testReport
        Console output: http://bigtop01.cloudera.org:8080/job/PreCommit-HIVE-Build/1291/console

        Messages:

        Executing org.apache.hive.ptest.execution.PrepPhase
        Tests exited with: NonZeroExitCodeException
        Command 'bash /data/hive-ptest/working/scratch/source-prep.sh' failed with exit status 1 and output '+ [[ -n '' ]]
        + export 'ANT_OPTS=-Xmx1g -XX:MaxPermSize=256m '
        + ANT_OPTS='-Xmx1g -XX:MaxPermSize=256m '
        + export 'M2_OPTS=-Xmx1g -XX:MaxPermSize=256m -Dhttp.proxyHost=localhost -Dhttp.proxyPort=3128'
        + M2_OPTS='-Xmx1g -XX:MaxPermSize=256m -Dhttp.proxyHost=localhost -Dhttp.proxyPort=3128'
        + cd /data/hive-ptest/working/
        + tee /data/hive-ptest/logs/PreCommit-HIVE-Build-1291/source-prep.txt
        + [[ false == \t\r\u\e ]]
        + mkdir -p maven ivy
        + [[ svn = \s\v\n ]]
        + [[ -n '' ]]
        + [[ -d apache-svn-trunk-source ]]
        + [[ ! -d apache-svn-trunk-source/.svn ]]
        + [[ ! -d apache-svn-trunk-source ]]
        + cd apache-svn-trunk-source
        + svn revert -R .
        Reverted 'metastore/src/test/org/apache/hadoop/hive/metastore/DummyRawStoreControlledCommit.java'
        Reverted 'metastore/src/test/org/apache/hadoop/hive/metastore/DummyRawStoreForJdoConnection.java'
        Reverted 'metastore/src/java/org/apache/hadoop/hive/metastore/RawStore.java'
        Reverted 'metastore/src/java/org/apache/hadoop/hive/metastore/ObjectStore.java'
        Reverted 'metastore/src/java/org/apache/hadoop/hive/metastore/MetaStoreUtils.java'
        Reverted 'metastore/src/java/org/apache/hadoop/hive/metastore/IMetaStoreClient.java'
        Reverted 'metastore/src/java/org/apache/hadoop/hive/metastore/HiveMetaStoreClient.java'
        Reverted 'metastore/src/java/org/apache/hadoop/hive/metastore/MetaStoreDirectSql.java'
        Reverted 'metastore/src/java/org/apache/hadoop/hive/metastore/HiveMetaStore.java'
        Reverted 'metastore/src/gen/thrift/gen-py/hive_metastore/ttypes.py'
        Reverted 'metastore/src/gen/thrift/gen-py/hive_metastore/ThriftHiveMetastore.py'
        Reverted 'metastore/src/gen/thrift/gen-py/hive_metastore/ThriftHiveMetastore-remote'
        Reverted 'metastore/src/gen/thrift/gen-cpp/ThriftHiveMetastore.cpp'
        Reverted 'metastore/src/gen/thrift/gen-cpp/hive_metastore_types.cpp'
        Reverted 'metastore/src/gen/thrift/gen-cpp/ThriftHiveMetastore.h'
        Reverted 'metastore/src/gen/thrift/gen-cpp/hive_metastore_types.h'
        Reverted 'metastore/src/gen/thrift/gen-cpp/ThriftHiveMetastore_server.skeleton.cpp'
        Reverted 'metastore/src/gen/thrift/gen-rb/thrift_hive_metastore.rb'
        Reverted 'metastore/src/gen/thrift/gen-rb/hive_metastore_types.rb'
        Reverted 'metastore/src/gen/thrift/gen-javabean/org/apache/hadoop/hive/metastore/api/ThriftHiveMetastore.java'
        Reverted 'metastore/src/gen/thrift/gen-php/metastore/ThriftHiveMetastore.php'
        Reverted 'metastore/src/gen/thrift/gen-php/metastore/Types.php'
        Reverted 'metastore/if/hive_metastore.thrift'
        Reverted 'ql/src/java/org/apache/hadoop/hive/ql/plan/DropTableDesc.java'
        Reverted 'ql/src/java/org/apache/hadoop/hive/ql/parse/DDLSemanticAnalyzer.java'
        Reverted 'ql/src/java/org/apache/hadoop/hive/ql/metadata/Partition.java'
        Reverted 'ql/src/java/org/apache/hadoop/hive/ql/metadata/Table.java'
        Reverted 'ql/src/java/org/apache/hadoop/hive/ql/metadata/Hive.java'
        Reverted 'ql/src/java/org/apache/hadoop/hive/ql/exec/ArchiveUtils.java'
        Reverted 'ql/src/java/org/apache/hadoop/hive/ql/exec/DDLTask.java'
        ++ egrep -v '^X|^Performing status on external'
        ++ awk '{print $2}'
        ++ svn status --no-ignore
        + rm -rf target datanucleus.log ant/target shims/target shims/0.20/target shims/0.20S/target shims/0.23/target shims/aggregator/target shims/common/target shims/common-secure/target packaging/target hbase-handler/target testutils/target jdbc/target metastore/target metastore/src/gen/thrift/gen-javabean/org/apache/hadoop/hive/metastore/api/DropPartitionsExpr.java metastore/src/gen/thrift/gen-javabean/org/apache/hadoop/hive/metastore/api/DropPartitionsRequest.java metastore/src/gen/thrift/gen-javabean/org/apache/hadoop/hive/metastore/api/RequestPartsSpec.java metastore/src/gen/thrift/gen-javabean/org/apache/hadoop/hive/metastore/api/DropPartitionsResult.java itests/target itests/hcatalog-unit/target itests/test-serde/target itests/qtest/target itests/hive-unit/target itests/custom-serde/target itests/util/target hcatalog/target hcatalog/storage-handlers/hbase/target hcatalog/server-extensions/target hcatalog/core/target hcatalog/webhcat/svr/target hcatalog/webhcat/java-client/target hcatalog/hcatalog-pig-adapter/target hwi/target common/target common/src/gen contrib/target service/target serde/target beeline/target odbc/target cli/target ql/dependency-reduced-pom.xml ql/target
        + svn update
        U    itests/util/src/main/java/org/apache/hadoop/hive/ql/QTestUtil.java
        U    common/src/java/org/apache/hadoop/hive/conf/HiveConf.java
        A    ql/src/test/results/clientnegative/authorization_show_roles_no_admin.q.out
        U    ql/src/test/results/clientnegative/authorization_role_cycles1.q.out
        A    ql/src/test/results/clientnegative/authorization_drop_role_no_admin.q.out
        U    ql/src/test/results/clientnegative/authorization_role_cycles2.q.out
        U    ql/src/test/results/clientnegative/authorization_fail_7.q.out
        A    ql/src/test/results/clientnegative/authorization_create_role_no_admin.q.out
        U    ql/src/test/results/clientpositive/authorization_role_grant1.q.out
        U    ql/src/test/results/clientpositive/authorization_1.q.out
        U    ql/src/test/results/clientpositive/authorization_set_show_current_role.q.out
        U    ql/src/test/results/clientpositive/authorization_view.q.out
        U    ql/src/test/results/clientpositive/authorization_1_sql_std.q.out
        U    ql/src/test/results/clientpositive/authorization_5.q.out
        U    ql/src/test/org/apache/hadoop/hive/ql/parse/authorization/TestHiveAuthorizationTaskFactory.java
        A    ql/src/test/queries/clientnegative/authorization_show_roles_no_admin.q
        A    ql/src/test/queries/clientnegative/authorization_drop_role_no_admin.q
        U    ql/src/test/queries/clientnegative/authorization_role_cycles1.q
        A    ql/src/test/queries/clientnegative/authorization_create_role_no_admin.q
        U    ql/src/test/queries/clientnegative/authorization_role_cycles2.q
        U    ql/src/test/queries/clientpositive/authorization_1_sql_std.q
        U    ql/src/test/queries/clientpositive/authorization_set_show_current_role.q
        U    ql/src/test/queries/clientpositive/authorization_role_grant1.q
        U    ql/src/java/org/apache/hadoop/hive/ql/security/authorization/plugin/HiveAccessControlException.java
        U    ql/src/java/org/apache/hadoop/hive/ql/security/authorization/plugin/HiveAuthorizer.java
        U    ql/src/java/org/apache/hadoop/hive/ql/security/authorization/plugin/HiveAccessController.java
        U    ql/src/java/org/apache/hadoop/hive/ql/security/authorization/plugin/HiveAuthorizerImpl.java
        U    ql/src/java/org/apache/hadoop/hive/ql/security/authorization/plugin/sqlstd/SQLStdHiveAccessController.java
        U    ql/src/java/org/apache/hadoop/hive/ql/parse/authorization/HiveAuthorizationTaskFactoryImpl.java
        
        Fetching external item into 'hcatalog/src/test/e2e/harness'
        Updated external to revision 1567718.
        
        Updated to revision 1567718.
        + patchCommandPath=/data/hive-ptest/working/scratch/smart-apply-patch.sh
        + patchFilePath=/data/hive-ptest/working/scratch/build.patch
        + [[ -f /data/hive-ptest/working/scratch/build.patch ]]
        + chmod +x /data/hive-ptest/working/scratch/smart-apply-patch.sh
        + /data/hive-ptest/working/scratch/smart-apply-patch.sh /data/hive-ptest/working/scratch/build.patch
        The patch does not appear to apply with p0, p1, or p2
        + exit 1
        '
        

        This message is automatically generated.

        ATTACHMENT ID: 12628356

        Show
        Hive QA added a comment - Overall : -1 no tests executed Here are the results of testing the latest attachment: https://issues.apache.org/jira/secure/attachment/12628356/HIVE-6407.1.patch Test results: http://bigtop01.cloudera.org:8080/job/PreCommit-HIVE-Build/1291/testReport Console output: http://bigtop01.cloudera.org:8080/job/PreCommit-HIVE-Build/1291/console Messages: Executing org.apache.hive.ptest.execution.PrepPhase Tests exited with: NonZeroExitCodeException Command 'bash /data/hive-ptest/working/scratch/source-prep.sh' failed with exit status 1 and output '+ [[ -n '' ]] + export 'ANT_OPTS=-Xmx1g -XX:MaxPermSize=256m ' + ANT_OPTS='-Xmx1g -XX:MaxPermSize=256m ' + export 'M2_OPTS=-Xmx1g -XX:MaxPermSize=256m -Dhttp.proxyHost=localhost -Dhttp.proxyPort=3128' + M2_OPTS='-Xmx1g -XX:MaxPermSize=256m -Dhttp.proxyHost=localhost -Dhttp.proxyPort=3128' + cd /data/hive-ptest/working/ + tee /data/hive-ptest/logs/PreCommit-HIVE-Build-1291/source-prep.txt + [[ false == \t\r\u\e ]] + mkdir -p maven ivy + [[ svn = \s\v\n ]] + [[ -n '' ]] + [[ -d apache-svn-trunk-source ]] + [[ ! -d apache-svn-trunk-source/.svn ]] + [[ ! -d apache-svn-trunk-source ]] + cd apache-svn-trunk-source + svn revert -R . Reverted 'metastore/src/test/org/apache/hadoop/hive/metastore/DummyRawStoreControlledCommit.java' Reverted 'metastore/src/test/org/apache/hadoop/hive/metastore/DummyRawStoreForJdoConnection.java' Reverted 'metastore/src/java/org/apache/hadoop/hive/metastore/RawStore.java' Reverted 'metastore/src/java/org/apache/hadoop/hive/metastore/ObjectStore.java' Reverted 'metastore/src/java/org/apache/hadoop/hive/metastore/MetaStoreUtils.java' Reverted 'metastore/src/java/org/apache/hadoop/hive/metastore/IMetaStoreClient.java' Reverted 'metastore/src/java/org/apache/hadoop/hive/metastore/HiveMetaStoreClient.java' Reverted 'metastore/src/java/org/apache/hadoop/hive/metastore/MetaStoreDirectSql.java' Reverted 'metastore/src/java/org/apache/hadoop/hive/metastore/HiveMetaStore.java' Reverted 'metastore/src/gen/thrift/gen-py/hive_metastore/ttypes.py' Reverted 'metastore/src/gen/thrift/gen-py/hive_metastore/ThriftHiveMetastore.py' Reverted 'metastore/src/gen/thrift/gen-py/hive_metastore/ThriftHiveMetastore-remote' Reverted 'metastore/src/gen/thrift/gen-cpp/ThriftHiveMetastore.cpp' Reverted 'metastore/src/gen/thrift/gen-cpp/hive_metastore_types.cpp' Reverted 'metastore/src/gen/thrift/gen-cpp/ThriftHiveMetastore.h' Reverted 'metastore/src/gen/thrift/gen-cpp/hive_metastore_types.h' Reverted 'metastore/src/gen/thrift/gen-cpp/ThriftHiveMetastore_server.skeleton.cpp' Reverted 'metastore/src/gen/thrift/gen-rb/thrift_hive_metastore.rb' Reverted 'metastore/src/gen/thrift/gen-rb/hive_metastore_types.rb' Reverted 'metastore/src/gen/thrift/gen-javabean/org/apache/hadoop/hive/metastore/api/ThriftHiveMetastore.java' Reverted 'metastore/src/gen/thrift/gen-php/metastore/ThriftHiveMetastore.php' Reverted 'metastore/src/gen/thrift/gen-php/metastore/Types.php' Reverted 'metastore/if/hive_metastore.thrift' Reverted 'ql/src/java/org/apache/hadoop/hive/ql/plan/DropTableDesc.java' Reverted 'ql/src/java/org/apache/hadoop/hive/ql/parse/DDLSemanticAnalyzer.java' Reverted 'ql/src/java/org/apache/hadoop/hive/ql/metadata/Partition.java' Reverted 'ql/src/java/org/apache/hadoop/hive/ql/metadata/Table.java' Reverted 'ql/src/java/org/apache/hadoop/hive/ql/metadata/Hive.java' Reverted 'ql/src/java/org/apache/hadoop/hive/ql/exec/ArchiveUtils.java' Reverted 'ql/src/java/org/apache/hadoop/hive/ql/exec/DDLTask.java' ++ egrep -v '^X|^Performing status on external' ++ awk '{print $2}' ++ svn status --no-ignore + rm -rf target datanucleus.log ant/target shims/target shims/0.20/target shims/0.20S/target shims/0.23/target shims/aggregator/target shims/common/target shims/common-secure/target packaging/target hbase-handler/target testutils/target jdbc/target metastore/target metastore/src/gen/thrift/gen-javabean/org/apache/hadoop/hive/metastore/api/DropPartitionsExpr.java metastore/src/gen/thrift/gen-javabean/org/apache/hadoop/hive/metastore/api/DropPartitionsRequest.java metastore/src/gen/thrift/gen-javabean/org/apache/hadoop/hive/metastore/api/RequestPartsSpec.java metastore/src/gen/thrift/gen-javabean/org/apache/hadoop/hive/metastore/api/DropPartitionsResult.java itests/target itests/hcatalog-unit/target itests/test-serde/target itests/qtest/target itests/hive-unit/target itests/custom-serde/target itests/util/target hcatalog/target hcatalog/storage-handlers/hbase/target hcatalog/server-extensions/target hcatalog/core/target hcatalog/webhcat/svr/target hcatalog/webhcat/java-client/target hcatalog/hcatalog-pig-adapter/target hwi/target common/target common/src/gen contrib/target service/target serde/target beeline/target odbc/target cli/target ql/dependency-reduced-pom.xml ql/target + svn update U itests/util/src/main/java/org/apache/hadoop/hive/ql/QTestUtil.java U common/src/java/org/apache/hadoop/hive/conf/HiveConf.java A ql/src/test/results/clientnegative/authorization_show_roles_no_admin.q.out U ql/src/test/results/clientnegative/authorization_role_cycles1.q.out A ql/src/test/results/clientnegative/authorization_drop_role_no_admin.q.out U ql/src/test/results/clientnegative/authorization_role_cycles2.q.out U ql/src/test/results/clientnegative/authorization_fail_7.q.out A ql/src/test/results/clientnegative/authorization_create_role_no_admin.q.out U ql/src/test/results/clientpositive/authorization_role_grant1.q.out U ql/src/test/results/clientpositive/authorization_1.q.out U ql/src/test/results/clientpositive/authorization_set_show_current_role.q.out U ql/src/test/results/clientpositive/authorization_view.q.out U ql/src/test/results/clientpositive/authorization_1_sql_std.q.out U ql/src/test/results/clientpositive/authorization_5.q.out U ql/src/test/org/apache/hadoop/hive/ql/parse/authorization/TestHiveAuthorizationTaskFactory.java A ql/src/test/queries/clientnegative/authorization_show_roles_no_admin.q A ql/src/test/queries/clientnegative/authorization_drop_role_no_admin.q U ql/src/test/queries/clientnegative/authorization_role_cycles1.q A ql/src/test/queries/clientnegative/authorization_create_role_no_admin.q U ql/src/test/queries/clientnegative/authorization_role_cycles2.q U ql/src/test/queries/clientpositive/authorization_1_sql_std.q U ql/src/test/queries/clientpositive/authorization_set_show_current_role.q U ql/src/test/queries/clientpositive/authorization_role_grant1.q U ql/src/java/org/apache/hadoop/hive/ql/security/authorization/plugin/HiveAccessControlException.java U ql/src/java/org/apache/hadoop/hive/ql/security/authorization/plugin/HiveAuthorizer.java U ql/src/java/org/apache/hadoop/hive/ql/security/authorization/plugin/HiveAccessController.java U ql/src/java/org/apache/hadoop/hive/ql/security/authorization/plugin/HiveAuthorizerImpl.java U ql/src/java/org/apache/hadoop/hive/ql/security/authorization/plugin/sqlstd/SQLStdHiveAccessController.java U ql/src/java/org/apache/hadoop/hive/ql/parse/authorization/HiveAuthorizationTaskFactoryImpl.java Fetching external item into 'hcatalog/src/test/e2e/harness' Updated external to revision 1567718. Updated to revision 1567718. + patchCommandPath=/data/hive-ptest/working/scratch/smart-apply-patch.sh + patchFilePath=/data/hive-ptest/working/scratch/build.patch + [[ -f /data/hive-ptest/working/scratch/build.patch ]] + chmod +x /data/hive-ptest/working/scratch/smart-apply-patch.sh + /data/hive-ptest/working/scratch/smart-apply-patch.sh /data/hive-ptest/working/scratch/build.patch The patch does not appear to apply with p0, p1, or p2 + exit 1 ' This message is automatically generated. ATTACHMENT ID: 12628356
        Hide
        Thejas M Nair added a comment -

        HIVE-6407.2.patch - patch rebased to resolve conflicts with test files.

        Show
        Thejas M Nair added a comment - HIVE-6407 .2.patch - patch rebased to resolve conflicts with test files.
        Hide
        Hive QA added a comment -

        Overall: -1 at least one tests failed

        Here are the results of testing the latest attachment:
        https://issues.apache.org/jira/secure/attachment/12628543/HIVE-6407.2.patch

        ERROR: -1 due to 3 failed/errored test(s), 5087 tests executed
        Failed tests:

        org.apache.hadoop.hive.cli.TestMinimrCliDriver.testCliDriver_root_dir_external_table
        org.apache.hadoop.hive.jdbc.TestJdbcDriver.testShowRoleGrant
        org.apache.hive.jdbc.TestJdbcDriver2.testShowRoleGrant
        

        Test results: http://bigtop01.cloudera.org:8080/job/PreCommit-HIVE-Build/1295/testReport
        Console output: http://bigtop01.cloudera.org:8080/job/PreCommit-HIVE-Build/1295/console

        Messages:

        Executing org.apache.hive.ptest.execution.PrepPhase
        Executing org.apache.hive.ptest.execution.ExecutionPhase
        Executing org.apache.hive.ptest.execution.ReportingPhase
        Tests exited with: TestsFailedException: 3 tests failed
        

        This message is automatically generated.

        ATTACHMENT ID: 12628543

        Show
        Hive QA added a comment - Overall : -1 at least one tests failed Here are the results of testing the latest attachment: https://issues.apache.org/jira/secure/attachment/12628543/HIVE-6407.2.patch ERROR: -1 due to 3 failed/errored test(s), 5087 tests executed Failed tests: org.apache.hadoop.hive.cli.TestMinimrCliDriver.testCliDriver_root_dir_external_table org.apache.hadoop.hive.jdbc.TestJdbcDriver.testShowRoleGrant org.apache.hive.jdbc.TestJdbcDriver2.testShowRoleGrant Test results: http://bigtop01.cloudera.org:8080/job/PreCommit-HIVE-Build/1295/testReport Console output: http://bigtop01.cloudera.org:8080/job/PreCommit-HIVE-Build/1295/console Messages: Executing org.apache.hive.ptest.execution.PrepPhase Executing org.apache.hive.ptest.execution.ExecutionPhase Executing org.apache.hive.ptest.execution.ReportingPhase Tests exited with: TestsFailedException: 3 tests failed This message is automatically generated. ATTACHMENT ID: 12628543
        Hide
        Thejas M Nair added a comment -

        HIVE-6407.3.patch - fixing the 2 TestJdbcDriver* test failures

        Show
        Thejas M Nair added a comment - HIVE-6407 .3.patch - fixing the 2 TestJdbcDriver* test failures
        Hide
        Hive QA added a comment -

        Overall: -1 at least one tests failed

        Here are the results of testing the latest attachment:
        https://issues.apache.org/jira/secure/attachment/12628636/HIVE-6407.3.patch

        ERROR: -1 due to 2 failed/errored test(s), 5061 tests executed
        Failed tests:

        org.apache.hadoop.hive.cli.TestMinimrCliDriver.testCliDriver_auto_sortmerge_join_16
        org.apache.hadoop.hive.cli.TestMinimrCliDriver.testCliDriver_root_dir_external_table
        

        Test results: http://bigtop01.cloudera.org:8080/job/PreCommit-HIVE-Build/1307/testReport
        Console output: http://bigtop01.cloudera.org:8080/job/PreCommit-HIVE-Build/1307/console

        Messages:

        Executing org.apache.hive.ptest.execution.PrepPhase
        Executing org.apache.hive.ptest.execution.ExecutionPhase
        Executing org.apache.hive.ptest.execution.ReportingPhase
        Tests exited with: TestsFailedException: 2 tests failed
        

        This message is automatically generated.

        ATTACHMENT ID: 12628636

        Show
        Hive QA added a comment - Overall : -1 at least one tests failed Here are the results of testing the latest attachment: https://issues.apache.org/jira/secure/attachment/12628636/HIVE-6407.3.patch ERROR: -1 due to 2 failed/errored test(s), 5061 tests executed Failed tests: org.apache.hadoop.hive.cli.TestMinimrCliDriver.testCliDriver_auto_sortmerge_join_16 org.apache.hadoop.hive.cli.TestMinimrCliDriver.testCliDriver_root_dir_external_table Test results: http://bigtop01.cloudera.org:8080/job/PreCommit-HIVE-Build/1307/testReport Console output: http://bigtop01.cloudera.org:8080/job/PreCommit-HIVE-Build/1307/console Messages: Executing org.apache.hive.ptest.execution.PrepPhase Executing org.apache.hive.ptest.execution.ExecutionPhase Executing org.apache.hive.ptest.execution.ReportingPhase Tests exited with: TestsFailedException: 2 tests failed This message is automatically generated. ATTACHMENT ID: 12628636
        Hide
        Ashutosh Chauhan added a comment -

        Committed to trunk. Thanks, Thejas!

        Show
        Ashutosh Chauhan added a comment - Committed to trunk. Thanks, Thejas!

          People

          • Assignee:
            Thejas M Nair
            Reporter:
            Ashutosh Chauhan
          • Votes:
            0 Vote for this issue
            Watchers:
            1 Start watching this issue

            Dates

            • Created:
              Updated:
              Resolved:

              Development