Details

    • Type: Sub-task Sub-task
    • Status: Resolved
    • Priority: Major Major
    • Resolution: Fixed
    • Affects Version/s: 0.13.0
    • Fix Version/s: 0.13.0
    • Component/s: HiveServer2
    • Labels:
      None

      Description

      Current http implementation does not have support for https

      1. HIVE-5826.1.patch
        12 kB
        Vaibhav Gumashta
      2. HIVE-5826.2.patch
        36 kB
        Vaibhav Gumashta
      3. HIVE-5826.3.patch
        42 kB
        Vaibhav Gumashta
      4. HIVE-5826.4.patch
        55 kB
        Vaibhav Gumashta
      5. HIVE-5826.5.patch
        55 kB
        Vaibhav Gumashta

        Issue Links

          Activity

          Hide
          Vaibhav Gumashta added a comment -
          Show
          Vaibhav Gumashta added a comment - Review board: https://reviews.apache.org/r/17422/
          Hide
          Vaibhav Gumashta added a comment -

          Some formatting issues remain in the patch - will upload a new one after the reviews.

          Show
          Vaibhav Gumashta added a comment - Some formatting issues remain in the patch - will upload a new one after the reviews.
          Hide
          Hive QA added a comment -

          Overall: -1 at least one tests failed

          Here are the results of testing the latest attachment:
          https://issues.apache.org/jira/secure/attachment/12625485/HIVE-5826.3.patch

          ERROR: -1 due to 5 failed/errored test(s), 4962 tests executed
          Failed tests:

          org.apache.hadoop.hive.cli.TestMinimrCliDriver.testCliDriver_bucket_num_reducers
          org.apache.hadoop.hive.cli.TestMinimrCliDriver.testCliDriver_import_exported_table
          org.apache.hadoop.hive.cli.TestMinimrCliDriver.testCliDriver_load_hdfs_file_with_space_in_the_name
          org.apache.hadoop.hive.cli.TestNegativeMinimrCliDriver.testNegativeCliDriver_file_with_header_footer_negative
          org.apache.hcatalog.hbase.TestHCatHBaseInputFormat.TestHBaseTableReadMR
          

          Test results: http://bigtop01.cloudera.org:8080/job/PreCommit-HIVE-Build/1057/testReport
          Console output: http://bigtop01.cloudera.org:8080/job/PreCommit-HIVE-Build/1057/console

          Messages:

          Executing org.apache.hive.ptest.execution.PrepPhase
          Executing org.apache.hive.ptest.execution.ExecutionPhase
          Executing org.apache.hive.ptest.execution.ReportingPhase
          Tests exited with: TestsFailedException: 5 tests failed
          

          This message is automatically generated.

          ATTACHMENT ID: 12625485

          Show
          Hive QA added a comment - Overall : -1 at least one tests failed Here are the results of testing the latest attachment: https://issues.apache.org/jira/secure/attachment/12625485/HIVE-5826.3.patch ERROR: -1 due to 5 failed/errored test(s), 4962 tests executed Failed tests: org.apache.hadoop.hive.cli.TestMinimrCliDriver.testCliDriver_bucket_num_reducers org.apache.hadoop.hive.cli.TestMinimrCliDriver.testCliDriver_import_exported_table org.apache.hadoop.hive.cli.TestMinimrCliDriver.testCliDriver_load_hdfs_file_with_space_in_the_name org.apache.hadoop.hive.cli.TestNegativeMinimrCliDriver.testNegativeCliDriver_file_with_header_footer_negative org.apache.hcatalog.hbase.TestHCatHBaseInputFormat.TestHBaseTableReadMR Test results: http://bigtop01.cloudera.org:8080/job/PreCommit-HIVE-Build/1057/testReport Console output: http://bigtop01.cloudera.org:8080/job/PreCommit-HIVE-Build/1057/console Messages: Executing org.apache.hive.ptest.execution.PrepPhase Executing org.apache.hive.ptest.execution.ExecutionPhase Executing org.apache.hive.ptest.execution.ReportingPhase Tests exited with: TestsFailedException: 5 tests failed This message is automatically generated. ATTACHMENT ID: 12625485
          Hide
          Vaibhav Gumashta added a comment -

          Changes per the feedback + fixed formatting.

          Show
          Vaibhav Gumashta added a comment - Changes per the feedback + fixed formatting.
          Hide
          Vaibhav Gumashta added a comment -

          Rebased on trunk.

          Show
          Vaibhav Gumashta added a comment - Rebased on trunk.
          Hide
          Hive QA added a comment -

          Overall: -1 at least one tests failed

          Here are the results of testing the latest attachment:
          https://issues.apache.org/jira/secure/attachment/12626952/HIVE-5826.5.patch

          ERROR: -1 due to 1 failed/errored test(s), 5011 tests executed
          Failed tests:

          org.apache.hadoop.hive.cli.TestMinimrCliDriver.testCliDriver_auto_sortmerge_join_16
          

          Test results: http://bigtop01.cloudera.org:8080/job/PreCommit-HIVE-Build/1188/testReport
          Console output: http://bigtop01.cloudera.org:8080/job/PreCommit-HIVE-Build/1188/console

          Messages:

          Executing org.apache.hive.ptest.execution.PrepPhase
          Executing org.apache.hive.ptest.execution.ExecutionPhase
          Executing org.apache.hive.ptest.execution.ReportingPhase
          Tests exited with: TestsFailedException: 1 tests failed
          

          This message is automatically generated.

          ATTACHMENT ID: 12626952

          Show
          Hive QA added a comment - Overall : -1 at least one tests failed Here are the results of testing the latest attachment: https://issues.apache.org/jira/secure/attachment/12626952/HIVE-5826.5.patch ERROR: -1 due to 1 failed/errored test(s), 5011 tests executed Failed tests: org.apache.hadoop.hive.cli.TestMinimrCliDriver.testCliDriver_auto_sortmerge_join_16 Test results: http://bigtop01.cloudera.org:8080/job/PreCommit-HIVE-Build/1188/testReport Console output: http://bigtop01.cloudera.org:8080/job/PreCommit-HIVE-Build/1188/console Messages: Executing org.apache.hive.ptest.execution.PrepPhase Executing org.apache.hive.ptest.execution.ExecutionPhase Executing org.apache.hive.ptest.execution.ReportingPhase Tests exited with: TestsFailedException: 1 tests failed This message is automatically generated. ATTACHMENT ID: 12626952
          Hide
          Thejas M Nair added a comment -

          Patch committed to trunk. Thanks for the contribution Vaibhav!
          (Patch had been +1'd in review board).

          Show
          Thejas M Nair added a comment - Patch committed to trunk. Thanks for the contribution Vaibhav! (Patch had been +1'd in review board).
          Hide
          Thejas M Nair added a comment -

          Vaibhav, can you please add the release note type information in this or the linked follow up documentation jira ?

          Show
          Thejas M Nair added a comment - Vaibhav, can you please add the release note type information in this or the linked follow up documentation jira ?
          Hide
          Vaibhav Gumashta added a comment -

          Thejas M Nair Sure, will add that. Thanks for the nudge!

          Show
          Vaibhav Gumashta added a comment - Thejas M Nair Sure, will add that. Thanks for the nudge!

            People

            • Assignee:
              Vaibhav Gumashta
              Reporter:
              Vaibhav Gumashta
            • Votes:
              0 Vote for this issue
              Watchers:
              3 Start watching this issue

              Dates

              • Created:
                Updated:
                Resolved:

                Development