Uploaded image for project: 'Hive'
  1. Hive
  2. HIVE-22942 Replace PTest with an alternative
  3. HIVE-23450

TestMiniDruidCliDriver#testCliDriver[druid_materialized_view_rewrite_ssb] is flaky

    XMLWordPrintableJSON

    Details

    • Type: Sub-task
    • Status: Open
    • Priority: Major
    • Resolution: Unresolved
    • Affects Version/s: None
    • Fix Version/s: None
    • Component/s: None
    • Labels:
      None

      Description

      https://builds.apache.org/job/PreCommit-HIVE-Build/22267/testReport/junit/org.apache.hadoop.hive.cli/TestMiniDruidCliDriver/testCliDriver_druid_materialized_view_rewrite_ssb_/

      error tends to be:

      [ERROR] Tests run: 14, Failures: 1, Errors: 0, Skipped: 0, Time elapsed: 952.613 s <<< FAILURE! - in org.apache.hadoop.hive.cli.TestMiniDruidCliDriver
      [ERROR] testCliDriver[druid_materialized_view_rewrite_ssb](org.apache.hadoop.hive.cli.TestMiniDruidCliDriver)  Time elapsed: 31.851 s  <<< FAILURE!
      java.lang.AssertionError: 
      Client execution failed with error code = 1 
      running 
      
      SELECT MONTH(`__time`) AS `mn___time_ok`,
      CAST((MONTH(`__time`) - 1) / 3 + 1 AS BIGINT) AS `qr___time_ok`,
      SUM(1) AS `sum_number_of_records_ok`,
      YEAR(`__time`) AS `yr___time_ok`
      FROM `ssb_mv_druid_100`
      GROUP BY MONTH(`__time`),
      CAST((MONTH(`__time`) - 1) / 3 + 1 AS BIGINT),
      YEAR(`__time`) 
      fname=druid_materialized_view_rewrite_ssb.q
      

        Attachments

        1. hive.log.gz
          7.24 MB
          Zoltan Haindrich

          Activity

            People

            • Assignee:
              jcamachorodriguez Jesus Camacho Rodriguez
              Reporter:
              kgyrtkirk Zoltan Haindrich
            • Votes:
              0 Vote for this issue
              Watchers:
              2 Start watching this issue

              Dates

              • Created:
                Updated: