Details

    • Type: New Feature
    • Status: Closed
    • Priority: Major
    • Resolution: Fixed
    • Affects Version/s: None
    • Fix Version/s: 2.2.0
    • Component/s: Druid integration
    • Labels:

      Description

      Allow Hive to query data in Druid

      1. HIVE-14217.06.patch
        409 kB
        Jesus Camacho Rodriguez
      2. HIVE-14217.05.patch
        398 kB
        Jesus Camacho Rodriguez
      3. HIVE-14217.04.patch
        397 kB
        Jesus Camacho Rodriguez
      4. HIVE-14217.03.patch
        397 kB
        Jesus Camacho Rodriguez
      5. HIVE-14217.02.patch
        379 kB
        Jesus Camacho Rodriguez
      6. HIVE-14217.01.patch
        375 kB
        Jesus Camacho Rodriguez

        Issue Links

          Activity

          Hide
          leftylev Lefty Leverenz added a comment - - edited

          Doc note: In addition to the Druid Integration wikidoc, two new configuration parameters (hive.druid.broker.address.default & hive.druid.select.threshold) and the druid.datasource table property need to be documented in other wikidocs.

          There may be other things too – I'll find them when I review the Druid Integration doc. I've already added Druid Integration to the wiki's home page.

          Added a TODOC2.2 label.

          Edit (22/Feb/17): HIVE-15928 revises the description of hive.druid.select.threshold in 2.2.0, so that's description to document.

          Show
          leftylev Lefty Leverenz added a comment - - edited Doc note: In addition to the Druid Integration wikidoc, two new configuration parameters ( hive.druid.broker.address.default & hive.druid.select.threshold ) and the druid.datasource table property need to be documented in other wikidocs. Configuration Properties – Query and DDL Execution DDL – Table Properties There may be other things too – I'll find them when I review the Druid Integration doc. I've already added Druid Integration to the wiki's home page. Added a TODOC2.2 label. Edit (22/Feb/17): HIVE-15928 revises the description of hive.druid.select.threshold in 2.2.0, so that's description to document.
          Hide
          jcamachorodriguez Jesus Camacho Rodriguez added a comment -

          Pushed to master, thanks for the review Ashutosh Chauhan!

          I have updated the wiki with the last changes:
          https://cwiki.apache.org/confluence/display/Hive/Druid+Integration

          Commit includes all the subtasks under this umbrella too.

          Show
          jcamachorodriguez Jesus Camacho Rodriguez added a comment - Pushed to master, thanks for the review Ashutosh Chauhan ! I have updated the wiki with the last changes: https://cwiki.apache.org/confluence/display/Hive/Druid+Integration Commit includes all the subtasks under this umbrella too.
          Hide
          githubbot ASF GitHub Bot added a comment -

          Github user asfgit closed the pull request at:

          https://github.com/apache/hive/pull/98

          Show
          githubbot ASF GitHub Bot added a comment - Github user asfgit closed the pull request at: https://github.com/apache/hive/pull/98
          Hide
          ashutoshc Ashutosh Chauhan added a comment -

          +1

          Show
          ashutoshc Ashutosh Chauhan added a comment - +1
          Hide
          hiveqa Hive QA added a comment -

          Here are the results of testing the latest attachment:
          https://issues.apache.org/jira/secure/attachment/12827435/HIVE-14217.06.patch

          SUCCESS: +1 due to 17 test(s) being added or modified.

          ERROR: -1 due to 10 failed/errored test(s), 10476 tests executed
          Failed tests:

          TestBeeLineWithArgs - did not produce a TEST-*.xml file
          TestHiveCli - did not produce a TEST-*.xml file
          org.apache.hadoop.hive.cli.TestCliDriver.org.apache.hadoop.hive.cli.TestCliDriver
          org.apache.hadoop.hive.cli.TestCliDriver.testCliDriver[acid_mapjoin]
          org.apache.hadoop.hive.cli.TestCliDriver.testCliDriver[dynpart_sort_optimization_acid]
          org.apache.hadoop.hive.cli.TestCliDriver.testCliDriver[stats0]
          org.apache.hadoop.hive.cli.TestCliDriver.testCliDriver[vector_join_part_col_char]
          org.apache.hadoop.hive.cli.TestMiniLlapCliDriver.testCliDriver[acid_bucket_pruning]
          org.apache.hadoop.hive.cli.TestMiniTezCliDriver.testCliDriver[explainuser_3]
          org.apache.hive.jdbc.TestJdbcWithMiniHS2.testAddJarConstructorUnCaching
          

          Test results: https://builds.apache.org/job/PreCommit-HIVE-MASTER-Build/1125/testReport
          Console output: https://builds.apache.org/job/PreCommit-HIVE-MASTER-Build/1125/console
          Test logs: http://ec2-204-236-174-241.us-west-1.compute.amazonaws.com/logs/PreCommit-HIVE-MASTER-Build-1125/

          Messages:

          Executing org.apache.hive.ptest.execution.TestCheckPhase
          Executing org.apache.hive.ptest.execution.PrepPhase
          Executing org.apache.hive.ptest.execution.ExecutionPhase
          Executing org.apache.hive.ptest.execution.ReportingPhase
          Tests exited with: TestsFailedException: 10 tests failed
          

          This message is automatically generated.

          ATTACHMENT ID: 12827435 - PreCommit-HIVE-MASTER-Build

          Show
          hiveqa Hive QA added a comment - Here are the results of testing the latest attachment: https://issues.apache.org/jira/secure/attachment/12827435/HIVE-14217.06.patch SUCCESS: +1 due to 17 test(s) being added or modified. ERROR: -1 due to 10 failed/errored test(s), 10476 tests executed Failed tests: TestBeeLineWithArgs - did not produce a TEST-*.xml file TestHiveCli - did not produce a TEST-*.xml file org.apache.hadoop.hive.cli.TestCliDriver.org.apache.hadoop.hive.cli.TestCliDriver org.apache.hadoop.hive.cli.TestCliDriver.testCliDriver[acid_mapjoin] org.apache.hadoop.hive.cli.TestCliDriver.testCliDriver[dynpart_sort_optimization_acid] org.apache.hadoop.hive.cli.TestCliDriver.testCliDriver[stats0] org.apache.hadoop.hive.cli.TestCliDriver.testCliDriver[vector_join_part_col_char] org.apache.hadoop.hive.cli.TestMiniLlapCliDriver.testCliDriver[acid_bucket_pruning] org.apache.hadoop.hive.cli.TestMiniTezCliDriver.testCliDriver[explainuser_3] org.apache.hive.jdbc.TestJdbcWithMiniHS2.testAddJarConstructorUnCaching Test results: https://builds.apache.org/job/PreCommit-HIVE-MASTER-Build/1125/testReport Console output: https://builds.apache.org/job/PreCommit-HIVE-MASTER-Build/1125/console Test logs: http://ec2-204-236-174-241.us-west-1.compute.amazonaws.com/logs/PreCommit-HIVE-MASTER-Build-1125/ Messages: Executing org.apache.hive.ptest.execution.TestCheckPhase Executing org.apache.hive.ptest.execution.PrepPhase Executing org.apache.hive.ptest.execution.ExecutionPhase Executing org.apache.hive.ptest.execution.ReportingPhase Tests exited with: TestsFailedException: 10 tests failed This message is automatically generated. ATTACHMENT ID: 12827435 - PreCommit-HIVE-MASTER-Build
          Hide
          hiveqa Hive QA added a comment -

          Here are the results of testing the latest attachment:
          https://issues.apache.org/jira/secure/attachment/12826494/HIVE-14217.05.patch

          SUCCESS: +1 due to 17 test(s) being added or modified.

          ERROR: -1 due to 5 failed/errored test(s), 10499 tests executed
          Failed tests:

          TestMiniTezCliDriver-update_orig_table.q-vectorization_limit.q-explainanalyze_3.q-and-17-more - did not produce a TEST-*.xml file
          org.apache.hadoop.hive.cli.TestCliDriver.org.apache.hadoop.hive.cli.TestCliDriver
          org.apache.hadoop.hive.cli.TestCliDriver.testCliDriver[acid_mapjoin]
          org.apache.hadoop.hive.cli.TestCliDriver.testCliDriver[vector_join_part_col_char]
          org.apache.hive.jdbc.TestJdbcWithMiniHS2.testAddJarConstructorUnCaching
          

          Test results: https://builds.apache.org/job/PreCommit-HIVE-MASTER-Build/1063/testReport
          Console output: https://builds.apache.org/job/PreCommit-HIVE-MASTER-Build/1063/console
          Test logs: http://ec2-204-236-174-241.us-west-1.compute.amazonaws.com/logs/PreCommit-HIVE-MASTER-Build-1063/

          Messages:

          Executing org.apache.hive.ptest.execution.TestCheckPhase
          Executing org.apache.hive.ptest.execution.PrepPhase
          Executing org.apache.hive.ptest.execution.ExecutionPhase
          Executing org.apache.hive.ptest.execution.ReportingPhase
          Tests exited with: TestsFailedException: 5 tests failed
          

          This message is automatically generated.

          ATTACHMENT ID: 12826494 - PreCommit-HIVE-MASTER-Build

          Show
          hiveqa Hive QA added a comment - Here are the results of testing the latest attachment: https://issues.apache.org/jira/secure/attachment/12826494/HIVE-14217.05.patch SUCCESS: +1 due to 17 test(s) being added or modified. ERROR: -1 due to 5 failed/errored test(s), 10499 tests executed Failed tests: TestMiniTezCliDriver-update_orig_table.q-vectorization_limit.q-explainanalyze_3.q-and-17-more - did not produce a TEST-*.xml file org.apache.hadoop.hive.cli.TestCliDriver.org.apache.hadoop.hive.cli.TestCliDriver org.apache.hadoop.hive.cli.TestCliDriver.testCliDriver[acid_mapjoin] org.apache.hadoop.hive.cli.TestCliDriver.testCliDriver[vector_join_part_col_char] org.apache.hive.jdbc.TestJdbcWithMiniHS2.testAddJarConstructorUnCaching Test results: https://builds.apache.org/job/PreCommit-HIVE-MASTER-Build/1063/testReport Console output: https://builds.apache.org/job/PreCommit-HIVE-MASTER-Build/1063/console Test logs: http://ec2-204-236-174-241.us-west-1.compute.amazonaws.com/logs/PreCommit-HIVE-MASTER-Build-1063/ Messages: Executing org.apache.hive.ptest.execution.TestCheckPhase Executing org.apache.hive.ptest.execution.PrepPhase Executing org.apache.hive.ptest.execution.ExecutionPhase Executing org.apache.hive.ptest.execution.ReportingPhase Tests exited with: TestsFailedException: 5 tests failed This message is automatically generated. ATTACHMENT ID: 12826494 - PreCommit-HIVE-MASTER-Build
          Hide
          jcamachorodriguez Jesus Camacho Rodriguez added a comment -

          Rebasing and updating last q file.

          Show
          jcamachorodriguez Jesus Camacho Rodriguez added a comment - Rebasing and updating last q file.
          Hide
          hiveqa Hive QA added a comment -

          Here are the results of testing the latest attachment:
          https://issues.apache.org/jira/secure/attachment/12826465/HIVE-14217.04.patch

          SUCCESS: +1 due to 17 test(s) being added or modified.

          ERROR: -1 due to 6 failed/errored test(s), 10516 tests executed
          Failed tests:

          org.apache.hadoop.hive.cli.TestCliDriver.org.apache.hadoop.hive.cli.TestCliDriver
          org.apache.hadoop.hive.cli.TestCliDriver.testCliDriver[vector_join_part_col_char]
          org.apache.hadoop.hive.cli.TestMiniLlapCliDriver.testCliDriver[explainuser_1]
          org.apache.hadoop.hive.cli.TestMiniTezCliDriver.testCliDriver[explainuser_3]
          org.apache.hadoop.hive.ql.TestMTQueries.testMTQueries1
          org.apache.hive.jdbc.TestJdbcWithMiniHS2.testAddJarConstructorUnCaching
          

          Test results: https://builds.apache.org/job/PreCommit-HIVE-MASTER-Build/1059/testReport
          Console output: https://builds.apache.org/job/PreCommit-HIVE-MASTER-Build/1059/console
          Test logs: http://ec2-204-236-174-241.us-west-1.compute.amazonaws.com/logs/PreCommit-HIVE-MASTER-Build-1059/

          Messages:

          Executing org.apache.hive.ptest.execution.TestCheckPhase
          Executing org.apache.hive.ptest.execution.PrepPhase
          Executing org.apache.hive.ptest.execution.ExecutionPhase
          Executing org.apache.hive.ptest.execution.ReportingPhase
          Tests exited with: TestsFailedException: 6 tests failed
          

          This message is automatically generated.

          ATTACHMENT ID: 12826465 - PreCommit-HIVE-MASTER-Build

          Show
          hiveqa Hive QA added a comment - Here are the results of testing the latest attachment: https://issues.apache.org/jira/secure/attachment/12826465/HIVE-14217.04.patch SUCCESS: +1 due to 17 test(s) being added or modified. ERROR: -1 due to 6 failed/errored test(s), 10516 tests executed Failed tests: org.apache.hadoop.hive.cli.TestCliDriver.org.apache.hadoop.hive.cli.TestCliDriver org.apache.hadoop.hive.cli.TestCliDriver.testCliDriver[vector_join_part_col_char] org.apache.hadoop.hive.cli.TestMiniLlapCliDriver.testCliDriver[explainuser_1] org.apache.hadoop.hive.cli.TestMiniTezCliDriver.testCliDriver[explainuser_3] org.apache.hadoop.hive.ql.TestMTQueries.testMTQueries1 org.apache.hive.jdbc.TestJdbcWithMiniHS2.testAddJarConstructorUnCaching Test results: https://builds.apache.org/job/PreCommit-HIVE-MASTER-Build/1059/testReport Console output: https://builds.apache.org/job/PreCommit-HIVE-MASTER-Build/1059/console Test logs: http://ec2-204-236-174-241.us-west-1.compute.amazonaws.com/logs/PreCommit-HIVE-MASTER-Build-1059/ Messages: Executing org.apache.hive.ptest.execution.TestCheckPhase Executing org.apache.hive.ptest.execution.PrepPhase Executing org.apache.hive.ptest.execution.ExecutionPhase Executing org.apache.hive.ptest.execution.ReportingPhase Tests exited with: TestsFailedException: 6 tests failed This message is automatically generated. ATTACHMENT ID: 12826465 - PreCommit-HIVE-MASTER-Build
          Hide
          jcamachorodriguez Jesus Camacho Rodriguez added a comment -

          Ashutosh Chauhan, latest PR (and patch) addresses all the comments left in the reviews. I also updated the last q files; QA should come clean.

          Show
          jcamachorodriguez Jesus Camacho Rodriguez added a comment - Ashutosh Chauhan , latest PR (and patch) addresses all the comments left in the reviews. I also updated the last q files; QA should come clean.
          Hide
          hiveqa Hive QA added a comment -

          Here are the results of testing the latest attachment:
          https://issues.apache.org/jira/secure/attachment/12825684/HIVE-14217.03.patch

          SUCCESS: +1 due to 17 test(s) being added or modified.

          ERROR: -1 due to 10 failed/errored test(s), 10477 tests executed
          Failed tests:

          org.apache.hadoop.hive.cli.TestCliDriver.org.apache.hadoop.hive.cli.TestCliDriver
          org.apache.hadoop.hive.cli.TestCliDriver.testCliDriver[acid_mapjoin]
          org.apache.hadoop.hive.cli.TestCliDriver.testCliDriver[ctas]
          org.apache.hadoop.hive.cli.TestCliDriver.testCliDriver[vector_join_part_col_char]
          org.apache.hadoop.hive.cli.TestMiniLlapCliDriver.testCliDriver[acid_bucket_pruning]
          org.apache.hadoop.hive.cli.TestMiniLlapCliDriver.testCliDriver[explainuser_1]
          org.apache.hadoop.hive.cli.TestMiniTezCliDriver.testCliDriver[explainuser_3]
          org.apache.hadoop.hive.cli.TestMinimrCliDriver.testCliDriver[schemeAuthority2]
          org.apache.hadoop.hive.cli.TestSparkCliDriver.testCliDriver[join_view]
          org.apache.hive.jdbc.TestJdbcWithMiniHS2.testAddJarConstructorUnCaching
          

          Test results: https://builds.apache.org/job/PreCommit-HIVE-MASTER-Build/1016/testReport
          Console output: https://builds.apache.org/job/PreCommit-HIVE-MASTER-Build/1016/console
          Test logs: http://ec2-204-236-174-241.us-west-1.compute.amazonaws.com/logs/PreCommit-HIVE-MASTER-Build-1016/

          Messages:

          Executing org.apache.hive.ptest.execution.TestCheckPhase
          Executing org.apache.hive.ptest.execution.PrepPhase
          Executing org.apache.hive.ptest.execution.ExecutionPhase
          Executing org.apache.hive.ptest.execution.ReportingPhase
          Tests exited with: TestsFailedException: 10 tests failed
          

          This message is automatically generated.

          ATTACHMENT ID: 12825684 - PreCommit-HIVE-MASTER-Build

          Show
          hiveqa Hive QA added a comment - Here are the results of testing the latest attachment: https://issues.apache.org/jira/secure/attachment/12825684/HIVE-14217.03.patch SUCCESS: +1 due to 17 test(s) being added or modified. ERROR: -1 due to 10 failed/errored test(s), 10477 tests executed Failed tests: org.apache.hadoop.hive.cli.TestCliDriver.org.apache.hadoop.hive.cli.TestCliDriver org.apache.hadoop.hive.cli.TestCliDriver.testCliDriver[acid_mapjoin] org.apache.hadoop.hive.cli.TestCliDriver.testCliDriver[ctas] org.apache.hadoop.hive.cli.TestCliDriver.testCliDriver[vector_join_part_col_char] org.apache.hadoop.hive.cli.TestMiniLlapCliDriver.testCliDriver[acid_bucket_pruning] org.apache.hadoop.hive.cli.TestMiniLlapCliDriver.testCliDriver[explainuser_1] org.apache.hadoop.hive.cli.TestMiniTezCliDriver.testCliDriver[explainuser_3] org.apache.hadoop.hive.cli.TestMinimrCliDriver.testCliDriver[schemeAuthority2] org.apache.hadoop.hive.cli.TestSparkCliDriver.testCliDriver[join_view] org.apache.hive.jdbc.TestJdbcWithMiniHS2.testAddJarConstructorUnCaching Test results: https://builds.apache.org/job/PreCommit-HIVE-MASTER-Build/1016/testReport Console output: https://builds.apache.org/job/PreCommit-HIVE-MASTER-Build/1016/console Test logs: http://ec2-204-236-174-241.us-west-1.compute.amazonaws.com/logs/PreCommit-HIVE-MASTER-Build-1016/ Messages: Executing org.apache.hive.ptest.execution.TestCheckPhase Executing org.apache.hive.ptest.execution.PrepPhase Executing org.apache.hive.ptest.execution.ExecutionPhase Executing org.apache.hive.ptest.execution.ReportingPhase Tests exited with: TestsFailedException: 10 tests failed This message is automatically generated. ATTACHMENT ID: 12825684 - PreCommit-HIVE-MASTER-Build
          Hide
          hiveqa Hive QA added a comment -

          Here are the results of testing the latest attachment:
          https://issues.apache.org/jira/secure/attachment/12825036/HIVE-14217.02.patch

          SUCCESS: +1 due to 17 test(s) being added or modified.

          ERROR: -1 due to 30 failed/errored test(s), 10500 tests executed
          Failed tests:

          org.apache.hadoop.hive.cli.TestCliDriver.testCliDriver[acid_mapjoin]
          org.apache.hadoop.hive.cli.TestCliDriver.testCliDriver[create_view]
          org.apache.hadoop.hive.cli.TestCliDriver.testCliDriver[ctas]
          org.apache.hadoop.hive.cli.TestCliDriver.testCliDriver[druid_basic1]
          org.apache.hadoop.hive.cli.TestCliDriver.testCliDriver[druid_basic2]
          org.apache.hadoop.hive.cli.TestCliDriver.testCliDriver[druid_intervals]
          org.apache.hadoop.hive.cli.TestCliDriver.testCliDriver[druid_timeseries]
          org.apache.hadoop.hive.cli.TestCliDriver.testCliDriver[druid_topn]
          org.apache.hadoop.hive.cli.TestCliDriver.testCliDriver[explain_ddl]
          org.apache.hadoop.hive.cli.TestCliDriver.testCliDriver[explain_logical]
          org.apache.hadoop.hive.cli.TestCliDriver.testCliDriver[join_view]
          org.apache.hadoop.hive.cli.TestCliDriver.testCliDriver[masking_2]
          org.apache.hadoop.hive.cli.TestCliDriver.testCliDriver[masking_6]
          org.apache.hadoop.hive.cli.TestCliDriver.testCliDriver[masking_7]
          org.apache.hadoop.hive.cli.TestCliDriver.testCliDriver[serde_user_properties]
          org.apache.hadoop.hive.cli.TestCliDriver.testCliDriver[show_functions]
          org.apache.hadoop.hive.cli.TestCliDriver.testCliDriver[subquery_notin]
          org.apache.hadoop.hive.cli.TestCliDriver.testCliDriver[subquery_views]
          org.apache.hadoop.hive.cli.TestCliDriver.testCliDriver[vector_join_part_col_char]
          org.apache.hadoop.hive.cli.TestMiniLlapCliDriver.testCliDriver[acid_bucket_pruning]
          org.apache.hadoop.hive.cli.TestMiniLlapCliDriver.testCliDriver[explainuser_1]
          org.apache.hadoop.hive.cli.TestMiniTezCliDriver.testCliDriver[explainuser_3]
          org.apache.hadoop.hive.cli.TestNegativeCliDriver.testCliDriver[druid_buckets]
          org.apache.hadoop.hive.cli.TestNegativeCliDriver.testCliDriver[druid_external]
          org.apache.hadoop.hive.cli.TestNegativeCliDriver.testCliDriver[druid_location]
          org.apache.hadoop.hive.cli.TestNegativeCliDriver.testCliDriver[druid_partitions]
          org.apache.hadoop.hive.cli.TestSparkCliDriver.testCliDriver[join_view]
          org.apache.hadoop.hive.druid.TestDruidSerDe.testDruidSerDe
          org.apache.hive.jdbc.TestJdbcWithMiniHS2.testAddJarConstructorUnCaching
          org.apache.hive.service.cli.operation.TestOperationLoggingLayout.testSwitchLogLayout
          

          Test results: https://builds.apache.org/job/PreCommit-HIVE-MASTER-Build/968/testReport
          Console output: https://builds.apache.org/job/PreCommit-HIVE-MASTER-Build/968/console
          Test logs: http://ec2-204-236-174-241.us-west-1.compute.amazonaws.com/logs/PreCommit-HIVE-MASTER-Build-968/

          Messages:

          Executing org.apache.hive.ptest.execution.TestCheckPhase
          Executing org.apache.hive.ptest.execution.PrepPhase
          Executing org.apache.hive.ptest.execution.ExecutionPhase
          Executing org.apache.hive.ptest.execution.ReportingPhase
          Tests exited with: TestsFailedException: 30 tests failed
          

          This message is automatically generated.

          ATTACHMENT ID: 12825036 - PreCommit-HIVE-MASTER-Build

          Show
          hiveqa Hive QA added a comment - Here are the results of testing the latest attachment: https://issues.apache.org/jira/secure/attachment/12825036/HIVE-14217.02.patch SUCCESS: +1 due to 17 test(s) being added or modified. ERROR: -1 due to 30 failed/errored test(s), 10500 tests executed Failed tests: org.apache.hadoop.hive.cli.TestCliDriver.testCliDriver[acid_mapjoin] org.apache.hadoop.hive.cli.TestCliDriver.testCliDriver[create_view] org.apache.hadoop.hive.cli.TestCliDriver.testCliDriver[ctas] org.apache.hadoop.hive.cli.TestCliDriver.testCliDriver[druid_basic1] org.apache.hadoop.hive.cli.TestCliDriver.testCliDriver[druid_basic2] org.apache.hadoop.hive.cli.TestCliDriver.testCliDriver[druid_intervals] org.apache.hadoop.hive.cli.TestCliDriver.testCliDriver[druid_timeseries] org.apache.hadoop.hive.cli.TestCliDriver.testCliDriver[druid_topn] org.apache.hadoop.hive.cli.TestCliDriver.testCliDriver[explain_ddl] org.apache.hadoop.hive.cli.TestCliDriver.testCliDriver[explain_logical] org.apache.hadoop.hive.cli.TestCliDriver.testCliDriver[join_view] org.apache.hadoop.hive.cli.TestCliDriver.testCliDriver[masking_2] org.apache.hadoop.hive.cli.TestCliDriver.testCliDriver[masking_6] org.apache.hadoop.hive.cli.TestCliDriver.testCliDriver[masking_7] org.apache.hadoop.hive.cli.TestCliDriver.testCliDriver[serde_user_properties] org.apache.hadoop.hive.cli.TestCliDriver.testCliDriver[show_functions] org.apache.hadoop.hive.cli.TestCliDriver.testCliDriver[subquery_notin] org.apache.hadoop.hive.cli.TestCliDriver.testCliDriver[subquery_views] org.apache.hadoop.hive.cli.TestCliDriver.testCliDriver[vector_join_part_col_char] org.apache.hadoop.hive.cli.TestMiniLlapCliDriver.testCliDriver[acid_bucket_pruning] org.apache.hadoop.hive.cli.TestMiniLlapCliDriver.testCliDriver[explainuser_1] org.apache.hadoop.hive.cli.TestMiniTezCliDriver.testCliDriver[explainuser_3] org.apache.hadoop.hive.cli.TestNegativeCliDriver.testCliDriver[druid_buckets] org.apache.hadoop.hive.cli.TestNegativeCliDriver.testCliDriver[druid_external] org.apache.hadoop.hive.cli.TestNegativeCliDriver.testCliDriver[druid_location] org.apache.hadoop.hive.cli.TestNegativeCliDriver.testCliDriver[druid_partitions] org.apache.hadoop.hive.cli.TestSparkCliDriver.testCliDriver[join_view] org.apache.hadoop.hive.druid.TestDruidSerDe.testDruidSerDe org.apache.hive.jdbc.TestJdbcWithMiniHS2.testAddJarConstructorUnCaching org.apache.hive.service.cli.operation.TestOperationLoggingLayout.testSwitchLogLayout Test results: https://builds.apache.org/job/PreCommit-HIVE-MASTER-Build/968/testReport Console output: https://builds.apache.org/job/PreCommit-HIVE-MASTER-Build/968/console Test logs: http://ec2-204-236-174-241.us-west-1.compute.amazonaws.com/logs/PreCommit-HIVE-MASTER-Build-968/ Messages: Executing org.apache.hive.ptest.execution.TestCheckPhase Executing org.apache.hive.ptest.execution.PrepPhase Executing org.apache.hive.ptest.execution.ExecutionPhase Executing org.apache.hive.ptest.execution.ReportingPhase Tests exited with: TestsFailedException: 30 tests failed This message is automatically generated. ATTACHMENT ID: 12825036 - PreCommit-HIVE-MASTER-Build
          Hide
          jcamachorodriguez Jesus Camacho Rodriguez added a comment -

          Uploaded new patch that fixes dependency problem that made e.g. all Tez tests block.

          Show
          jcamachorodriguez Jesus Camacho Rodriguez added a comment - Uploaded new patch that fixes dependency problem that made e.g. all Tez tests block.
          Hide
          hiveqa Hive QA added a comment -

          Here are the results of testing the latest attachment:
          https://issues.apache.org/jira/secure/attachment/12824885/HIVE-14217.01.patch

          SUCCESS: +1 due to 17 test(s) being added or modified.

          ERROR: -1 due to 115 failed/errored test(s), 10041 tests executed
          Failed tests:

          TestEncryptedHDFSCliDriver - did not produce a TEST-*.xml file
          TestMiniLlapCliDriver-constprog_dpp.q-vector_complex_join.q-schema_evol_text_nonvec_mapwork_part_all_complex.q-and-12-more - did not produce a TEST-*.xml file
          TestMiniLlapCliDriver-cte_mat_1.q-tez_bmj_schema_evolution.q-tez_schema_evolution.q-and-12-more - did not produce a TEST-*.xml file
          TestMiniLlapCliDriver-orc_ppd_schema_evol_2a.q-dynamic_partition_pruning.q-schema_evol_orc_acidvec_mapwork_part.q-and-12-more - did not produce a TEST-*.xml file
          TestMiniLlapCliDriver-schema_evol_text_vec_mapwork_part_all_complex.q-tez_self_join.q-tez_union_dynamic_partition.q-and-12-more - did not produce a TEST-*.xml file
          TestMiniLlapCliDriver-tez_joins_explain.q-orc_ppd_schema_evol_3a.q-vector_include_no_sel.q-and-12-more - did not produce a TEST-*.xml file
          TestMiniLlapCliDriver-tez_union_group_by.q-schema_evol_text_nonvec_mapwork_table.q-schema_evol_text_nonvec_mapwork_part_all_primitive.q-and-12-more - did not produce a TEST-*.xml file
          TestMiniTezCliDriver-acid_globallimit.q-cte_mat_1.q-deleteAnalyze.q-and-12-more - did not produce a TEST-*.xml file
          TestMiniTezCliDriver-auto_join30.q-acid_vectorization_missing_cols.q-load_dyn_part2.q-and-12-more - did not produce a TEST-*.xml file
          TestMiniTezCliDriver-auto_sortmerge_join_7.q-cbo_windowing.q-scriptfile1.q-and-12-more - did not produce a TEST-*.xml file
          TestMiniTezCliDriver-constprog_dpp.q-vector_complex_join.q-insert_update_delete.q-and-12-more - did not produce a TEST-*.xml file
          TestMiniTezCliDriver-dynamic_partition_pruning.q-vector_char_mapjoin1.q-unionDistinct_2.q-and-12-more - did not produce a TEST-*.xml file
          TestMiniTezCliDriver-enforce_order.q-vector_partition_diff_num_cols.q-vectorized_rcfile_columnar.q-and-12-more - did not produce a TEST-*.xml file
          TestMiniTezCliDriver-groupby2.q-vectorized_timestamp.q-union_fast_stats.q-and-12-more - did not produce a TEST-*.xml file
          TestMiniTezCliDriver-mapreduce2.q-cte_5.q-union5.q-and-12-more - did not produce a TEST-*.xml file
          TestMiniTezCliDriver-order_null.q-update_orig_table.q-cte_4.q-and-12-more - did not produce a TEST-*.xml file
          TestMiniTezCliDriver-script_pipe.q-orc_ppd_schema_evol_2a.q-join1.q-and-12-more - did not produce a TEST-*.xml file
          TestMiniTezCliDriver-tez_bmj_schema_evolution.q-vector_multi_insert.q-vectorized_distinct_gby.q-and-12-more - did not produce a TEST-*.xml file
          TestMiniTezCliDriver-tez_insert_overwrite_local_directory_1.q-bucket3.q-vector_auto_smb_mapjoin_14.q-and-12-more - did not produce a TEST-*.xml file
          TestMiniTezCliDriver-tez_joins_explain.q-unionDistinct_1.q-vector_data_types.q-and-12-more - did not produce a TEST-*.xml file
          TestMiniTezCliDriver-tez_self_join.q-filter_join_breaktask.q-vector_decimal_precision.q-and-12-more - did not produce a TEST-*.xml file
          TestMiniTezCliDriver-tez_union_group_by.q-transform_ppr2.q-vector_decimal_5.q-and-12-more - did not produce a TEST-*.xml file
          TestMiniTezCliDriver-vector_coalesce.q-vector_decimal_round.q-vector_acid3.q-and-12-more - did not produce a TEST-*.xml file
          TestMiniTezCliDriver-vector_decimal_10_0.q-tez_schema_evolution.q-tez_join.q-and-12-more - did not produce a TEST-*.xml file
          TestMiniTezCliDriver-vector_distinct_2.q-auto_sortmerge_join_13.q-orc_ppd_schema_evol_3a.q-and-12-more - did not produce a TEST-*.xml file
          TestMiniTezCliDriver-vector_grouping_sets.q-tez_smb_empty.q-orc_merge5.q-and-12-more - did not produce a TEST-*.xml file
          TestMiniTezCliDriver-vector_interval_2.q-auto_join1.q-explainuser_4.q-and-12-more - did not produce a TEST-*.xml file
          TestMiniTezCliDriver-vectorization_13.q-orc_merge6.q-tez_dynpart_hashjoin_3.q-and-12-more - did not produce a TEST-*.xml file
          TestMiniTezCliDriver-vectorization_16.q-insert_values_non_partitioned.q-update_after_multiple_inserts.q-and-12-more - did not produce a TEST-*.xml file
          TestMiniTezCliDriver-vectorized_parquet.q-orc_merge9.q-union2.q-and-12-more - did not produce a TEST-*.xml file
          TestMinimrCliDriver-bucket_num_reducers.q-schemeAuthority2.q-scriptfile1.q-and-1-more - did not produce a TEST-*.xml file
          TestMinimrCliDriver-external_table_with_space_in_location_path.q-bucketmapjoin6.q-temp_table_external.q-and-1-more - did not produce a TEST-*.xml file
          TestMinimrCliDriver-groupby2.q-bucket6.q-input16_cc.q-and-1-more - did not produce a TEST-*.xml file
          TestMinimrCliDriver-import_exported_table.q-file_with_header_footer.q-orc_mr_pathalias.q-and-1-more - did not produce a TEST-*.xml file
          TestMinimrCliDriver-infer_bucket_sort_num_buckets.q-index_bitmap3.q-join1.q-and-1-more - did not produce a TEST-*.xml file
          TestMinimrCliDriver-infer_bucket_sort_reducers_power_two.q-scriptfile1_win.q-bucketmapjoin7.q-and-1-more - did not produce a TEST-*.xml file
          TestMinimrCliDriver-insert_dir_distcp.q-non_native_window_udf.q-infer_bucket_sort_merge.q-and-1-more - did not produce a TEST-*.xml file
          TestMinimrCliDriver-leftsemijoin_mr.q-infer_bucket_sort_map_operators.q-bucket4.q-and-1-more - did not produce a TEST-*.xml file
          TestMinimrCliDriver-list_bucket_dml_10.q-orc_merge_diff_fs.q-skewjoin_onesideskew.q - did not produce a TEST-*.xml file
          TestMinimrCliDriver-load_fs2.q-root_dir_external_table.q-join_acid_non_acid.q-and-1-more - did not produce a TEST-*.xml file
          TestMinimrCliDriver-parallel_orderby.q-bucketizedhiveinputformat.q-index_bitmap_auto.q-and-1-more - did not produce a TEST-*.xml file
          TestMinimrCliDriver-reduce_deduplicate.q-disable_merge_for_bucketing.q-load_hdfs_file_with_space_in_the_name.q-and-1-more - did not produce a TEST-*.xml file
          TestMinimrCliDriver-table_nonprintable.q-infer_bucket_sort_bucketed_table.q-uber_reduce.q-and-1-more - did not produce a TEST-*.xml file
          org.apache.hadoop.hive.cli.TestCliDriver.testCliDriver[acid_mapjoin]
          org.apache.hadoop.hive.cli.TestCliDriver.testCliDriver[autogen_colalias]
          org.apache.hadoop.hive.cli.TestCliDriver.testCliDriver[cbo_rp_windowing_2]
          org.apache.hadoop.hive.cli.TestCliDriver.testCliDriver[create_view]
          org.apache.hadoop.hive.cli.TestCliDriver.testCliDriver[druid_basic2]
          org.apache.hadoop.hive.cli.TestCliDriver.testCliDriver[explain_ddl]
          org.apache.hadoop.hive.cli.TestCliDriver.testCliDriver[explain_logical]
          org.apache.hadoop.hive.cli.TestCliDriver.testCliDriver[join_view]
          org.apache.hadoop.hive.cli.TestCliDriver.testCliDriver[list_bucket_dml_6]
          org.apache.hadoop.hive.cli.TestCliDriver.testCliDriver[list_bucket_dml_7]
          org.apache.hadoop.hive.cli.TestCliDriver.testCliDriver[list_bucket_dml_8]
          org.apache.hadoop.hive.cli.TestCliDriver.testCliDriver[masking_1]
          org.apache.hadoop.hive.cli.TestCliDriver.testCliDriver[masking_1_newdb]
          org.apache.hadoop.hive.cli.TestCliDriver.testCliDriver[masking_2]
          org.apache.hadoop.hive.cli.TestCliDriver.testCliDriver[masking_3]
          org.apache.hadoop.hive.cli.TestCliDriver.testCliDriver[masking_4]
          org.apache.hadoop.hive.cli.TestCliDriver.testCliDriver[masking_6]
          org.apache.hadoop.hive.cli.TestCliDriver.testCliDriver[masking_7]
          org.apache.hadoop.hive.cli.TestCliDriver.testCliDriver[merge_dynamic_partition4]
          org.apache.hadoop.hive.cli.TestCliDriver.testCliDriver[merge_dynamic_partition5]
          org.apache.hadoop.hive.cli.TestCliDriver.testCliDriver[serde_user_properties]
          org.apache.hadoop.hive.cli.TestCliDriver.testCliDriver[show_functions]
          org.apache.hadoop.hive.cli.TestCliDriver.testCliDriver[subquery_notin]
          org.apache.hadoop.hive.cli.TestCliDriver.testCliDriver[subquery_views]
          org.apache.hadoop.hive.cli.TestCliDriver.testCliDriver[temp_table]
          org.apache.hadoop.hive.cli.TestCliDriver.testCliDriver[union_top_level]
          org.apache.hadoop.hive.cli.TestCliDriver.testCliDriver[vector_decimal_math_funcs]
          org.apache.hadoop.hive.cli.TestCliDriver.testCliDriver[vector_elt]
          org.apache.hadoop.hive.cli.TestCliDriver.testCliDriver[vectorization_0]
          org.apache.hadoop.hive.cli.TestCliDriver.testCliDriver[vectorization_14]
          org.apache.hadoop.hive.cli.TestCliDriver.testCliDriver[vectorization_15]
          org.apache.hadoop.hive.cli.TestCliDriver.testCliDriver[vectorization_17]
          org.apache.hadoop.hive.cli.TestCliDriver.testCliDriver[vectorization_3]
          org.apache.hadoop.hive.cli.TestCliDriver.testCliDriver[vectorization_7]
          org.apache.hadoop.hive.cli.TestCliDriver.testCliDriver[vectorization_not]
          org.apache.hadoop.hive.cli.TestCliDriver.testCliDriver[vectorization_short_regress]
          org.apache.hadoop.hive.cli.TestCliDriver.testCliDriver[vectorized_casts]
          org.apache.hadoop.hive.cli.TestCliDriver.testCliDriver[vectorized_math_funcs]
          org.apache.hadoop.hive.cli.TestHBaseCliDriver.testCliDriver[hbase_queries]
          org.apache.hadoop.hive.cli.TestHBaseMinimrCliDriver.testCliDriver[hbase_bulk]
          org.apache.hadoop.hive.cli.TestMiniTezCliDriver.testCliDriver[cross_join]
          org.apache.hadoop.hive.cli.TestMiniTezCliDriver.testCliDriver[dynpart_sort_optimization2]
          org.apache.hadoop.hive.cli.TestMiniTezCliDriver.testCliDriver[explainuser_3]
          org.apache.hadoop.hive.cli.TestMiniTezCliDriver.testCliDriver[load_dyn_part3]
          org.apache.hadoop.hive.cli.TestMiniTezCliDriver.testCliDriver[mapjoin_mapjoin]
          org.apache.hadoop.hive.cli.TestMiniTezCliDriver.testCliDriver[mergejoin]
          org.apache.hadoop.hive.cli.TestMiniTezCliDriver.testCliDriver[orc_vectorization_ppd]
          org.apache.hadoop.hive.cli.TestMiniTezCliDriver.testCliDriver[union6]
          org.apache.hadoop.hive.cli.TestMiniTezCliDriver.testCliDriver[vector_decimal_aggregate]
          org.apache.hadoop.hive.cli.TestMiniTezCliDriver.testCliDriver[vector_outer_join3]
          org.apache.hadoop.hive.cli.TestMiniTezCliDriver.testCliDriver[vector_outer_join5]
          org.apache.hadoop.hive.cli.TestMiniTezCliDriver.testCliDriver[vectorization_10]
          org.apache.hadoop.hive.cli.TestMiniTezCliDriver.testCliDriver[vectorization_12]
          org.apache.hadoop.hive.cli.TestMiniTezCliDriver.testCliDriver[vectorization_14]
          org.apache.hadoop.hive.cli.TestMiniTezCliDriver.testCliDriver[vectorization_7]
          org.apache.hadoop.hive.cli.TestMiniTezCliDriver.testCliDriver[vectorization_pushdown]
          org.apache.hadoop.hive.cli.TestMiniTezCliDriver.testCliDriver[vectorized_casts]
          org.apache.hadoop.hive.cli.TestSparkCliDriver.testCliDriver[join_view]
          org.apache.hadoop.hive.cli.TestSparkCliDriver.testCliDriver[temp_table]
          org.apache.hadoop.hive.cli.TestSparkCliDriver.testCliDriver[union_top_level]
          org.apache.hadoop.hive.cli.TestSparkCliDriver.testCliDriver[vector_elt]
          org.apache.hadoop.hive.cli.TestSparkCliDriver.testCliDriver[vectorization_0]
          org.apache.hadoop.hive.cli.TestSparkCliDriver.testCliDriver[vectorization_14]
          org.apache.hadoop.hive.cli.TestSparkCliDriver.testCliDriver[vectorization_15]
          org.apache.hadoop.hive.cli.TestSparkCliDriver.testCliDriver[vectorization_17]
          org.apache.hadoop.hive.cli.TestSparkCliDriver.testCliDriver[vectorization_3]
          org.apache.hadoop.hive.cli.TestSparkCliDriver.testCliDriver[vectorization_not]
          org.apache.hadoop.hive.cli.TestSparkCliDriver.testCliDriver[vectorization_short_regress]
          org.apache.hadoop.hive.cli.TestSparkCliDriver.testCliDriver[vectorized_math_funcs]
          org.apache.hadoop.hive.druid.TestDruidSerDe.testDruidSerDe
          org.apache.hive.jdbc.TestJdbcWithMiniHS2.testAddJarConstructorUnCaching
          org.apache.hive.service.cli.operation.TestOperationLoggingLayout.testSwitchLogLayout
          

          Test results: https://builds.apache.org/job/PreCommit-HIVE-MASTER-Build/954/testReport
          Console output: https://builds.apache.org/job/PreCommit-HIVE-MASTER-Build/954/console
          Test logs: http://ec2-204-236-174-241.us-west-1.compute.amazonaws.com/logs/PreCommit-HIVE-MASTER-Build-954/

          Messages:

          Executing org.apache.hive.ptest.execution.TestCheckPhase
          Executing org.apache.hive.ptest.execution.PrepPhase
          Executing org.apache.hive.ptest.execution.ExecutionPhase
          Executing org.apache.hive.ptest.execution.ReportingPhase
          Tests exited with: TestsFailedException: 115 tests failed
          

          This message is automatically generated.

          ATTACHMENT ID: 12824885 - PreCommit-HIVE-MASTER-Build

          Show
          hiveqa Hive QA added a comment - Here are the results of testing the latest attachment: https://issues.apache.org/jira/secure/attachment/12824885/HIVE-14217.01.patch SUCCESS: +1 due to 17 test(s) being added or modified. ERROR: -1 due to 115 failed/errored test(s), 10041 tests executed Failed tests: TestEncryptedHDFSCliDriver - did not produce a TEST-*.xml file TestMiniLlapCliDriver-constprog_dpp.q-vector_complex_join.q-schema_evol_text_nonvec_mapwork_part_all_complex.q-and-12-more - did not produce a TEST-*.xml file TestMiniLlapCliDriver-cte_mat_1.q-tez_bmj_schema_evolution.q-tez_schema_evolution.q-and-12-more - did not produce a TEST-*.xml file TestMiniLlapCliDriver-orc_ppd_schema_evol_2a.q-dynamic_partition_pruning.q-schema_evol_orc_acidvec_mapwork_part.q-and-12-more - did not produce a TEST-*.xml file TestMiniLlapCliDriver-schema_evol_text_vec_mapwork_part_all_complex.q-tez_self_join.q-tez_union_dynamic_partition.q-and-12-more - did not produce a TEST-*.xml file TestMiniLlapCliDriver-tez_joins_explain.q-orc_ppd_schema_evol_3a.q-vector_include_no_sel.q-and-12-more - did not produce a TEST-*.xml file TestMiniLlapCliDriver-tez_union_group_by.q-schema_evol_text_nonvec_mapwork_table.q-schema_evol_text_nonvec_mapwork_part_all_primitive.q-and-12-more - did not produce a TEST-*.xml file TestMiniTezCliDriver-acid_globallimit.q-cte_mat_1.q-deleteAnalyze.q-and-12-more - did not produce a TEST-*.xml file TestMiniTezCliDriver-auto_join30.q-acid_vectorization_missing_cols.q-load_dyn_part2.q-and-12-more - did not produce a TEST-*.xml file TestMiniTezCliDriver-auto_sortmerge_join_7.q-cbo_windowing.q-scriptfile1.q-and-12-more - did not produce a TEST-*.xml file TestMiniTezCliDriver-constprog_dpp.q-vector_complex_join.q-insert_update_delete.q-and-12-more - did not produce a TEST-*.xml file TestMiniTezCliDriver-dynamic_partition_pruning.q-vector_char_mapjoin1.q-unionDistinct_2.q-and-12-more - did not produce a TEST-*.xml file TestMiniTezCliDriver-enforce_order.q-vector_partition_diff_num_cols.q-vectorized_rcfile_columnar.q-and-12-more - did not produce a TEST-*.xml file TestMiniTezCliDriver-groupby2.q-vectorized_timestamp.q-union_fast_stats.q-and-12-more - did not produce a TEST-*.xml file TestMiniTezCliDriver-mapreduce2.q-cte_5.q-union5.q-and-12-more - did not produce a TEST-*.xml file TestMiniTezCliDriver-order_null.q-update_orig_table.q-cte_4.q-and-12-more - did not produce a TEST-*.xml file TestMiniTezCliDriver-script_pipe.q-orc_ppd_schema_evol_2a.q-join1.q-and-12-more - did not produce a TEST-*.xml file TestMiniTezCliDriver-tez_bmj_schema_evolution.q-vector_multi_insert.q-vectorized_distinct_gby.q-and-12-more - did not produce a TEST-*.xml file TestMiniTezCliDriver-tez_insert_overwrite_local_directory_1.q-bucket3.q-vector_auto_smb_mapjoin_14.q-and-12-more - did not produce a TEST-*.xml file TestMiniTezCliDriver-tez_joins_explain.q-unionDistinct_1.q-vector_data_types.q-and-12-more - did not produce a TEST-*.xml file TestMiniTezCliDriver-tez_self_join.q-filter_join_breaktask.q-vector_decimal_precision.q-and-12-more - did not produce a TEST-*.xml file TestMiniTezCliDriver-tez_union_group_by.q-transform_ppr2.q-vector_decimal_5.q-and-12-more - did not produce a TEST-*.xml file TestMiniTezCliDriver-vector_coalesce.q-vector_decimal_round.q-vector_acid3.q-and-12-more - did not produce a TEST-*.xml file TestMiniTezCliDriver-vector_decimal_10_0.q-tez_schema_evolution.q-tez_join.q-and-12-more - did not produce a TEST-*.xml file TestMiniTezCliDriver-vector_distinct_2.q-auto_sortmerge_join_13.q-orc_ppd_schema_evol_3a.q-and-12-more - did not produce a TEST-*.xml file TestMiniTezCliDriver-vector_grouping_sets.q-tez_smb_empty.q-orc_merge5.q-and-12-more - did not produce a TEST-*.xml file TestMiniTezCliDriver-vector_interval_2.q-auto_join1.q-explainuser_4.q-and-12-more - did not produce a TEST-*.xml file TestMiniTezCliDriver-vectorization_13.q-orc_merge6.q-tez_dynpart_hashjoin_3.q-and-12-more - did not produce a TEST-*.xml file TestMiniTezCliDriver-vectorization_16.q-insert_values_non_partitioned.q-update_after_multiple_inserts.q-and-12-more - did not produce a TEST-*.xml file TestMiniTezCliDriver-vectorized_parquet.q-orc_merge9.q-union2.q-and-12-more - did not produce a TEST-*.xml file TestMinimrCliDriver-bucket_num_reducers.q-schemeAuthority2.q-scriptfile1.q-and-1-more - did not produce a TEST-*.xml file TestMinimrCliDriver-external_table_with_space_in_location_path.q-bucketmapjoin6.q-temp_table_external.q-and-1-more - did not produce a TEST-*.xml file TestMinimrCliDriver-groupby2.q-bucket6.q-input16_cc.q-and-1-more - did not produce a TEST-*.xml file TestMinimrCliDriver-import_exported_table.q-file_with_header_footer.q-orc_mr_pathalias.q-and-1-more - did not produce a TEST-*.xml file TestMinimrCliDriver-infer_bucket_sort_num_buckets.q-index_bitmap3.q-join1.q-and-1-more - did not produce a TEST-*.xml file TestMinimrCliDriver-infer_bucket_sort_reducers_power_two.q-scriptfile1_win.q-bucketmapjoin7.q-and-1-more - did not produce a TEST-*.xml file TestMinimrCliDriver-insert_dir_distcp.q-non_native_window_udf.q-infer_bucket_sort_merge.q-and-1-more - did not produce a TEST-*.xml file TestMinimrCliDriver-leftsemijoin_mr.q-infer_bucket_sort_map_operators.q-bucket4.q-and-1-more - did not produce a TEST-*.xml file TestMinimrCliDriver-list_bucket_dml_10.q-orc_merge_diff_fs.q-skewjoin_onesideskew.q - did not produce a TEST-*.xml file TestMinimrCliDriver-load_fs2.q-root_dir_external_table.q-join_acid_non_acid.q-and-1-more - did not produce a TEST-*.xml file TestMinimrCliDriver-parallel_orderby.q-bucketizedhiveinputformat.q-index_bitmap_auto.q-and-1-more - did not produce a TEST-*.xml file TestMinimrCliDriver-reduce_deduplicate.q-disable_merge_for_bucketing.q-load_hdfs_file_with_space_in_the_name.q-and-1-more - did not produce a TEST-*.xml file TestMinimrCliDriver-table_nonprintable.q-infer_bucket_sort_bucketed_table.q-uber_reduce.q-and-1-more - did not produce a TEST-*.xml file org.apache.hadoop.hive.cli.TestCliDriver.testCliDriver[acid_mapjoin] org.apache.hadoop.hive.cli.TestCliDriver.testCliDriver[autogen_colalias] org.apache.hadoop.hive.cli.TestCliDriver.testCliDriver[cbo_rp_windowing_2] org.apache.hadoop.hive.cli.TestCliDriver.testCliDriver[create_view] org.apache.hadoop.hive.cli.TestCliDriver.testCliDriver[druid_basic2] org.apache.hadoop.hive.cli.TestCliDriver.testCliDriver[explain_ddl] org.apache.hadoop.hive.cli.TestCliDriver.testCliDriver[explain_logical] org.apache.hadoop.hive.cli.TestCliDriver.testCliDriver[join_view] org.apache.hadoop.hive.cli.TestCliDriver.testCliDriver[list_bucket_dml_6] org.apache.hadoop.hive.cli.TestCliDriver.testCliDriver[list_bucket_dml_7] org.apache.hadoop.hive.cli.TestCliDriver.testCliDriver[list_bucket_dml_8] org.apache.hadoop.hive.cli.TestCliDriver.testCliDriver[masking_1] org.apache.hadoop.hive.cli.TestCliDriver.testCliDriver[masking_1_newdb] org.apache.hadoop.hive.cli.TestCliDriver.testCliDriver[masking_2] org.apache.hadoop.hive.cli.TestCliDriver.testCliDriver[masking_3] org.apache.hadoop.hive.cli.TestCliDriver.testCliDriver[masking_4] org.apache.hadoop.hive.cli.TestCliDriver.testCliDriver[masking_6] org.apache.hadoop.hive.cli.TestCliDriver.testCliDriver[masking_7] org.apache.hadoop.hive.cli.TestCliDriver.testCliDriver[merge_dynamic_partition4] org.apache.hadoop.hive.cli.TestCliDriver.testCliDriver[merge_dynamic_partition5] org.apache.hadoop.hive.cli.TestCliDriver.testCliDriver[serde_user_properties] org.apache.hadoop.hive.cli.TestCliDriver.testCliDriver[show_functions] org.apache.hadoop.hive.cli.TestCliDriver.testCliDriver[subquery_notin] org.apache.hadoop.hive.cli.TestCliDriver.testCliDriver[subquery_views] org.apache.hadoop.hive.cli.TestCliDriver.testCliDriver[temp_table] org.apache.hadoop.hive.cli.TestCliDriver.testCliDriver[union_top_level] org.apache.hadoop.hive.cli.TestCliDriver.testCliDriver[vector_decimal_math_funcs] org.apache.hadoop.hive.cli.TestCliDriver.testCliDriver[vector_elt] org.apache.hadoop.hive.cli.TestCliDriver.testCliDriver[vectorization_0] org.apache.hadoop.hive.cli.TestCliDriver.testCliDriver[vectorization_14] org.apache.hadoop.hive.cli.TestCliDriver.testCliDriver[vectorization_15] org.apache.hadoop.hive.cli.TestCliDriver.testCliDriver[vectorization_17] org.apache.hadoop.hive.cli.TestCliDriver.testCliDriver[vectorization_3] org.apache.hadoop.hive.cli.TestCliDriver.testCliDriver[vectorization_7] org.apache.hadoop.hive.cli.TestCliDriver.testCliDriver[vectorization_not] org.apache.hadoop.hive.cli.TestCliDriver.testCliDriver[vectorization_short_regress] org.apache.hadoop.hive.cli.TestCliDriver.testCliDriver[vectorized_casts] org.apache.hadoop.hive.cli.TestCliDriver.testCliDriver[vectorized_math_funcs] org.apache.hadoop.hive.cli.TestHBaseCliDriver.testCliDriver[hbase_queries] org.apache.hadoop.hive.cli.TestHBaseMinimrCliDriver.testCliDriver[hbase_bulk] org.apache.hadoop.hive.cli.TestMiniTezCliDriver.testCliDriver[cross_join] org.apache.hadoop.hive.cli.TestMiniTezCliDriver.testCliDriver[dynpart_sort_optimization2] org.apache.hadoop.hive.cli.TestMiniTezCliDriver.testCliDriver[explainuser_3] org.apache.hadoop.hive.cli.TestMiniTezCliDriver.testCliDriver[load_dyn_part3] org.apache.hadoop.hive.cli.TestMiniTezCliDriver.testCliDriver[mapjoin_mapjoin] org.apache.hadoop.hive.cli.TestMiniTezCliDriver.testCliDriver[mergejoin] org.apache.hadoop.hive.cli.TestMiniTezCliDriver.testCliDriver[orc_vectorization_ppd] org.apache.hadoop.hive.cli.TestMiniTezCliDriver.testCliDriver[union6] org.apache.hadoop.hive.cli.TestMiniTezCliDriver.testCliDriver[vector_decimal_aggregate] org.apache.hadoop.hive.cli.TestMiniTezCliDriver.testCliDriver[vector_outer_join3] org.apache.hadoop.hive.cli.TestMiniTezCliDriver.testCliDriver[vector_outer_join5] org.apache.hadoop.hive.cli.TestMiniTezCliDriver.testCliDriver[vectorization_10] org.apache.hadoop.hive.cli.TestMiniTezCliDriver.testCliDriver[vectorization_12] org.apache.hadoop.hive.cli.TestMiniTezCliDriver.testCliDriver[vectorization_14] org.apache.hadoop.hive.cli.TestMiniTezCliDriver.testCliDriver[vectorization_7] org.apache.hadoop.hive.cli.TestMiniTezCliDriver.testCliDriver[vectorization_pushdown] org.apache.hadoop.hive.cli.TestMiniTezCliDriver.testCliDriver[vectorized_casts] org.apache.hadoop.hive.cli.TestSparkCliDriver.testCliDriver[join_view] org.apache.hadoop.hive.cli.TestSparkCliDriver.testCliDriver[temp_table] org.apache.hadoop.hive.cli.TestSparkCliDriver.testCliDriver[union_top_level] org.apache.hadoop.hive.cli.TestSparkCliDriver.testCliDriver[vector_elt] org.apache.hadoop.hive.cli.TestSparkCliDriver.testCliDriver[vectorization_0] org.apache.hadoop.hive.cli.TestSparkCliDriver.testCliDriver[vectorization_14] org.apache.hadoop.hive.cli.TestSparkCliDriver.testCliDriver[vectorization_15] org.apache.hadoop.hive.cli.TestSparkCliDriver.testCliDriver[vectorization_17] org.apache.hadoop.hive.cli.TestSparkCliDriver.testCliDriver[vectorization_3] org.apache.hadoop.hive.cli.TestSparkCliDriver.testCliDriver[vectorization_not] org.apache.hadoop.hive.cli.TestSparkCliDriver.testCliDriver[vectorization_short_regress] org.apache.hadoop.hive.cli.TestSparkCliDriver.testCliDriver[vectorized_math_funcs] org.apache.hadoop.hive.druid.TestDruidSerDe.testDruidSerDe org.apache.hive.jdbc.TestJdbcWithMiniHS2.testAddJarConstructorUnCaching org.apache.hive.service.cli.operation.TestOperationLoggingLayout.testSwitchLogLayout Test results: https://builds.apache.org/job/PreCommit-HIVE-MASTER-Build/954/testReport Console output: https://builds.apache.org/job/PreCommit-HIVE-MASTER-Build/954/console Test logs: http://ec2-204-236-174-241.us-west-1.compute.amazonaws.com/logs/PreCommit-HIVE-MASTER-Build-954/ Messages: Executing org.apache.hive.ptest.execution.TestCheckPhase Executing org.apache.hive.ptest.execution.PrepPhase Executing org.apache.hive.ptest.execution.ExecutionPhase Executing org.apache.hive.ptest.execution.ReportingPhase Tests exited with: TestsFailedException: 115 tests failed This message is automatically generated. ATTACHMENT ID: 12824885 - PreCommit-HIVE-MASTER-Build
          Hide
          jcamachorodriguez Jesus Camacho Rodriguez added a comment -

          A remainder of the wiki link with more info: https://cwiki.apache.org/confluence/display/Hive/Druid+Integration

          Show
          jcamachorodriguez Jesus Camacho Rodriguez added a comment - A remainder of the wiki link with more info: https://cwiki.apache.org/confluence/display/Hive/Druid+Integration
          Hide
          jcamachorodriguez Jesus Camacho Rodriguez added a comment -

          I have created a pull request with the implementation of the subtasks under this umbrella. It can be found in :

          https://github.com/apache/hive/pull/98

          Ashutosh Chauhan, could you review it?

          I think it would be good if more than one person could take a look at the patch and review it, even if it is partially, as it is quite large. Navis, maybe you would like to take a look too? Any other voluntary reviewers are welcome too.

          Thanks!

          Show
          jcamachorodriguez Jesus Camacho Rodriguez added a comment - I have created a pull request with the implementation of the subtasks under this umbrella. It can be found in : https://github.com/apache/hive/pull/98 Ashutosh Chauhan , could you review it? I think it would be good if more than one person could take a look at the patch and review it, even if it is partially, as it is quite large. Navis , maybe you would like to take a look too? Any other voluntary reviewers are welcome too. Thanks!
          Hide
          githubbot ASF GitHub Bot added a comment -

          GitHub user jcamachor opened a pull request:

          https://github.com/apache/hive/pull/98

          HIVE-14217: Druid integration

          You can merge this pull request into a Git repository by running:

          $ git pull https://github.com/jcamachor/hive HIVE-druid

          Alternatively you can review and apply these changes as the patch at:

          https://github.com/apache/hive/pull/98.patch

          To close this pull request, make a commit to your master/trunk branch
          with (at least) the following in the commit message:

          This closes #98


          commit e633db81bb1e3064b6a638b897098d585da93659
          Author: Jesus Camacho Rodriguez <jcamacho@apache.org>
          Date: 2016-08-12T11:55:46Z

          HIVE-14217: Druid integration


          Show
          githubbot ASF GitHub Bot added a comment - GitHub user jcamachor opened a pull request: https://github.com/apache/hive/pull/98 HIVE-14217 : Druid integration You can merge this pull request into a Git repository by running: $ git pull https://github.com/jcamachor/hive HIVE-druid Alternatively you can review and apply these changes as the patch at: https://github.com/apache/hive/pull/98.patch To close this pull request, make a commit to your master/trunk branch with (at least) the following in the commit message: This closes #98 commit e633db81bb1e3064b6a638b897098d585da93659 Author: Jesus Camacho Rodriguez <jcamacho@apache.org> Date: 2016-08-12T11:55:46Z HIVE-14217 : Druid integration
          Hide
          jcamachorodriguez Jesus Camacho Rodriguez added a comment -

          I have created a wiki entry describing the initial work done under this umbrella and how to start using the integration between Hive and Druid:

          https://cwiki.apache.org/confluence/display/Hive/Druid+Integration

          I will upload a patch shortly.

          Show
          jcamachorodriguez Jesus Camacho Rodriguez added a comment - I have created a wiki entry describing the initial work done under this umbrella and how to start using the integration between Hive and Druid: https://cwiki.apache.org/confluence/display/Hive/Druid+Integration I will upload a patch shortly.

            People

            • Assignee:
              jcamachorodriguez Jesus Camacho Rodriguez
              Reporter:
              julianhyde Julian Hyde
            • Votes:
              1 Vote for this issue
              Watchers:
              25 Start watching this issue

              Dates

              • Created:
                Updated:
                Resolved:

                Development