Details

    • Type: Sub-task
    • Status: Closed
    • Priority: Major
    • Resolution: Fixed
    • Affects Version/s: None
    • Fix Version/s: 2.1.0
    • Component/s: Query Processor
    • Labels:
      None

      Description

      Step1: to refractor the code by creating the QueryState class and moving query related info from SessionState. Then during compilation, execution stages, pass single QueryState object for each query.

      1. HIVE-13424.1.patch
        136 kB
        Aihua Xu
      2. HIVE-13424.2.patch
        136 kB
        Aihua Xu
      3. HIVE-13424.3.patch
        138 kB
        Aihua Xu
      4. HIVE-13424.4.patch
        138 kB
        Aihua Xu
      5. HIVE-13424.5.patch
        138 kB
        Aihua Xu

        Issue Links

          Activity

          Hide
          aihuaxu Aihua Xu added a comment -

          Attached the first patch which should not affect existing logic. It passes a QueryState to compilation and execution stages.

          Show
          aihuaxu Aihua Xu added a comment - Attached the first patch which should not affect existing logic. It passes a QueryState to compilation and execution stages.
          Hide
          mohitsabharwal Mohit Sabharwal added a comment -

          could you please create RB? thanks.

          Show
          mohitsabharwal Mohit Sabharwal added a comment - could you please create RB? thanks.
          Hide
          aihuaxu Aihua Xu added a comment -

          Created RB and please see the link above. Thanks.

          Show
          aihuaxu Aihua Xu added a comment - Created RB and please see the link above. Thanks.
          Hide
          aihuaxu Aihua Xu added a comment -

          Patch-2: updated a few places to get queryId from QueryState.

          Show
          aihuaxu Aihua Xu added a comment - Patch-2: updated a few places to get queryId from QueryState.
          Hide
          hiveqa Hive QA added a comment -

          Here are the results of testing the latest attachment:
          https://issues.apache.org/jira/secure/attachment/12797156/HIVE-13424.2.patch

          ERROR: -1 due to build exiting with an error

          Test results: http://ec2-174-129-184-35.compute-1.amazonaws.com/jenkins/job/PreCommit-HIVE-TRUNK-Build/7485/testReport
          Console output: http://ec2-174-129-184-35.compute-1.amazonaws.com/jenkins/job/PreCommit-HIVE-TRUNK-Build/7485/console
          Test logs: http://ec2-174-129-184-35.compute-1.amazonaws.com/logs/PreCommit-HIVE-TRUNK-Build-7485/

          Messages:

          **** This message was trimmed, see log for full details ****
          [INFO] --- maven-compiler-plugin:3.1:compile (default-compile) @ udf-classloader-udf2 ---
          [INFO] Compiling 1 source file to /data/hive-ptest/working/apache-github-source-source/itests/custom-udfs/udf-classloader-udf2/target/classes
          [INFO] 
          [INFO] --- maven-resources-plugin:2.6:testResources (default-testResources) @ udf-classloader-udf2 ---
          [INFO] Using 'UTF-8' encoding to copy filtered resources.
          [INFO] skip non existing resourceDirectory /data/hive-ptest/working/apache-github-source-source/itests/custom-udfs/udf-classloader-udf2/src/test/resources
          [INFO] Copying 3 resources
          [INFO] 
          [INFO] --- maven-antrun-plugin:1.7:run (setup-test-dirs) @ udf-classloader-udf2 ---
          [INFO] Executing tasks
          
          main:
              [mkdir] Created dir: /data/hive-ptest/working/apache-github-source-source/itests/custom-udfs/udf-classloader-udf2/target/tmp
              [mkdir] Created dir: /data/hive-ptest/working/apache-github-source-source/itests/custom-udfs/udf-classloader-udf2/target/warehouse
              [mkdir] Created dir: /data/hive-ptest/working/apache-github-source-source/itests/custom-udfs/udf-classloader-udf2/target/tmp/conf
               [copy] Copying 15 files to /data/hive-ptest/working/apache-github-source-source/itests/custom-udfs/udf-classloader-udf2/target/tmp/conf
          [INFO] Executed tasks
          [INFO] 
          [INFO] --- maven-compiler-plugin:3.1:testCompile (default-testCompile) @ udf-classloader-udf2 ---
          [INFO] No sources to compile
          [INFO] 
          [INFO] --- maven-surefire-plugin:2.16:test (default-test) @ udf-classloader-udf2 ---
          [INFO] Tests are skipped.
          [INFO] 
          [INFO] --- maven-jar-plugin:2.2:jar (default-jar) @ udf-classloader-udf2 ---
          [INFO] Building jar: /data/hive-ptest/working/apache-github-source-source/itests/custom-udfs/udf-classloader-udf2/target/udf-classloader-udf2-2.1.0-SNAPSHOT.jar
          [INFO] 
          [INFO] --- maven-site-plugin:3.3:attach-descriptor (attach-descriptor) @ udf-classloader-udf2 ---
          [INFO] 
          [INFO] --- maven-install-plugin:2.4:install (default-install) @ udf-classloader-udf2 ---
          [INFO] Installing /data/hive-ptest/working/apache-github-source-source/itests/custom-udfs/udf-classloader-udf2/target/udf-classloader-udf2-2.1.0-SNAPSHOT.jar to /data/hive-ptest/working/maven/org/apache/hive/hive-it-custom-udfs/udf-classloader-udf2/2.1.0-SNAPSHOT/udf-classloader-udf2-2.1.0-SNAPSHOT.jar
          [INFO] Installing /data/hive-ptest/working/apache-github-source-source/itests/custom-udfs/udf-classloader-udf2/pom.xml to /data/hive-ptest/working/maven/org/apache/hive/hive-it-custom-udfs/udf-classloader-udf2/2.1.0-SNAPSHOT/udf-classloader-udf2-2.1.0-SNAPSHOT.pom
          [INFO]                                                                         
          [INFO] ------------------------------------------------------------------------
          [INFO] Building Hive Integration - HCatalog Unit Tests 2.1.0-SNAPSHOT
          [INFO] ------------------------------------------------------------------------
          [INFO] 
          [INFO] --- maven-clean-plugin:2.5:clean (default-clean) @ hive-hcatalog-it-unit ---
          [INFO] Deleting /data/hive-ptest/working/apache-github-source-source/itests/hcatalog-unit/target
          [INFO] Deleting /data/hive-ptest/working/apache-github-source-source/itests/hcatalog-unit (includes = [datanucleus.log, derby.log], excludes = [])
          [INFO] 
          [INFO] --- maven-enforcer-plugin:1.3.1:enforce (enforce-no-snapshots) @ hive-hcatalog-it-unit ---
          [INFO] 
          [INFO] --- maven-antrun-plugin:1.7:run (download-spark) @ hive-hcatalog-it-unit ---
          [INFO] Executing tasks
          
          main:
          [INFO] Executed tasks
          [INFO] 
          [INFO] --- maven-remote-resources-plugin:1.5:process (default) @ hive-hcatalog-it-unit ---
          [INFO] 
          [INFO] --- maven-resources-plugin:2.6:resources (default-resources) @ hive-hcatalog-it-unit ---
          [INFO] Using 'UTF-8' encoding to copy filtered resources.
          [INFO] skip non existing resourceDirectory /data/hive-ptest/working/apache-github-source-source/itests/hcatalog-unit/src/main/resources
          [INFO] Copying 3 resources
          [INFO] 
          [INFO] --- maven-antrun-plugin:1.7:run (define-classpath) @ hive-hcatalog-it-unit ---
          [INFO] Executing tasks
          
          main:
          [INFO] Executed tasks
          [INFO] 
          [INFO] --- maven-compiler-plugin:3.1:compile (default-compile) @ hive-hcatalog-it-unit ---
          [INFO] No sources to compile
          [INFO] 
          [INFO] --- maven-resources-plugin:2.6:testResources (default-testResources) @ hive-hcatalog-it-unit ---
          [INFO] Using 'UTF-8' encoding to copy filtered resources.
          [INFO] skip non existing resourceDirectory /data/hive-ptest/working/apache-github-source-source/itests/hcatalog-unit/src/test/resources
          [INFO] Copying 3 resources
          [INFO] 
          [INFO] --- maven-antrun-plugin:1.7:run (setup-test-dirs) @ hive-hcatalog-it-unit ---
          [INFO] Executing tasks
          
          main:
              [mkdir] Created dir: /data/hive-ptest/working/apache-github-source-source/itests/hcatalog-unit/target/tmp
              [mkdir] Created dir: /data/hive-ptest/working/apache-github-source-source/itests/hcatalog-unit/target/warehouse
              [mkdir] Created dir: /data/hive-ptest/working/apache-github-source-source/itests/hcatalog-unit/target/tmp/conf
               [copy] Copying 15 files to /data/hive-ptest/working/apache-github-source-source/itests/hcatalog-unit/target/tmp/conf
          [INFO] Executed tasks
          [INFO] 
          [INFO] --- maven-compiler-plugin:3.1:testCompile (default-testCompile) @ hive-hcatalog-it-unit ---
          [INFO] Compiling 8 source files to /data/hive-ptest/working/apache-github-source-source/itests/hcatalog-unit/target/test-classes
          [WARNING] /data/hive-ptest/working/apache-github-source-source/itests/hcatalog-unit/src/test/java/org/apache/hive/hcatalog/api/TestHCatClientNotification.java: Some input files use or override a deprecated API.
          [WARNING] /data/hive-ptest/working/apache-github-source-source/itests/hcatalog-unit/src/test/java/org/apache/hive/hcatalog/api/TestHCatClientNotification.java: Recompile with -Xlint:deprecation for details.
          [INFO] 
          [INFO] --- maven-surefire-plugin:2.16:test (default-test) @ hive-hcatalog-it-unit ---
          [INFO] Tests are skipped.
          [INFO] 
          [INFO] --- maven-jar-plugin:2.2:jar (default-jar) @ hive-hcatalog-it-unit ---
          [INFO] Building jar: /data/hive-ptest/working/apache-github-source-source/itests/hcatalog-unit/target/hive-hcatalog-it-unit-2.1.0-SNAPSHOT.jar
          [INFO] 
          [INFO] --- maven-site-plugin:3.3:attach-descriptor (attach-descriptor) @ hive-hcatalog-it-unit ---
          [INFO] 
          [INFO] --- maven-jar-plugin:2.2:test-jar (default) @ hive-hcatalog-it-unit ---
          [INFO] Building jar: /data/hive-ptest/working/apache-github-source-source/itests/hcatalog-unit/target/hive-hcatalog-it-unit-2.1.0-SNAPSHOT-tests.jar
          [INFO] 
          [INFO] --- maven-install-plugin:2.4:install (default-install) @ hive-hcatalog-it-unit ---
          [INFO] Installing /data/hive-ptest/working/apache-github-source-source/itests/hcatalog-unit/target/hive-hcatalog-it-unit-2.1.0-SNAPSHOT.jar to /data/hive-ptest/working/maven/org/apache/hive/hive-hcatalog-it-unit/2.1.0-SNAPSHOT/hive-hcatalog-it-unit-2.1.0-SNAPSHOT.jar
          [INFO] Installing /data/hive-ptest/working/apache-github-source-source/itests/hcatalog-unit/pom.xml to /data/hive-ptest/working/maven/org/apache/hive/hive-hcatalog-it-unit/2.1.0-SNAPSHOT/hive-hcatalog-it-unit-2.1.0-SNAPSHOT.pom
          [INFO] Installing /data/hive-ptest/working/apache-github-source-source/itests/hcatalog-unit/target/hive-hcatalog-it-unit-2.1.0-SNAPSHOT-tests.jar to /data/hive-ptest/working/maven/org/apache/hive/hive-hcatalog-it-unit/2.1.0-SNAPSHOT/hive-hcatalog-it-unit-2.1.0-SNAPSHOT-tests.jar
          [INFO]                                                                         
          [INFO] ------------------------------------------------------------------------
          [INFO] Building Hive Integration - Testing Utilities 2.1.0-SNAPSHOT
          [INFO] ------------------------------------------------------------------------
          [INFO] 
          [INFO] --- maven-clean-plugin:2.5:clean (default-clean) @ hive-it-util ---
          [INFO] Deleting /data/hive-ptest/working/apache-github-source-source/itests/util/target
          [INFO] Deleting /data/hive-ptest/working/apache-github-source-source/itests/util (includes = [datanucleus.log, derby.log], excludes = [])
          [INFO] 
          [INFO] --- maven-enforcer-plugin:1.3.1:enforce (enforce-no-snapshots) @ hive-it-util ---
          [INFO] 
          [INFO] --- maven-antrun-plugin:1.7:run (download-spark) @ hive-it-util ---
          [INFO] Executing tasks
          
          main:
          [INFO] Executed tasks
          [INFO] 
          [INFO] --- maven-remote-resources-plugin:1.5:process (default) @ hive-it-util ---
          [INFO] 
          [INFO] --- maven-resources-plugin:2.6:resources (default-resources) @ hive-it-util ---
          [INFO] Using 'UTF-8' encoding to copy filtered resources.
          [INFO] skip non existing resourceDirectory /data/hive-ptest/working/apache-github-source-source/itests/util/src/main/resources
          [INFO] Copying 3 resources
          [INFO] 
          [INFO] --- maven-antrun-plugin:1.7:run (define-classpath) @ hive-it-util ---
          [INFO] Executing tasks
          
          main:
          [INFO] Executed tasks
          [INFO] 
          [INFO] --- maven-compiler-plugin:3.1:compile (default-compile) @ hive-it-util ---
          [INFO] Compiling 52 source files to /data/hive-ptest/working/apache-github-source-source/itests/util/target/classes
          [INFO] -------------------------------------------------------------
          [WARNING] COMPILATION WARNING : 
          [INFO] -------------------------------------------------------------
          [WARNING] /data/hive-ptest/working/apache-github-source-source/itests/util/src/main/java/org/apache/hadoop/hive/hbase/HBaseQTestUtil.java: Some input files use or override a deprecated API.
          [WARNING] /data/hive-ptest/working/apache-github-source-source/itests/util/src/main/java/org/apache/hadoop/hive/hbase/HBaseQTestUtil.java: Recompile with -Xlint:deprecation for details.
          [INFO] 2 warnings 
          [INFO] -------------------------------------------------------------
          [INFO] -------------------------------------------------------------
          [ERROR] COMPILATION ERROR : 
          [INFO] -------------------------------------------------------------
          [ERROR] /data/hive-ptest/working/apache-github-source-source/itests/util/src/main/java/org/apache/hadoop/hive/ql/QTestUtil.java:[925,11] constructor SemanticAnalyzer in class org.apache.hadoop.hive.ql.parse.SemanticAnalyzer cannot be applied to given types;
            required: org.apache.hadoop.hive.ql.QueryState
            found: org.apache.hadoop.hive.conf.HiveConf
            reason: actual argument org.apache.hadoop.hive.conf.HiveConf cannot be converted to org.apache.hadoop.hive.ql.QueryState by method invocation conversion
          [ERROR] /data/hive-ptest/working/apache-github-source-source/itests/util/src/main/java/org/apache/hadoop/hive/ql/QTestUtil.java:[1651,11] constructor SemanticAnalyzer in class org.apache.hadoop.hive.ql.parse.SemanticAnalyzer cannot be applied to given types;
            required: org.apache.hadoop.hive.ql.QueryState
            found: org.apache.hadoop.hive.conf.HiveConf
            reason: actual argument org.apache.hadoop.hive.conf.HiveConf cannot be converted to org.apache.hadoop.hive.ql.QueryState by method invocation conversion
          [INFO] 2 errors 
          [INFO] -------------------------------------------------------------
          [INFO] ------------------------------------------------------------------------
          [INFO] Reactor Summary:
          [INFO] 
          [INFO] Hive Integration - Parent ......................... SUCCESS [8.410s]
          [INFO] Hive Integration - Custom Serde ................... SUCCESS [16.699s]
          [INFO] Hive Integration - Custom udfs .................... SUCCESS [3.240s]
          [INFO] Hive Integration - Custom UDFs - udf-classloader-util  SUCCESS [4.956s]
          [INFO] Hive Integration - Custom UDFs - udf-classloader-udf1  SUCCESS [5.087s]
          [INFO] Hive Integration - Custom UDFs - udf-classloader-udf2  SUCCESS [4.475s]
          [INFO] Hive Integration - HCatalog Unit Tests ............ SUCCESS [19.314s]
          [INFO] Hive Integration - Testing Utilities .............. FAILURE [18.330s]
          [INFO] Hive Integration - Unit Tests ..................... SKIPPED
          [INFO] Hive Integration - Test Serde ..................... SKIPPED
          [INFO] Hive Integration - QFile Tests .................... SKIPPED
          [INFO] Hive Integration - QFile Accumulo Tests ........... SKIPPED
          [INFO] JMH benchmark: Hive ............................... SKIPPED
          [INFO] Hive Integration - Unit Tests - Hadoop 2 .......... SKIPPED
          [INFO] Hive Integration - Unit Tests with miniKdc ........ SKIPPED
          [INFO] Hive Integration - QFile Spark Tests .............. SKIPPED
          [INFO] ------------------------------------------------------------------------
          [INFO] BUILD FAILURE
          [INFO] ------------------------------------------------------------------------
          [INFO] Total time: 1:25.983s
          [INFO] Finished at: Wed Apr 06 05:02:48 EDT 2016
          [INFO] Final Memory: 70M/255M
          [INFO] ------------------------------------------------------------------------
          [WARNING] The requested profile "hadoop-2" could not be activated because it does not exist.
          [ERROR] Failed to execute goal org.apache.maven.plugins:maven-compiler-plugin:3.1:compile (default-compile) on project hive-it-util: Compilation failure: Compilation failure:
          [ERROR] /data/hive-ptest/working/apache-github-source-source/itests/util/src/main/java/org/apache/hadoop/hive/ql/QTestUtil.java:[925,11] constructor SemanticAnalyzer in class org.apache.hadoop.hive.ql.parse.SemanticAnalyzer cannot be applied to given types;
          [ERROR] required: org.apache.hadoop.hive.ql.QueryState
          [ERROR] found: org.apache.hadoop.hive.conf.HiveConf
          [ERROR] reason: actual argument org.apache.hadoop.hive.conf.HiveConf cannot be converted to org.apache.hadoop.hive.ql.QueryState by method invocation conversion
          [ERROR] /data/hive-ptest/working/apache-github-source-source/itests/util/src/main/java/org/apache/hadoop/hive/ql/QTestUtil.java:[1651,11] constructor SemanticAnalyzer in class org.apache.hadoop.hive.ql.parse.SemanticAnalyzer cannot be applied to given types;
          [ERROR] required: org.apache.hadoop.hive.ql.QueryState
          [ERROR] found: org.apache.hadoop.hive.conf.HiveConf
          [ERROR] reason: actual argument org.apache.hadoop.hive.conf.HiveConf cannot be converted to org.apache.hadoop.hive.ql.QueryState by method invocation conversion
          [ERROR] -> [Help 1]
          [ERROR] 
          [ERROR] To see the full stack trace of the errors, re-run Maven with the -e switch.
          [ERROR] Re-run Maven using the -X switch to enable full debug logging.
          [ERROR] 
          [ERROR] For more information about the errors and possible solutions, please read the following articles:
          [ERROR] [Help 1] http://cwiki.apache.org/confluence/display/MAVEN/MojoFailureException
          [ERROR] 
          [ERROR] After correcting the problems, you can resume the build with the command
          [ERROR]   mvn <goals> -rf :hive-it-util
          + exit 1
          '
          

          This message is automatically generated.

          ATTACHMENT ID: 12797156 - PreCommit-HIVE-TRUNK-Build

          Show
          hiveqa Hive QA added a comment - Here are the results of testing the latest attachment: https://issues.apache.org/jira/secure/attachment/12797156/HIVE-13424.2.patch ERROR: -1 due to build exiting with an error Test results: http://ec2-174-129-184-35.compute-1.amazonaws.com/jenkins/job/PreCommit-HIVE-TRUNK-Build/7485/testReport Console output: http://ec2-174-129-184-35.compute-1.amazonaws.com/jenkins/job/PreCommit-HIVE-TRUNK-Build/7485/console Test logs: http://ec2-174-129-184-35.compute-1.amazonaws.com/logs/PreCommit-HIVE-TRUNK-Build-7485/ Messages: **** This message was trimmed, see log for full details **** [INFO] --- maven-compiler-plugin:3.1:compile (default-compile) @ udf-classloader-udf2 --- [INFO] Compiling 1 source file to /data/hive-ptest/working/apache-github-source-source/itests/custom-udfs/udf-classloader-udf2/target/classes [INFO] [INFO] --- maven-resources-plugin:2.6:testResources (default-testResources) @ udf-classloader-udf2 --- [INFO] Using 'UTF-8' encoding to copy filtered resources. [INFO] skip non existing resourceDirectory /data/hive-ptest/working/apache-github-source-source/itests/custom-udfs/udf-classloader-udf2/src/test/resources [INFO] Copying 3 resources [INFO] [INFO] --- maven-antrun-plugin:1.7:run (setup-test-dirs) @ udf-classloader-udf2 --- [INFO] Executing tasks main: [mkdir] Created dir: /data/hive-ptest/working/apache-github-source-source/itests/custom-udfs/udf-classloader-udf2/target/tmp [mkdir] Created dir: /data/hive-ptest/working/apache-github-source-source/itests/custom-udfs/udf-classloader-udf2/target/warehouse [mkdir] Created dir: /data/hive-ptest/working/apache-github-source-source/itests/custom-udfs/udf-classloader-udf2/target/tmp/conf [copy] Copying 15 files to /data/hive-ptest/working/apache-github-source-source/itests/custom-udfs/udf-classloader-udf2/target/tmp/conf [INFO] Executed tasks [INFO] [INFO] --- maven-compiler-plugin:3.1:testCompile (default-testCompile) @ udf-classloader-udf2 --- [INFO] No sources to compile [INFO] [INFO] --- maven-surefire-plugin:2.16:test (default-test) @ udf-classloader-udf2 --- [INFO] Tests are skipped. [INFO] [INFO] --- maven-jar-plugin:2.2:jar (default-jar) @ udf-classloader-udf2 --- [INFO] Building jar: /data/hive-ptest/working/apache-github-source-source/itests/custom-udfs/udf-classloader-udf2/target/udf-classloader-udf2-2.1.0-SNAPSHOT.jar [INFO] [INFO] --- maven-site-plugin:3.3:attach-descriptor (attach-descriptor) @ udf-classloader-udf2 --- [INFO] [INFO] --- maven-install-plugin:2.4:install (default-install) @ udf-classloader-udf2 --- [INFO] Installing /data/hive-ptest/working/apache-github-source-source/itests/custom-udfs/udf-classloader-udf2/target/udf-classloader-udf2-2.1.0-SNAPSHOT.jar to /data/hive-ptest/working/maven/org/apache/hive/hive-it-custom-udfs/udf-classloader-udf2/2.1.0-SNAPSHOT/udf-classloader-udf2-2.1.0-SNAPSHOT.jar [INFO] Installing /data/hive-ptest/working/apache-github-source-source/itests/custom-udfs/udf-classloader-udf2/pom.xml to /data/hive-ptest/working/maven/org/apache/hive/hive-it-custom-udfs/udf-classloader-udf2/2.1.0-SNAPSHOT/udf-classloader-udf2-2.1.0-SNAPSHOT.pom [INFO] [INFO] ------------------------------------------------------------------------ [INFO] Building Hive Integration - HCatalog Unit Tests 2.1.0-SNAPSHOT [INFO] ------------------------------------------------------------------------ [INFO] [INFO] --- maven-clean-plugin:2.5:clean (default-clean) @ hive-hcatalog-it-unit --- [INFO] Deleting /data/hive-ptest/working/apache-github-source-source/itests/hcatalog-unit/target [INFO] Deleting /data/hive-ptest/working/apache-github-source-source/itests/hcatalog-unit (includes = [datanucleus.log, derby.log], excludes = []) [INFO] [INFO] --- maven-enforcer-plugin:1.3.1:enforce (enforce-no-snapshots) @ hive-hcatalog-it-unit --- [INFO] [INFO] --- maven-antrun-plugin:1.7:run (download-spark) @ hive-hcatalog-it-unit --- [INFO] Executing tasks main: [INFO] Executed tasks [INFO] [INFO] --- maven-remote-resources-plugin:1.5:process (default) @ hive-hcatalog-it-unit --- [INFO] [INFO] --- maven-resources-plugin:2.6:resources (default-resources) @ hive-hcatalog-it-unit --- [INFO] Using 'UTF-8' encoding to copy filtered resources. [INFO] skip non existing resourceDirectory /data/hive-ptest/working/apache-github-source-source/itests/hcatalog-unit/src/main/resources [INFO] Copying 3 resources [INFO] [INFO] --- maven-antrun-plugin:1.7:run (define-classpath) @ hive-hcatalog-it-unit --- [INFO] Executing tasks main: [INFO] Executed tasks [INFO] [INFO] --- maven-compiler-plugin:3.1:compile (default-compile) @ hive-hcatalog-it-unit --- [INFO] No sources to compile [INFO] [INFO] --- maven-resources-plugin:2.6:testResources (default-testResources) @ hive-hcatalog-it-unit --- [INFO] Using 'UTF-8' encoding to copy filtered resources. [INFO] skip non existing resourceDirectory /data/hive-ptest/working/apache-github-source-source/itests/hcatalog-unit/src/test/resources [INFO] Copying 3 resources [INFO] [INFO] --- maven-antrun-plugin:1.7:run (setup-test-dirs) @ hive-hcatalog-it-unit --- [INFO] Executing tasks main: [mkdir] Created dir: /data/hive-ptest/working/apache-github-source-source/itests/hcatalog-unit/target/tmp [mkdir] Created dir: /data/hive-ptest/working/apache-github-source-source/itests/hcatalog-unit/target/warehouse [mkdir] Created dir: /data/hive-ptest/working/apache-github-source-source/itests/hcatalog-unit/target/tmp/conf [copy] Copying 15 files to /data/hive-ptest/working/apache-github-source-source/itests/hcatalog-unit/target/tmp/conf [INFO] Executed tasks [INFO] [INFO] --- maven-compiler-plugin:3.1:testCompile (default-testCompile) @ hive-hcatalog-it-unit --- [INFO] Compiling 8 source files to /data/hive-ptest/working/apache-github-source-source/itests/hcatalog-unit/target/test-classes [WARNING] /data/hive-ptest/working/apache-github-source-source/itests/hcatalog-unit/src/test/java/org/apache/hive/hcatalog/api/TestHCatClientNotification.java: Some input files use or override a deprecated API. [WARNING] /data/hive-ptest/working/apache-github-source-source/itests/hcatalog-unit/src/test/java/org/apache/hive/hcatalog/api/TestHCatClientNotification.java: Recompile with -Xlint:deprecation for details. [INFO] [INFO] --- maven-surefire-plugin:2.16:test (default-test) @ hive-hcatalog-it-unit --- [INFO] Tests are skipped. [INFO] [INFO] --- maven-jar-plugin:2.2:jar (default-jar) @ hive-hcatalog-it-unit --- [INFO] Building jar: /data/hive-ptest/working/apache-github-source-source/itests/hcatalog-unit/target/hive-hcatalog-it-unit-2.1.0-SNAPSHOT.jar [INFO] [INFO] --- maven-site-plugin:3.3:attach-descriptor (attach-descriptor) @ hive-hcatalog-it-unit --- [INFO] [INFO] --- maven-jar-plugin:2.2:test-jar (default) @ hive-hcatalog-it-unit --- [INFO] Building jar: /data/hive-ptest/working/apache-github-source-source/itests/hcatalog-unit/target/hive-hcatalog-it-unit-2.1.0-SNAPSHOT-tests.jar [INFO] [INFO] --- maven-install-plugin:2.4:install (default-install) @ hive-hcatalog-it-unit --- [INFO] Installing /data/hive-ptest/working/apache-github-source-source/itests/hcatalog-unit/target/hive-hcatalog-it-unit-2.1.0-SNAPSHOT.jar to /data/hive-ptest/working/maven/org/apache/hive/hive-hcatalog-it-unit/2.1.0-SNAPSHOT/hive-hcatalog-it-unit-2.1.0-SNAPSHOT.jar [INFO] Installing /data/hive-ptest/working/apache-github-source-source/itests/hcatalog-unit/pom.xml to /data/hive-ptest/working/maven/org/apache/hive/hive-hcatalog-it-unit/2.1.0-SNAPSHOT/hive-hcatalog-it-unit-2.1.0-SNAPSHOT.pom [INFO] Installing /data/hive-ptest/working/apache-github-source-source/itests/hcatalog-unit/target/hive-hcatalog-it-unit-2.1.0-SNAPSHOT-tests.jar to /data/hive-ptest/working/maven/org/apache/hive/hive-hcatalog-it-unit/2.1.0-SNAPSHOT/hive-hcatalog-it-unit-2.1.0-SNAPSHOT-tests.jar [INFO] [INFO] ------------------------------------------------------------------------ [INFO] Building Hive Integration - Testing Utilities 2.1.0-SNAPSHOT [INFO] ------------------------------------------------------------------------ [INFO] [INFO] --- maven-clean-plugin:2.5:clean (default-clean) @ hive-it-util --- [INFO] Deleting /data/hive-ptest/working/apache-github-source-source/itests/util/target [INFO] Deleting /data/hive-ptest/working/apache-github-source-source/itests/util (includes = [datanucleus.log, derby.log], excludes = []) [INFO] [INFO] --- maven-enforcer-plugin:1.3.1:enforce (enforce-no-snapshots) @ hive-it-util --- [INFO] [INFO] --- maven-antrun-plugin:1.7:run (download-spark) @ hive-it-util --- [INFO] Executing tasks main: [INFO] Executed tasks [INFO] [INFO] --- maven-remote-resources-plugin:1.5:process (default) @ hive-it-util --- [INFO] [INFO] --- maven-resources-plugin:2.6:resources (default-resources) @ hive-it-util --- [INFO] Using 'UTF-8' encoding to copy filtered resources. [INFO] skip non existing resourceDirectory /data/hive-ptest/working/apache-github-source-source/itests/util/src/main/resources [INFO] Copying 3 resources [INFO] [INFO] --- maven-antrun-plugin:1.7:run (define-classpath) @ hive-it-util --- [INFO] Executing tasks main: [INFO] Executed tasks [INFO] [INFO] --- maven-compiler-plugin:3.1:compile (default-compile) @ hive-it-util --- [INFO] Compiling 52 source files to /data/hive-ptest/working/apache-github-source-source/itests/util/target/classes [INFO] ------------------------------------------------------------- [WARNING] COMPILATION WARNING : [INFO] ------------------------------------------------------------- [WARNING] /data/hive-ptest/working/apache-github-source-source/itests/util/src/main/java/org/apache/hadoop/hive/hbase/HBaseQTestUtil.java: Some input files use or override a deprecated API. [WARNING] /data/hive-ptest/working/apache-github-source-source/itests/util/src/main/java/org/apache/hadoop/hive/hbase/HBaseQTestUtil.java: Recompile with -Xlint:deprecation for details. [INFO] 2 warnings [INFO] ------------------------------------------------------------- [INFO] ------------------------------------------------------------- [ERROR] COMPILATION ERROR : [INFO] ------------------------------------------------------------- [ERROR] /data/hive-ptest/working/apache-github-source-source/itests/util/src/main/java/org/apache/hadoop/hive/ql/QTestUtil.java:[925,11] constructor SemanticAnalyzer in class org.apache.hadoop.hive.ql.parse.SemanticAnalyzer cannot be applied to given types; required: org.apache.hadoop.hive.ql.QueryState found: org.apache.hadoop.hive.conf.HiveConf reason: actual argument org.apache.hadoop.hive.conf.HiveConf cannot be converted to org.apache.hadoop.hive.ql.QueryState by method invocation conversion [ERROR] /data/hive-ptest/working/apache-github-source-source/itests/util/src/main/java/org/apache/hadoop/hive/ql/QTestUtil.java:[1651,11] constructor SemanticAnalyzer in class org.apache.hadoop.hive.ql.parse.SemanticAnalyzer cannot be applied to given types; required: org.apache.hadoop.hive.ql.QueryState found: org.apache.hadoop.hive.conf.HiveConf reason: actual argument org.apache.hadoop.hive.conf.HiveConf cannot be converted to org.apache.hadoop.hive.ql.QueryState by method invocation conversion [INFO] 2 errors [INFO] ------------------------------------------------------------- [INFO] ------------------------------------------------------------------------ [INFO] Reactor Summary: [INFO] [INFO] Hive Integration - Parent ......................... SUCCESS [8.410s] [INFO] Hive Integration - Custom Serde ................... SUCCESS [16.699s] [INFO] Hive Integration - Custom udfs .................... SUCCESS [3.240s] [INFO] Hive Integration - Custom UDFs - udf-classloader-util SUCCESS [4.956s] [INFO] Hive Integration - Custom UDFs - udf-classloader-udf1 SUCCESS [5.087s] [INFO] Hive Integration - Custom UDFs - udf-classloader-udf2 SUCCESS [4.475s] [INFO] Hive Integration - HCatalog Unit Tests ............ SUCCESS [19.314s] [INFO] Hive Integration - Testing Utilities .............. FAILURE [18.330s] [INFO] Hive Integration - Unit Tests ..................... SKIPPED [INFO] Hive Integration - Test Serde ..................... SKIPPED [INFO] Hive Integration - QFile Tests .................... SKIPPED [INFO] Hive Integration - QFile Accumulo Tests ........... SKIPPED [INFO] JMH benchmark: Hive ............................... SKIPPED [INFO] Hive Integration - Unit Tests - Hadoop 2 .......... SKIPPED [INFO] Hive Integration - Unit Tests with miniKdc ........ SKIPPED [INFO] Hive Integration - QFile Spark Tests .............. SKIPPED [INFO] ------------------------------------------------------------------------ [INFO] BUILD FAILURE [INFO] ------------------------------------------------------------------------ [INFO] Total time: 1:25.983s [INFO] Finished at: Wed Apr 06 05:02:48 EDT 2016 [INFO] Final Memory: 70M/255M [INFO] ------------------------------------------------------------------------ [WARNING] The requested profile "hadoop-2" could not be activated because it does not exist. [ERROR] Failed to execute goal org.apache.maven.plugins:maven-compiler-plugin:3.1:compile (default-compile) on project hive-it-util: Compilation failure: Compilation failure: [ERROR] /data/hive-ptest/working/apache-github-source-source/itests/util/src/main/java/org/apache/hadoop/hive/ql/QTestUtil.java:[925,11] constructor SemanticAnalyzer in class org.apache.hadoop.hive.ql.parse.SemanticAnalyzer cannot be applied to given types; [ERROR] required: org.apache.hadoop.hive.ql.QueryState [ERROR] found: org.apache.hadoop.hive.conf.HiveConf [ERROR] reason: actual argument org.apache.hadoop.hive.conf.HiveConf cannot be converted to org.apache.hadoop.hive.ql.QueryState by method invocation conversion [ERROR] /data/hive-ptest/working/apache-github-source-source/itests/util/src/main/java/org/apache/hadoop/hive/ql/QTestUtil.java:[1651,11] constructor SemanticAnalyzer in class org.apache.hadoop.hive.ql.parse.SemanticAnalyzer cannot be applied to given types; [ERROR] required: org.apache.hadoop.hive.ql.QueryState [ERROR] found: org.apache.hadoop.hive.conf.HiveConf [ERROR] reason: actual argument org.apache.hadoop.hive.conf.HiveConf cannot be converted to org.apache.hadoop.hive.ql.QueryState by method invocation conversion [ERROR] -> [Help 1] [ERROR] [ERROR] To see the full stack trace of the errors, re-run Maven with the -e switch. [ERROR] Re-run Maven using the -X switch to enable full debug logging. [ERROR] [ERROR] For more information about the errors and possible solutions, please read the following articles: [ERROR] [Help 1] http://cwiki.apache.org/confluence/display/MAVEN/MojoFailureException [ERROR] [ERROR] After correcting the problems, you can resume the build with the command [ERROR] mvn <goals> -rf :hive-it-util + exit 1 ' This message is automatically generated. ATTACHMENT ID: 12797156 - PreCommit-HIVE-TRUNK-Build
          Hide
          aihuaxu Aihua Xu added a comment -

          Attached patch-3: fixed the test build failure.

          Show
          aihuaxu Aihua Xu added a comment - Attached patch-3: fixed the test build failure.
          Hide
          hiveqa Hive QA added a comment -

          Here are the results of testing the latest attachment:
          https://issues.apache.org/jira/secure/attachment/12797330/HIVE-13424.3.patch

          SUCCESS: +1 due to 14 test(s) being added or modified.

          ERROR: -1 due to 389 failed/errored test(s), 9967 tests executed
          Failed tests:

          org.apache.hadoop.hive.cli.TestMiniSparkOnYarnCliDriver.testCliDriver_index_bitmap3
          org.apache.hadoop.hive.cli.TestMiniTezCliDriver.org.apache.hadoop.hive.cli.TestMiniTezCliDriver
          org.apache.hadoop.hive.cli.TestMiniTezCliDriver.testCliDriver_acid_globallimit
          org.apache.hadoop.hive.cli.TestMiniTezCliDriver.testCliDriver_alter_merge_2_orc
          org.apache.hadoop.hive.cli.TestMiniTezCliDriver.testCliDriver_alter_merge_orc
          org.apache.hadoop.hive.cli.TestMiniTezCliDriver.testCliDriver_alter_merge_stats_orc
          org.apache.hadoop.hive.cli.TestMiniTezCliDriver.testCliDriver_auto_join0
          org.apache.hadoop.hive.cli.TestMiniTezCliDriver.testCliDriver_auto_join1
          org.apache.hadoop.hive.cli.TestMiniTezCliDriver.testCliDriver_auto_join21
          org.apache.hadoop.hive.cli.TestMiniTezCliDriver.testCliDriver_auto_join29
          org.apache.hadoop.hive.cli.TestMiniTezCliDriver.testCliDriver_auto_join30
          org.apache.hadoop.hive.cli.TestMiniTezCliDriver.testCliDriver_auto_join_filters
          org.apache.hadoop.hive.cli.TestMiniTezCliDriver.testCliDriver_auto_join_nulls
          org.apache.hadoop.hive.cli.TestMiniTezCliDriver.testCliDriver_auto_sortmerge_join_1
          org.apache.hadoop.hive.cli.TestMiniTezCliDriver.testCliDriver_auto_sortmerge_join_10
          org.apache.hadoop.hive.cli.TestMiniTezCliDriver.testCliDriver_auto_sortmerge_join_11
          org.apache.hadoop.hive.cli.TestMiniTezCliDriver.testCliDriver_auto_sortmerge_join_12
          org.apache.hadoop.hive.cli.TestMiniTezCliDriver.testCliDriver_auto_sortmerge_join_13
          org.apache.hadoop.hive.cli.TestMiniTezCliDriver.testCliDriver_auto_sortmerge_join_14
          org.apache.hadoop.hive.cli.TestMiniTezCliDriver.testCliDriver_auto_sortmerge_join_15
          org.apache.hadoop.hive.cli.TestMiniTezCliDriver.testCliDriver_auto_sortmerge_join_16
          org.apache.hadoop.hive.cli.TestMiniTezCliDriver.testCliDriver_auto_sortmerge_join_2
          org.apache.hadoop.hive.cli.TestMiniTezCliDriver.testCliDriver_auto_sortmerge_join_3
          org.apache.hadoop.hive.cli.TestMiniTezCliDriver.testCliDriver_auto_sortmerge_join_4
          org.apache.hadoop.hive.cli.TestMiniTezCliDriver.testCliDriver_auto_sortmerge_join_5
          org.apache.hadoop.hive.cli.TestMiniTezCliDriver.testCliDriver_auto_sortmerge_join_6
          org.apache.hadoop.hive.cli.TestMiniTezCliDriver.testCliDriver_auto_sortmerge_join_7
          org.apache.hadoop.hive.cli.TestMiniTezCliDriver.testCliDriver_auto_sortmerge_join_8
          org.apache.hadoop.hive.cli.TestMiniTezCliDriver.testCliDriver_auto_sortmerge_join_9
          org.apache.hadoop.hive.cli.TestMiniTezCliDriver.testCliDriver_bucket2
          org.apache.hadoop.hive.cli.TestMiniTezCliDriver.testCliDriver_bucket3
          org.apache.hadoop.hive.cli.TestMiniTezCliDriver.testCliDriver_bucket4
          org.apache.hadoop.hive.cli.TestMiniTezCliDriver.testCliDriver_bucket_map_join_tez1
          org.apache.hadoop.hive.cli.TestMiniTezCliDriver.testCliDriver_bucket_map_join_tez2
          org.apache.hadoop.hive.cli.TestMiniTezCliDriver.testCliDriver_bucketpruning1
          org.apache.hadoop.hive.cli.TestMiniTezCliDriver.testCliDriver_cbo_gby
          org.apache.hadoop.hive.cli.TestMiniTezCliDriver.testCliDriver_cbo_gby_empty
          org.apache.hadoop.hive.cli.TestMiniTezCliDriver.testCliDriver_cbo_join
          org.apache.hadoop.hive.cli.TestMiniTezCliDriver.testCliDriver_cbo_limit
          org.apache.hadoop.hive.cli.TestMiniTezCliDriver.testCliDriver_cbo_semijoin
          org.apache.hadoop.hive.cli.TestMiniTezCliDriver.testCliDriver_cbo_simple_select
          org.apache.hadoop.hive.cli.TestMiniTezCliDriver.testCliDriver_cbo_stats
          org.apache.hadoop.hive.cli.TestMiniTezCliDriver.testCliDriver_cbo_subq_exists
          org.apache.hadoop.hive.cli.TestMiniTezCliDriver.testCliDriver_cbo_subq_in
          org.apache.hadoop.hive.cli.TestMiniTezCliDriver.testCliDriver_cbo_subq_not_in
          org.apache.hadoop.hive.cli.TestMiniTezCliDriver.testCliDriver_cbo_udf_udaf
          org.apache.hadoop.hive.cli.TestMiniTezCliDriver.testCliDriver_cbo_union
          org.apache.hadoop.hive.cli.TestMiniTezCliDriver.testCliDriver_cbo_views
          org.apache.hadoop.hive.cli.TestMiniTezCliDriver.testCliDriver_cbo_windowing
          org.apache.hadoop.hive.cli.TestMiniTezCliDriver.testCliDriver_column_names_with_leading_and_trailing_spaces
          org.apache.hadoop.hive.cli.TestMiniTezCliDriver.testCliDriver_constprog_dpp
          org.apache.hadoop.hive.cli.TestMiniTezCliDriver.testCliDriver_constprog_semijoin
          org.apache.hadoop.hive.cli.TestMiniTezCliDriver.testCliDriver_correlationoptimizer1
          org.apache.hadoop.hive.cli.TestMiniTezCliDriver.testCliDriver_count
          org.apache.hadoop.hive.cli.TestMiniTezCliDriver.testCliDriver_create_merge_compressed
          org.apache.hadoop.hive.cli.TestMiniTezCliDriver.testCliDriver_cross_join
          org.apache.hadoop.hive.cli.TestMiniTezCliDriver.testCliDriver_cross_product_check_1
          org.apache.hadoop.hive.cli.TestMiniTezCliDriver.testCliDriver_cross_product_check_2
          org.apache.hadoop.hive.cli.TestMiniTezCliDriver.testCliDriver_ctas
          org.apache.hadoop.hive.cli.TestMiniTezCliDriver.testCliDriver_cte_1
          org.apache.hadoop.hive.cli.TestMiniTezCliDriver.testCliDriver_cte_2
          org.apache.hadoop.hive.cli.TestMiniTezCliDriver.testCliDriver_cte_3
          org.apache.hadoop.hive.cli.TestMiniTezCliDriver.testCliDriver_cte_4
          org.apache.hadoop.hive.cli.TestMiniTezCliDriver.testCliDriver_cte_5
          org.apache.hadoop.hive.cli.TestMiniTezCliDriver.testCliDriver_cte_mat_1
          org.apache.hadoop.hive.cli.TestMiniTezCliDriver.testCliDriver_cte_mat_2
          org.apache.hadoop.hive.cli.TestMiniTezCliDriver.testCliDriver_cte_mat_3
          org.apache.hadoop.hive.cli.TestMiniTezCliDriver.testCliDriver_cte_mat_4
          org.apache.hadoop.hive.cli.TestMiniTezCliDriver.testCliDriver_cte_mat_5
          org.apache.hadoop.hive.cli.TestMiniTezCliDriver.testCliDriver_custom_input_output_format
          org.apache.hadoop.hive.cli.TestMiniTezCliDriver.testCliDriver_delete_all_non_partitioned
          org.apache.hadoop.hive.cli.TestMiniTezCliDriver.testCliDriver_delete_all_partitioned
          org.apache.hadoop.hive.cli.TestMiniTezCliDriver.testCliDriver_delete_orig_table
          org.apache.hadoop.hive.cli.TestMiniTezCliDriver.testCliDriver_delete_tmp_table
          org.apache.hadoop.hive.cli.TestMiniTezCliDriver.testCliDriver_delete_where_no_match
          org.apache.hadoop.hive.cli.TestMiniTezCliDriver.testCliDriver_delete_where_non_partitioned
          org.apache.hadoop.hive.cli.TestMiniTezCliDriver.testCliDriver_delete_where_partitioned
          org.apache.hadoop.hive.cli.TestMiniTezCliDriver.testCliDriver_delete_whole_partition
          org.apache.hadoop.hive.cli.TestMiniTezCliDriver.testCliDriver_disable_merge_for_bucketing
          org.apache.hadoop.hive.cli.TestMiniTezCliDriver.testCliDriver_dynamic_partition_pruning
          org.apache.hadoop.hive.cli.TestMiniTezCliDriver.testCliDriver_dynamic_partition_pruning_2
          org.apache.hadoop.hive.cli.TestMiniTezCliDriver.testCliDriver_dynpart_sort_opt_vectorization
          org.apache.hadoop.hive.cli.TestMiniTezCliDriver.testCliDriver_dynpart_sort_optimization
          org.apache.hadoop.hive.cli.TestMiniTezCliDriver.testCliDriver_dynpart_sort_optimization2
          org.apache.hadoop.hive.cli.TestMiniTezCliDriver.testCliDriver_empty_join
          org.apache.hadoop.hive.cli.TestMiniTezCliDriver.testCliDriver_enforce_order
          org.apache.hadoop.hive.cli.TestMiniTezCliDriver.testCliDriver_explainuser_1
          org.apache.hadoop.hive.cli.TestMiniTezCliDriver.testCliDriver_explainuser_2
          org.apache.hadoop.hive.cli.TestMiniTezCliDriver.testCliDriver_explainuser_3
          org.apache.hadoop.hive.cli.TestMiniTezCliDriver.testCliDriver_explainuser_4
          org.apache.hadoop.hive.cli.TestMiniTezCliDriver.testCliDriver_filter_join_breaktask
          org.apache.hadoop.hive.cli.TestMiniTezCliDriver.testCliDriver_filter_join_breaktask2
          org.apache.hadoop.hive.cli.TestMiniTezCliDriver.testCliDriver_groupby1
          org.apache.hadoop.hive.cli.TestMiniTezCliDriver.testCliDriver_groupby2
          org.apache.hadoop.hive.cli.TestMiniTezCliDriver.testCliDriver_groupby3
          org.apache.hadoop.hive.cli.TestMiniTezCliDriver.testCliDriver_having
          org.apache.hadoop.hive.cli.TestMiniTezCliDriver.testCliDriver_hybridgrace_hashjoin_1
          org.apache.hadoop.hive.cli.TestMiniTezCliDriver.testCliDriver_hybridgrace_hashjoin_2
          org.apache.hadoop.hive.cli.TestMiniTezCliDriver.testCliDriver_insert_into1
          org.apache.hadoop.hive.cli.TestMiniTezCliDriver.testCliDriver_insert_into2
          org.apache.hadoop.hive.cli.TestMiniTezCliDriver.testCliDriver_insert_orig_table
          org.apache.hadoop.hive.cli.TestMiniTezCliDriver.testCliDriver_insert_update_delete
          org.apache.hadoop.hive.cli.TestMiniTezCliDriver.testCliDriver_insert_values_dynamic_partitioned
          org.apache.hadoop.hive.cli.TestMiniTezCliDriver.testCliDriver_insert_values_non_partitioned
          org.apache.hadoop.hive.cli.TestMiniTezCliDriver.testCliDriver_insert_values_tmp_table
          org.apache.hadoop.hive.cli.TestMiniTezCliDriver.testCliDriver_join0
          org.apache.hadoop.hive.cli.TestMiniTezCliDriver.testCliDriver_join1
          org.apache.hadoop.hive.cli.TestMiniTezCliDriver.testCliDriver_join_nullsafe
          org.apache.hadoop.hive.cli.TestMiniTezCliDriver.testCliDriver_leftsemijoin
          org.apache.hadoop.hive.cli.TestMiniTezCliDriver.testCliDriver_limit_pushdown
          org.apache.hadoop.hive.cli.TestMiniTezCliDriver.testCliDriver_llap_nullscan
          org.apache.hadoop.hive.cli.TestMiniTezCliDriver.testCliDriver_llapdecider
          org.apache.hadoop.hive.cli.TestMiniTezCliDriver.testCliDriver_load_dyn_part1
          org.apache.hadoop.hive.cli.TestMiniTezCliDriver.testCliDriver_load_dyn_part2
          org.apache.hadoop.hive.cli.TestMiniTezCliDriver.testCliDriver_load_dyn_part3
          org.apache.hadoop.hive.cli.TestMiniTezCliDriver.testCliDriver_lvj_mapjoin
          org.apache.hadoop.hive.cli.TestMiniTezCliDriver.testCliDriver_mapjoin_decimal
          org.apache.hadoop.hive.cli.TestMiniTezCliDriver.testCliDriver_mapjoin_mapjoin
          org.apache.hadoop.hive.cli.TestMiniTezCliDriver.testCliDriver_mapreduce1
          org.apache.hadoop.hive.cli.TestMiniTezCliDriver.testCliDriver_mapreduce2
          org.apache.hadoop.hive.cli.TestMiniTezCliDriver.testCliDriver_merge1
          org.apache.hadoop.hive.cli.TestMiniTezCliDriver.testCliDriver_merge2
          org.apache.hadoop.hive.cli.TestMiniTezCliDriver.testCliDriver_mergejoin
          org.apache.hadoop.hive.cli.TestMiniTezCliDriver.testCliDriver_mergejoin_3way
          org.apache.hadoop.hive.cli.TestMiniTezCliDriver.testCliDriver_metadata_only_queries
          org.apache.hadoop.hive.cli.TestMiniTezCliDriver.testCliDriver_metadata_only_queries_with_filters
          org.apache.hadoop.hive.cli.TestMiniTezCliDriver.testCliDriver_metadataonly1
          org.apache.hadoop.hive.cli.TestMiniTezCliDriver.testCliDriver_mrr
          org.apache.hadoop.hive.cli.TestMiniTezCliDriver.testCliDriver_nonmr_fetch_threshold
          org.apache.hadoop.hive.cli.TestMiniTezCliDriver.testCliDriver_optimize_nullscan
          org.apache.hadoop.hive.cli.TestMiniTezCliDriver.testCliDriver_orc_analyze
          org.apache.hadoop.hive.cli.TestMiniTezCliDriver.testCliDriver_orc_merge1
          org.apache.hadoop.hive.cli.TestMiniTezCliDriver.testCliDriver_orc_merge10
          org.apache.hadoop.hive.cli.TestMiniTezCliDriver.testCliDriver_orc_merge11
          org.apache.hadoop.hive.cli.TestMiniTezCliDriver.testCliDriver_orc_merge12
          org.apache.hadoop.hive.cli.TestMiniTezCliDriver.testCliDriver_orc_merge2
          org.apache.hadoop.hive.cli.TestMiniTezCliDriver.testCliDriver_orc_merge3
          org.apache.hadoop.hive.cli.TestMiniTezCliDriver.testCliDriver_orc_merge4
          org.apache.hadoop.hive.cli.TestMiniTezCliDriver.testCliDriver_orc_merge5
          org.apache.hadoop.hive.cli.TestMiniTezCliDriver.testCliDriver_orc_merge6
          org.apache.hadoop.hive.cli.TestMiniTezCliDriver.testCliDriver_orc_merge7
          org.apache.hadoop.hive.cli.TestMiniTezCliDriver.testCliDriver_orc_merge8
          org.apache.hadoop.hive.cli.TestMiniTezCliDriver.testCliDriver_orc_merge9
          org.apache.hadoop.hive.cli.TestMiniTezCliDriver.testCliDriver_orc_merge_diff_fs
          org.apache.hadoop.hive.cli.TestMiniTezCliDriver.testCliDriver_orc_merge_incompat1
          org.apache.hadoop.hive.cli.TestMiniTezCliDriver.testCliDriver_orc_merge_incompat2
          org.apache.hadoop.hive.cli.TestMiniTezCliDriver.testCliDriver_orc_merge_incompat3
          org.apache.hadoop.hive.cli.TestMiniTezCliDriver.testCliDriver_orc_ppd_basic
          org.apache.hadoop.hive.cli.TestMiniTezCliDriver.testCliDriver_orc_vectorization_ppd
          org.apache.hadoop.hive.cli.TestMiniTezCliDriver.testCliDriver_order_null
          org.apache.hadoop.hive.cli.TestMiniTezCliDriver.testCliDriver_parallel
          org.apache.hadoop.hive.cli.TestMiniTezCliDriver.testCliDriver_ptf
          org.apache.hadoop.hive.cli.TestMiniTezCliDriver.testCliDriver_ptf_matchpath
          org.apache.hadoop.hive.cli.TestMiniTezCliDriver.testCliDriver_ptf_streaming
          org.apache.hadoop.hive.cli.TestMiniTezCliDriver.testCliDriver_sample1
          org.apache.hadoop.hive.cli.TestMiniTezCliDriver.testCliDriver_schema_evol_orc_acid_mapwork_part
          org.apache.hadoop.hive.cli.TestMiniTezCliDriver.testCliDriver_schema_evol_orc_acid_mapwork_table
          org.apache.hadoop.hive.cli.TestMiniTezCliDriver.testCliDriver_schema_evol_orc_acidvec_mapwork_part
          org.apache.hadoop.hive.cli.TestMiniTezCliDriver.testCliDriver_schema_evol_orc_acidvec_mapwork_table
          org.apache.hadoop.hive.cli.TestMiniTezCliDriver.testCliDriver_schema_evol_orc_nonvec_fetchwork_part
          org.apache.hadoop.hive.cli.TestMiniTezCliDriver.testCliDriver_schema_evol_orc_nonvec_fetchwork_table
          org.apache.hadoop.hive.cli.TestMiniTezCliDriver.testCliDriver_schema_evol_orc_nonvec_mapwork_part
          org.apache.hadoop.hive.cli.TestMiniTezCliDriver.testCliDriver_schema_evol_orc_nonvec_mapwork_table
          org.apache.hadoop.hive.cli.TestMiniTezCliDriver.testCliDriver_schema_evol_orc_vec_mapwork_part
          org.apache.hadoop.hive.cli.TestMiniTezCliDriver.testCliDriver_schema_evol_orc_vec_mapwork_table
          org.apache.hadoop.hive.cli.TestMiniTezCliDriver.testCliDriver_schema_evol_stats
          org.apache.hadoop.hive.cli.TestMiniTezCliDriver.testCliDriver_schema_evol_text_fetchwork_table
          org.apache.hadoop.hive.cli.TestMiniTezCliDriver.testCliDriver_schema_evol_text_mapwork_table
          org.apache.hadoop.hive.cli.TestMiniTezCliDriver.testCliDriver_schema_evol_text_nonvec_fetchwork_part
          org.apache.hadoop.hive.cli.TestMiniTezCliDriver.testCliDriver_schema_evol_text_nonvec_fetchwork_table
          org.apache.hadoop.hive.cli.TestMiniTezCliDriver.testCliDriver_schema_evol_text_nonvec_mapwork_part
          org.apache.hadoop.hive.cli.TestMiniTezCliDriver.testCliDriver_schema_evol_text_nonvec_mapwork_table
          org.apache.hadoop.hive.cli.TestMiniTezCliDriver.testCliDriver_script_env_var1
          org.apache.hadoop.hive.cli.TestMiniTezCliDriver.testCliDriver_script_env_var2
          org.apache.hadoop.hive.cli.TestMiniTezCliDriver.testCliDriver_script_pipe
          org.apache.hadoop.hive.cli.TestMiniTezCliDriver.testCliDriver_scriptfile1
          org.apache.hadoop.hive.cli.TestMiniTezCliDriver.testCliDriver_selectDistinctStar
          org.apache.hadoop.hive.cli.TestMiniTezCliDriver.testCliDriver_select_dummy_source
          org.apache.hadoop.hive.cli.TestMiniTezCliDriver.testCliDriver_skewjoin
          org.apache.hadoop.hive.cli.TestMiniTezCliDriver.testCliDriver_smb_cache
          org.apache.hadoop.hive.cli.TestMiniTezCliDriver.testCliDriver_stats_filemetadata
          org.apache.hadoop.hive.cli.TestMiniTezCliDriver.testCliDriver_stats_noscan_1
          org.apache.hadoop.hive.cli.TestMiniTezCliDriver.testCliDriver_stats_only_null
          org.apache.hadoop.hive.cli.TestMiniTezCliDriver.testCliDriver_subquery_exists
          org.apache.hadoop.hive.cli.TestMiniTezCliDriver.testCliDriver_subquery_in
          org.apache.hadoop.hive.cli.TestMiniTezCliDriver.testCliDriver_temp_table
          org.apache.hadoop.hive.cli.TestMiniTezCliDriver.testCliDriver_tez_bmj_schema_evolution
          org.apache.hadoop.hive.cli.TestMiniTezCliDriver.testCliDriver_tez_dml
          org.apache.hadoop.hive.cli.TestMiniTezCliDriver.testCliDriver_tez_dynpart_hashjoin_1
          org.apache.hadoop.hive.cli.TestMiniTezCliDriver.testCliDriver_tez_dynpart_hashjoin_2
          org.apache.hadoop.hive.cli.TestMiniTezCliDriver.testCliDriver_tez_dynpart_hashjoin_3
          org.apache.hadoop.hive.cli.TestMiniTezCliDriver.testCliDriver_tez_fsstat
          org.apache.hadoop.hive.cli.TestMiniTezCliDriver.testCliDriver_tez_insert_overwrite_local_directory_1
          org.apache.hadoop.hive.cli.TestMiniTezCliDriver.testCliDriver_tez_join
          org.apache.hadoop.hive.cli.TestMiniTezCliDriver.testCliDriver_tez_join_hash
          org.apache.hadoop.hive.cli.TestMiniTezCliDriver.testCliDriver_tez_join_result_complex
          org.apache.hadoop.hive.cli.TestMiniTezCliDriver.testCliDriver_tez_join_tests
          org.apache.hadoop.hive.cli.TestMiniTezCliDriver.testCliDriver_tez_joins_explain
          org.apache.hadoop.hive.cli.TestMiniTezCliDriver.testCliDriver_tez_multi_union
          org.apache.hadoop.hive.cli.TestMiniTezCliDriver.testCliDriver_tez_schema_evolution
          org.apache.hadoop.hive.cli.TestMiniTezCliDriver.testCliDriver_tez_self_join
          org.apache.hadoop.hive.cli.TestMiniTezCliDriver.testCliDriver_tez_smb_1
          org.apache.hadoop.hive.cli.TestMiniTezCliDriver.testCliDriver_tez_smb_empty
          org.apache.hadoop.hive.cli.TestMiniTezCliDriver.testCliDriver_tez_smb_main
          org.apache.hadoop.hive.cli.TestMiniTezCliDriver.testCliDriver_tez_union
          org.apache.hadoop.hive.cli.TestMiniTezCliDriver.testCliDriver_tez_union2
          org.apache.hadoop.hive.cli.TestMiniTezCliDriver.testCliDriver_tez_union_decimal
          org.apache.hadoop.hive.cli.TestMiniTezCliDriver.testCliDriver_tez_union_dynamic_partition
          org.apache.hadoop.hive.cli.TestMiniTezCliDriver.testCliDriver_tez_union_group_by
          org.apache.hadoop.hive.cli.TestMiniTezCliDriver.testCliDriver_tez_union_multiinsert
          org.apache.hadoop.hive.cli.TestMiniTezCliDriver.testCliDriver_tez_union_with_udf
          org.apache.hadoop.hive.cli.TestMiniTezCliDriver.testCliDriver_tez_vector_dynpart_hashjoin_1
          org.apache.hadoop.hive.cli.TestMiniTezCliDriver.testCliDriver_tez_vector_dynpart_hashjoin_2
          org.apache.hadoop.hive.cli.TestMiniTezCliDriver.testCliDriver_transform1
          org.apache.hadoop.hive.cli.TestMiniTezCliDriver.testCliDriver_transform2
          org.apache.hadoop.hive.cli.TestMiniTezCliDriver.testCliDriver_transform_ppr1
          org.apache.hadoop.hive.cli.TestMiniTezCliDriver.testCliDriver_transform_ppr2
          org.apache.hadoop.hive.cli.TestMiniTezCliDriver.testCliDriver_union2
          org.apache.hadoop.hive.cli.TestMiniTezCliDriver.testCliDriver_union3
          org.apache.hadoop.hive.cli.TestMiniTezCliDriver.testCliDriver_union4
          org.apache.hadoop.hive.cli.TestMiniTezCliDriver.testCliDriver_union5
          org.apache.hadoop.hive.cli.TestMiniTezCliDriver.testCliDriver_union6
          org.apache.hadoop.hive.cli.TestMiniTezCliDriver.testCliDriver_union7
          org.apache.hadoop.hive.cli.TestMiniTezCliDriver.testCliDriver_union8
          org.apache.hadoop.hive.cli.TestMiniTezCliDriver.testCliDriver_union9
          org.apache.hadoop.hive.cli.TestMiniTezCliDriver.testCliDriver_unionDistinct_1
          org.apache.hadoop.hive.cli.TestMiniTezCliDriver.testCliDriver_unionDistinct_2
          org.apache.hadoop.hive.cli.TestMiniTezCliDriver.testCliDriver_union_fast_stats
          org.apache.hadoop.hive.cli.TestMiniTezCliDriver.testCliDriver_union_type_chk
          org.apache.hadoop.hive.cli.TestMiniTezCliDriver.testCliDriver_update_after_multiple_inserts
          org.apache.hadoop.hive.cli.TestMiniTezCliDriver.testCliDriver_update_all_non_partitioned
          org.apache.hadoop.hive.cli.TestMiniTezCliDriver.testCliDriver_update_all_partitioned
          org.apache.hadoop.hive.cli.TestMiniTezCliDriver.testCliDriver_update_all_types
          org.apache.hadoop.hive.cli.TestMiniTezCliDriver.testCliDriver_update_orig_table
          org.apache.hadoop.hive.cli.TestMiniTezCliDriver.testCliDriver_update_tmp_table
          org.apache.hadoop.hive.cli.TestMiniTezCliDriver.testCliDriver_update_two_cols
          org.apache.hadoop.hive.cli.TestMiniTezCliDriver.testCliDriver_update_where_no_match
          org.apache.hadoop.hive.cli.TestMiniTezCliDriver.testCliDriver_update_where_non_partitioned
          org.apache.hadoop.hive.cli.TestMiniTezCliDriver.testCliDriver_update_where_partitioned
          org.apache.hadoop.hive.cli.TestMiniTezCliDriver.testCliDriver_vector_acid3
          org.apache.hadoop.hive.cli.TestMiniTezCliDriver.testCliDriver_vector_aggregate_9
          org.apache.hadoop.hive.cli.TestMiniTezCliDriver.testCliDriver_vector_aggregate_without_gby
          org.apache.hadoop.hive.cli.TestMiniTezCliDriver.testCliDriver_vector_auto_smb_mapjoin_14
          org.apache.hadoop.hive.cli.TestMiniTezCliDriver.testCliDriver_vector_between_columns
          org.apache.hadoop.hive.cli.TestMiniTezCliDriver.testCliDriver_vector_between_in
          org.apache.hadoop.hive.cli.TestMiniTezCliDriver.testCliDriver_vector_binary_join_groupby
          org.apache.hadoop.hive.cli.TestMiniTezCliDriver.testCliDriver_vector_bround
          org.apache.hadoop.hive.cli.TestMiniTezCliDriver.testCliDriver_vector_bucket
          org.apache.hadoop.hive.cli.TestMiniTezCliDriver.testCliDriver_vector_cast_constant
          org.apache.hadoop.hive.cli.TestMiniTezCliDriver.testCliDriver_vector_char_2
          org.apache.hadoop.hive.cli.TestMiniTezCliDriver.testCliDriver_vector_char_4
          org.apache.hadoop.hive.cli.TestMiniTezCliDriver.testCliDriver_vector_char_cast
          org.apache.hadoop.hive.cli.TestMiniTezCliDriver.testCliDriver_vector_char_mapjoin1
          org.apache.hadoop.hive.cli.TestMiniTezCliDriver.testCliDriver_vector_char_simple
          org.apache.hadoop.hive.cli.TestMiniTezCliDriver.testCliDriver_vector_coalesce
          org.apache.hadoop.hive.cli.TestMiniTezCliDriver.testCliDriver_vector_coalesce_2
          org.apache.hadoop.hive.cli.TestMiniTezCliDriver.testCliDriver_vector_complex_all
          org.apache.hadoop.hive.cli.TestMiniTezCliDriver.testCliDriver_vector_complex_join
          org.apache.hadoop.hive.cli.TestMiniTezCliDriver.testCliDriver_vector_count_distinct
          org.apache.hadoop.hive.cli.TestMiniTezCliDriver.testCliDriver_vector_data_types
          org.apache.hadoop.hive.cli.TestMiniTezCliDriver.testCliDriver_vector_date_1
          org.apache.hadoop.hive.cli.TestMiniTezCliDriver.testCliDriver_vector_decimal_1
          org.apache.hadoop.hive.cli.TestMiniTezCliDriver.testCliDriver_vector_decimal_10_0
          org.apache.hadoop.hive.cli.TestMiniTezCliDriver.testCliDriver_vector_decimal_2
          org.apache.hadoop.hive.cli.TestMiniTezCliDriver.testCliDriver_vector_decimal_3
          org.apache.hadoop.hive.cli.TestMiniTezCliDriver.testCliDriver_vector_decimal_4
          org.apache.hadoop.hive.cli.TestMiniTezCliDriver.testCliDriver_vector_decimal_5
          org.apache.hadoop.hive.cli.TestMiniTezCliDriver.testCliDriver_vector_decimal_6
          org.apache.hadoop.hive.cli.TestMiniTezCliDriver.testCliDriver_vector_decimal_aggregate
          org.apache.hadoop.hive.cli.TestMiniTezCliDriver.testCliDriver_vector_decimal_cast
          org.apache.hadoop.hive.cli.TestMiniTezCliDriver.testCliDriver_vector_decimal_expressions
          org.apache.hadoop.hive.cli.TestMiniTezCliDriver.testCliDriver_vector_decimal_mapjoin
          org.apache.hadoop.hive.cli.TestMiniTezCliDriver.testCliDriver_vector_decimal_math_funcs
          org.apache.hadoop.hive.cli.TestMiniTezCliDriver.testCliDriver_vector_decimal_precision
          org.apache.hadoop.hive.cli.TestMiniTezCliDriver.testCliDriver_vector_decimal_round
          org.apache.hadoop.hive.cli.TestMiniTezCliDriver.testCliDriver_vector_decimal_round_2
          org.apache.hadoop.hive.cli.TestMiniTezCliDriver.testCliDriver_vector_decimal_trailing
          org.apache.hadoop.hive.cli.TestMiniTezCliDriver.testCliDriver_vector_decimal_udf
          org.apache.hadoop.hive.cli.TestMiniTezCliDriver.testCliDriver_vector_decimal_udf2
          org.apache.hadoop.hive.cli.TestMiniTezCliDriver.testCliDriver_vector_distinct_2
          org.apache.hadoop.hive.cli.TestMiniTezCliDriver.testCliDriver_vector_elt
          org.apache.hadoop.hive.cli.TestMiniTezCliDriver.testCliDriver_vector_groupby_3
          org.apache.hadoop.hive.cli.TestMiniTezCliDriver.testCliDriver_vector_groupby_mapjoin
          org.apache.hadoop.hive.cli.TestMiniTezCliDriver.testCliDriver_vector_groupby_reduce
          org.apache.hadoop.hive.cli.TestMiniTezCliDriver.testCliDriver_vector_grouping_sets
          org.apache.hadoop.hive.cli.TestMiniTezCliDriver.testCliDriver_vector_if_expr
          org.apache.hadoop.hive.cli.TestMiniTezCliDriver.testCliDriver_vector_inner_join
          org.apache.hadoop.hive.cli.TestMiniTezCliDriver.testCliDriver_vector_interval_1
          org.apache.hadoop.hive.cli.TestMiniTezCliDriver.testCliDriver_vector_interval_2
          org.apache.hadoop.hive.cli.TestMiniTezCliDriver.testCliDriver_vector_interval_arithmetic
          org.apache.hadoop.hive.cli.TestMiniTezCliDriver.testCliDriver_vector_interval_mapjoin
          org.apache.hadoop.hive.cli.TestMiniTezCliDriver.testCliDriver_vector_join30
          org.apache.hadoop.hive.cli.TestMiniTezCliDriver.testCliDriver_vector_join_filters
          org.apache.hadoop.hive.cli.TestMiniTezCliDriver.testCliDriver_vector_join_nulls
          org.apache.hadoop.hive.cli.TestMiniTezCliDriver.testCliDriver_vector_join_part_col_char
          org.apache.hadoop.hive.cli.TestMiniTezCliDriver.testCliDriver_vector_left_outer_join
          org.apache.hadoop.hive.cli.TestMiniTezCliDriver.testCliDriver_vector_left_outer_join2
          org.apache.hadoop.hive.cli.TestMiniTezCliDriver.testCliDriver_vector_leftsemi_mapjoin
          org.apache.hadoop.hive.cli.TestMiniTezCliDriver.testCliDriver_vector_mapjoin_reduce
          org.apache.hadoop.hive.cli.TestMiniTezCliDriver.testCliDriver_vector_mr_diff_schema_alias
          org.apache.hadoop.hive.cli.TestMiniTezCliDriver.testCliDriver_vector_multi_insert
          org.apache.hadoop.hive.cli.TestMiniTezCliDriver.testCliDriver_vector_non_string_partition
          org.apache.hadoop.hive.cli.TestMiniTezCliDriver.testCliDriver_vector_null_projection
          org.apache.hadoop.hive.cli.TestMiniTezCliDriver.testCliDriver_vector_nullsafe_join
          org.apache.hadoop.hive.cli.TestMiniTezCliDriver.testCliDriver_vector_nvl
          org.apache.hadoop.hive.cli.TestMiniTezCliDriver.testCliDriver_vector_orderby_5
          org.apache.hadoop.hive.cli.TestMiniTezCliDriver.testCliDriver_vector_outer_join0
          org.apache.hadoop.hive.cli.TestMiniTezCliDriver.testCliDriver_vector_outer_join1
          org.apache.hadoop.hive.cli.TestMiniTezCliDriver.testCliDriver_vector_outer_join2
          org.apache.hadoop.hive.cli.TestMiniTezCliDriver.testCliDriver_vector_outer_join3
          org.apache.hadoop.hive.cli.TestMiniTezCliDriver.testCliDriver_vector_outer_join4
          org.apache.hadoop.hive.cli.TestMiniTezCliDriver.testCliDriver_vector_outer_join5
          org.apache.hadoop.hive.cli.TestMiniTezCliDriver.testCliDriver_vector_outer_join6
          org.apache.hadoop.hive.cli.TestMiniTezCliDriver.testCliDriver_vector_partition_diff_num_cols
          org.apache.hadoop.hive.cli.TestMiniTezCliDriver.testCliDriver_vector_partitioned_date_time
          org.apache.hadoop.hive.cli.TestMiniTezCliDriver.testCliDriver_vector_reduce1
          org.apache.hadoop.hive.cli.TestMiniTezCliDriver.testCliDriver_vector_reduce2
          org.apache.hadoop.hive.cli.TestMiniTezCliDriver.testCliDriver_vector_reduce3
          org.apache.hadoop.hive.cli.TestMiniTezCliDriver.testCliDriver_vector_reduce_groupby_decimal
          org.apache.hadoop.hive.cli.TestMiniTezCliDriver.testCliDriver_vector_string_concat
          org.apache.hadoop.hive.cli.TestMiniTezCliDriver.testCliDriver_vector_struct_in
          org.apache.hadoop.hive.cli.TestMiniTezCliDriver.testCliDriver_vector_varchar_4
          org.apache.hadoop.hive.cli.TestMiniTezCliDriver.testCliDriver_vector_varchar_mapjoin1
          org.apache.hadoop.hive.cli.TestMiniTezCliDriver.testCliDriver_vector_varchar_simple
          org.apache.hadoop.hive.cli.TestMiniTezCliDriver.testCliDriver_vector_when_case_null
          org.apache.hadoop.hive.cli.TestMiniTezCliDriver.testCliDriver_vectorization_0
          org.apache.hadoop.hive.cli.TestMiniTezCliDriver.testCliDriver_vectorization_1
          org.apache.hadoop.hive.cli.TestMiniTezCliDriver.testCliDriver_vectorization_10
          org.apache.hadoop.hive.cli.TestMiniTezCliDriver.testCliDriver_vectorization_11
          org.apache.hadoop.hive.cli.TestMiniTezCliDriver.testCliDriver_vectorization_12
          org.apache.hadoop.hive.cli.TestMiniTezCliDriver.testCliDriver_vectorization_13
          org.apache.hadoop.hive.cli.TestMiniTezCliDriver.testCliDriver_vectorization_14
          org.apache.hadoop.hive.cli.TestMiniTezCliDriver.testCliDriver_vectorization_15
          org.apache.hadoop.hive.cli.TestMiniTezCliDriver.testCliDriver_vectorization_16
          org.apache.hadoop.hive.cli.TestMiniTezCliDriver.testCliDriver_vectorization_17
          org.apache.hadoop.hive.cli.TestMiniTezCliDriver.testCliDriver_vectorization_2
          org.apache.hadoop.hive.cli.TestMiniTezCliDriver.testCliDriver_vectorization_3
          org.apache.hadoop.hive.cli.TestMiniTezCliDriver.testCliDriver_vectorization_4
          org.apache.hadoop.hive.cli.TestMiniTezCliDriver.testCliDriver_vectorization_5
          org.apache.hadoop.hive.cli.TestMiniTezCliDriver.testCliDriver_vectorization_6
          org.apache.hadoop.hive.cli.TestMiniTezCliDriver.testCliDriver_vectorization_7
          org.apache.hadoop.hive.cli.TestMiniTezCliDriver.testCliDriver_vectorization_8
          org.apache.hadoop.hive.cli.TestMiniTezCliDriver.testCliDriver_vectorization_9
          org.apache.hadoop.hive.cli.TestMiniTezCliDriver.testCliDriver_vectorization_decimal_date
          org.apache.hadoop.hive.cli.TestMiniTezCliDriver.testCliDriver_vectorization_div0
          org.apache.hadoop.hive.cli.TestMiniTezCliDriver.testCliDriver_vectorization_limit
          org.apache.hadoop.hive.cli.TestMiniTezCliDriver.testCliDriver_vectorization_nested_udf
          org.apache.hadoop.hive.cli.TestMiniTezCliDriver.testCliDriver_vectorization_not
          org.apache.hadoop.hive.cli.TestMiniTezCliDriver.testCliDriver_vectorization_part
          org.apache.hadoop.hive.cli.TestMiniTezCliDriver.testCliDriver_vectorization_part_project
          org.apache.hadoop.hive.cli.TestMiniTezCliDriver.testCliDriver_vectorization_part_varchar
          org.apache.hadoop.hive.cli.TestMiniTezCliDriver.testCliDriver_vectorization_pushdown
          org.apache.hadoop.hive.cli.TestMiniTezCliDriver.testCliDriver_vectorization_short_regress
          org.apache.hadoop.hive.cli.TestMiniTezCliDriver.testCliDriver_vectorized_bucketmapjoin1
          org.apache.hadoop.hive.cli.TestMiniTezCliDriver.testCliDriver_vectorized_case
          org.apache.hadoop.hive.cli.TestMiniTezCliDriver.testCliDriver_vectorized_casts
          org.apache.hadoop.hive.cli.TestMiniTezCliDriver.testCliDriver_vectorized_context
          org.apache.hadoop.hive.cli.TestMiniTezCliDriver.testCliDriver_vectorized_date_funcs
          org.apache.hadoop.hive.cli.TestMiniTezCliDriver.testCliDriver_vectorized_distinct_gby
          org.apache.hadoop.hive.cli.TestMiniTezCliDriver.testCliDriver_vectorized_dynamic_partition_pruning
          org.apache.hadoop.hive.cli.TestMiniTezCliDriver.testCliDriver_vectorized_mapjoin
          org.apache.hadoop.hive.cli.TestMiniTezCliDriver.testCliDriver_vectorized_math_funcs
          org.apache.hadoop.hive.cli.TestMiniTezCliDriver.testCliDriver_vectorized_nested_mapjoin
          org.apache.hadoop.hive.cli.TestMiniTezCliDriver.testCliDriver_vectorized_parquet
          org.apache.hadoop.hive.cli.TestMiniTezCliDriver.testCliDriver_vectorized_parquet_types
          org.apache.hadoop.hive.cli.TestMiniTezCliDriver.testCliDriver_vectorized_ptf
          org.apache.hadoop.hive.cli.TestMiniTezCliDriver.testCliDriver_vectorized_rcfile_columnar
          org.apache.hadoop.hive.cli.TestMiniTezCliDriver.testCliDriver_vectorized_shufflejoin
          org.apache.hadoop.hive.cli.TestMiniTezCliDriver.testCliDriver_vectorized_string_funcs
          org.apache.hadoop.hive.cli.TestMiniTezCliDriver.testCliDriver_vectorized_timestamp
          org.apache.hadoop.hive.cli.TestMiniTezCliDriver.testCliDriver_vectorized_timestamp_funcs
          org.apache.hadoop.hive.cli.TestMiniTezCliDriver.testCliDriver_vectorized_timestamp_ints_casts
          org.apache.hadoop.hive.cli.TestMiniTezCliDriver.testCliDriver_windowing_gby
          org.apache.hadoop.hive.cli.TestNegativeMinimrCliDriver.testNegativeCliDriver_minimr_broken_pipe
          org.apache.hadoop.hive.llap.tezplugins.TestLlapTaskCommunicator.testFinishableStateUpdateFailure
          org.apache.hadoop.hive.llap.tezplugins.TestLlapTaskSchedulerService.testForcedLocalityPreemption
          org.apache.hadoop.hive.metastore.TestMetaStoreMetrics.org.apache.hadoop.hive.metastore.TestMetaStoreMetrics
          org.apache.hadoop.hive.metastore.TestRemoteHiveMetaStore.testSimpleTable
          org.apache.hadoop.hive.ql.security.TestClientSideAuthorizationProvider.testSimplePrivileges
          org.apache.hadoop.hive.ql.security.TestFolderPermissions.org.apache.hadoop.hive.ql.security.TestFolderPermissions
          org.apache.hadoop.hive.ql.security.TestMetastoreAuthorizationProvider.testSimplePrivileges
          org.apache.hadoop.hive.ql.security.TestMultiAuthorizationPreEventListener.org.apache.hadoop.hive.ql.security.TestMultiAuthorizationPreEventListener
          org.apache.hadoop.hive.ql.security.TestStorageBasedMetastoreAuthorizationDrops.testDropPartition
          org.apache.hadoop.hive.ql.security.TestStorageBasedMetastoreAuthorizationProvider.testSimplePrivileges
          org.apache.hadoop.hive.ql.security.TestStorageBasedMetastoreAuthorizationProviderWithACL.testSimplePrivileges
          org.apache.hadoop.hive.thrift.TestHadoopAuthBridge23.testDelegationTokenSharedStore
          org.apache.hadoop.hive.thrift.TestHadoopAuthBridge23.testMetastoreProxyUser
          org.apache.hadoop.hive.thrift.TestHadoopAuthBridge23.testSaslWithHiveMetaStore
          org.apache.hive.service.cli.operation.TestOperationLoggingAPIWithMr.testFetchResultsOfLogAsync
          

          Test results: http://ec2-174-129-184-35.compute-1.amazonaws.com/jenkins/job/PreCommit-HIVE-TRUNK-Build/7507/testReport
          Console output: http://ec2-174-129-184-35.compute-1.amazonaws.com/jenkins/job/PreCommit-HIVE-TRUNK-Build/7507/console
          Test logs: http://ec2-174-129-184-35.compute-1.amazonaws.com/logs/PreCommit-HIVE-TRUNK-Build-7507/

          Messages:

          Executing org.apache.hive.ptest.execution.TestCheckPhase
          Executing org.apache.hive.ptest.execution.PrepPhase
          Executing org.apache.hive.ptest.execution.ExecutionPhase
          Executing org.apache.hive.ptest.execution.ReportingPhase
          Tests exited with: TestsFailedException: 389 tests failed
          

          This message is automatically generated.

          ATTACHMENT ID: 12797330 - PreCommit-HIVE-TRUNK-Build

          Show
          hiveqa Hive QA added a comment - Here are the results of testing the latest attachment: https://issues.apache.org/jira/secure/attachment/12797330/HIVE-13424.3.patch SUCCESS: +1 due to 14 test(s) being added or modified. ERROR: -1 due to 389 failed/errored test(s), 9967 tests executed Failed tests: org.apache.hadoop.hive.cli.TestMiniSparkOnYarnCliDriver.testCliDriver_index_bitmap3 org.apache.hadoop.hive.cli.TestMiniTezCliDriver.org.apache.hadoop.hive.cli.TestMiniTezCliDriver org.apache.hadoop.hive.cli.TestMiniTezCliDriver.testCliDriver_acid_globallimit org.apache.hadoop.hive.cli.TestMiniTezCliDriver.testCliDriver_alter_merge_2_orc org.apache.hadoop.hive.cli.TestMiniTezCliDriver.testCliDriver_alter_merge_orc org.apache.hadoop.hive.cli.TestMiniTezCliDriver.testCliDriver_alter_merge_stats_orc org.apache.hadoop.hive.cli.TestMiniTezCliDriver.testCliDriver_auto_join0 org.apache.hadoop.hive.cli.TestMiniTezCliDriver.testCliDriver_auto_join1 org.apache.hadoop.hive.cli.TestMiniTezCliDriver.testCliDriver_auto_join21 org.apache.hadoop.hive.cli.TestMiniTezCliDriver.testCliDriver_auto_join29 org.apache.hadoop.hive.cli.TestMiniTezCliDriver.testCliDriver_auto_join30 org.apache.hadoop.hive.cli.TestMiniTezCliDriver.testCliDriver_auto_join_filters org.apache.hadoop.hive.cli.TestMiniTezCliDriver.testCliDriver_auto_join_nulls org.apache.hadoop.hive.cli.TestMiniTezCliDriver.testCliDriver_auto_sortmerge_join_1 org.apache.hadoop.hive.cli.TestMiniTezCliDriver.testCliDriver_auto_sortmerge_join_10 org.apache.hadoop.hive.cli.TestMiniTezCliDriver.testCliDriver_auto_sortmerge_join_11 org.apache.hadoop.hive.cli.TestMiniTezCliDriver.testCliDriver_auto_sortmerge_join_12 org.apache.hadoop.hive.cli.TestMiniTezCliDriver.testCliDriver_auto_sortmerge_join_13 org.apache.hadoop.hive.cli.TestMiniTezCliDriver.testCliDriver_auto_sortmerge_join_14 org.apache.hadoop.hive.cli.TestMiniTezCliDriver.testCliDriver_auto_sortmerge_join_15 org.apache.hadoop.hive.cli.TestMiniTezCliDriver.testCliDriver_auto_sortmerge_join_16 org.apache.hadoop.hive.cli.TestMiniTezCliDriver.testCliDriver_auto_sortmerge_join_2 org.apache.hadoop.hive.cli.TestMiniTezCliDriver.testCliDriver_auto_sortmerge_join_3 org.apache.hadoop.hive.cli.TestMiniTezCliDriver.testCliDriver_auto_sortmerge_join_4 org.apache.hadoop.hive.cli.TestMiniTezCliDriver.testCliDriver_auto_sortmerge_join_5 org.apache.hadoop.hive.cli.TestMiniTezCliDriver.testCliDriver_auto_sortmerge_join_6 org.apache.hadoop.hive.cli.TestMiniTezCliDriver.testCliDriver_auto_sortmerge_join_7 org.apache.hadoop.hive.cli.TestMiniTezCliDriver.testCliDriver_auto_sortmerge_join_8 org.apache.hadoop.hive.cli.TestMiniTezCliDriver.testCliDriver_auto_sortmerge_join_9 org.apache.hadoop.hive.cli.TestMiniTezCliDriver.testCliDriver_bucket2 org.apache.hadoop.hive.cli.TestMiniTezCliDriver.testCliDriver_bucket3 org.apache.hadoop.hive.cli.TestMiniTezCliDriver.testCliDriver_bucket4 org.apache.hadoop.hive.cli.TestMiniTezCliDriver.testCliDriver_bucket_map_join_tez1 org.apache.hadoop.hive.cli.TestMiniTezCliDriver.testCliDriver_bucket_map_join_tez2 org.apache.hadoop.hive.cli.TestMiniTezCliDriver.testCliDriver_bucketpruning1 org.apache.hadoop.hive.cli.TestMiniTezCliDriver.testCliDriver_cbo_gby org.apache.hadoop.hive.cli.TestMiniTezCliDriver.testCliDriver_cbo_gby_empty org.apache.hadoop.hive.cli.TestMiniTezCliDriver.testCliDriver_cbo_join org.apache.hadoop.hive.cli.TestMiniTezCliDriver.testCliDriver_cbo_limit org.apache.hadoop.hive.cli.TestMiniTezCliDriver.testCliDriver_cbo_semijoin org.apache.hadoop.hive.cli.TestMiniTezCliDriver.testCliDriver_cbo_simple_select org.apache.hadoop.hive.cli.TestMiniTezCliDriver.testCliDriver_cbo_stats org.apache.hadoop.hive.cli.TestMiniTezCliDriver.testCliDriver_cbo_subq_exists org.apache.hadoop.hive.cli.TestMiniTezCliDriver.testCliDriver_cbo_subq_in org.apache.hadoop.hive.cli.TestMiniTezCliDriver.testCliDriver_cbo_subq_not_in org.apache.hadoop.hive.cli.TestMiniTezCliDriver.testCliDriver_cbo_udf_udaf org.apache.hadoop.hive.cli.TestMiniTezCliDriver.testCliDriver_cbo_union org.apache.hadoop.hive.cli.TestMiniTezCliDriver.testCliDriver_cbo_views org.apache.hadoop.hive.cli.TestMiniTezCliDriver.testCliDriver_cbo_windowing org.apache.hadoop.hive.cli.TestMiniTezCliDriver.testCliDriver_column_names_with_leading_and_trailing_spaces org.apache.hadoop.hive.cli.TestMiniTezCliDriver.testCliDriver_constprog_dpp org.apache.hadoop.hive.cli.TestMiniTezCliDriver.testCliDriver_constprog_semijoin org.apache.hadoop.hive.cli.TestMiniTezCliDriver.testCliDriver_correlationoptimizer1 org.apache.hadoop.hive.cli.TestMiniTezCliDriver.testCliDriver_count org.apache.hadoop.hive.cli.TestMiniTezCliDriver.testCliDriver_create_merge_compressed org.apache.hadoop.hive.cli.TestMiniTezCliDriver.testCliDriver_cross_join org.apache.hadoop.hive.cli.TestMiniTezCliDriver.testCliDriver_cross_product_check_1 org.apache.hadoop.hive.cli.TestMiniTezCliDriver.testCliDriver_cross_product_check_2 org.apache.hadoop.hive.cli.TestMiniTezCliDriver.testCliDriver_ctas org.apache.hadoop.hive.cli.TestMiniTezCliDriver.testCliDriver_cte_1 org.apache.hadoop.hive.cli.TestMiniTezCliDriver.testCliDriver_cte_2 org.apache.hadoop.hive.cli.TestMiniTezCliDriver.testCliDriver_cte_3 org.apache.hadoop.hive.cli.TestMiniTezCliDriver.testCliDriver_cte_4 org.apache.hadoop.hive.cli.TestMiniTezCliDriver.testCliDriver_cte_5 org.apache.hadoop.hive.cli.TestMiniTezCliDriver.testCliDriver_cte_mat_1 org.apache.hadoop.hive.cli.TestMiniTezCliDriver.testCliDriver_cte_mat_2 org.apache.hadoop.hive.cli.TestMiniTezCliDriver.testCliDriver_cte_mat_3 org.apache.hadoop.hive.cli.TestMiniTezCliDriver.testCliDriver_cte_mat_4 org.apache.hadoop.hive.cli.TestMiniTezCliDriver.testCliDriver_cte_mat_5 org.apache.hadoop.hive.cli.TestMiniTezCliDriver.testCliDriver_custom_input_output_format org.apache.hadoop.hive.cli.TestMiniTezCliDriver.testCliDriver_delete_all_non_partitioned org.apache.hadoop.hive.cli.TestMiniTezCliDriver.testCliDriver_delete_all_partitioned org.apache.hadoop.hive.cli.TestMiniTezCliDriver.testCliDriver_delete_orig_table org.apache.hadoop.hive.cli.TestMiniTezCliDriver.testCliDriver_delete_tmp_table org.apache.hadoop.hive.cli.TestMiniTezCliDriver.testCliDriver_delete_where_no_match org.apache.hadoop.hive.cli.TestMiniTezCliDriver.testCliDriver_delete_where_non_partitioned org.apache.hadoop.hive.cli.TestMiniTezCliDriver.testCliDriver_delete_where_partitioned org.apache.hadoop.hive.cli.TestMiniTezCliDriver.testCliDriver_delete_whole_partition org.apache.hadoop.hive.cli.TestMiniTezCliDriver.testCliDriver_disable_merge_for_bucketing org.apache.hadoop.hive.cli.TestMiniTezCliDriver.testCliDriver_dynamic_partition_pruning org.apache.hadoop.hive.cli.TestMiniTezCliDriver.testCliDriver_dynamic_partition_pruning_2 org.apache.hadoop.hive.cli.TestMiniTezCliDriver.testCliDriver_dynpart_sort_opt_vectorization org.apache.hadoop.hive.cli.TestMiniTezCliDriver.testCliDriver_dynpart_sort_optimization org.apache.hadoop.hive.cli.TestMiniTezCliDriver.testCliDriver_dynpart_sort_optimization2 org.apache.hadoop.hive.cli.TestMiniTezCliDriver.testCliDriver_empty_join org.apache.hadoop.hive.cli.TestMiniTezCliDriver.testCliDriver_enforce_order org.apache.hadoop.hive.cli.TestMiniTezCliDriver.testCliDriver_explainuser_1 org.apache.hadoop.hive.cli.TestMiniTezCliDriver.testCliDriver_explainuser_2 org.apache.hadoop.hive.cli.TestMiniTezCliDriver.testCliDriver_explainuser_3 org.apache.hadoop.hive.cli.TestMiniTezCliDriver.testCliDriver_explainuser_4 org.apache.hadoop.hive.cli.TestMiniTezCliDriver.testCliDriver_filter_join_breaktask org.apache.hadoop.hive.cli.TestMiniTezCliDriver.testCliDriver_filter_join_breaktask2 org.apache.hadoop.hive.cli.TestMiniTezCliDriver.testCliDriver_groupby1 org.apache.hadoop.hive.cli.TestMiniTezCliDriver.testCliDriver_groupby2 org.apache.hadoop.hive.cli.TestMiniTezCliDriver.testCliDriver_groupby3 org.apache.hadoop.hive.cli.TestMiniTezCliDriver.testCliDriver_having org.apache.hadoop.hive.cli.TestMiniTezCliDriver.testCliDriver_hybridgrace_hashjoin_1 org.apache.hadoop.hive.cli.TestMiniTezCliDriver.testCliDriver_hybridgrace_hashjoin_2 org.apache.hadoop.hive.cli.TestMiniTezCliDriver.testCliDriver_insert_into1 org.apache.hadoop.hive.cli.TestMiniTezCliDriver.testCliDriver_insert_into2 org.apache.hadoop.hive.cli.TestMiniTezCliDriver.testCliDriver_insert_orig_table org.apache.hadoop.hive.cli.TestMiniTezCliDriver.testCliDriver_insert_update_delete org.apache.hadoop.hive.cli.TestMiniTezCliDriver.testCliDriver_insert_values_dynamic_partitioned org.apache.hadoop.hive.cli.TestMiniTezCliDriver.testCliDriver_insert_values_non_partitioned org.apache.hadoop.hive.cli.TestMiniTezCliDriver.testCliDriver_insert_values_tmp_table org.apache.hadoop.hive.cli.TestMiniTezCliDriver.testCliDriver_join0 org.apache.hadoop.hive.cli.TestMiniTezCliDriver.testCliDriver_join1 org.apache.hadoop.hive.cli.TestMiniTezCliDriver.testCliDriver_join_nullsafe org.apache.hadoop.hive.cli.TestMiniTezCliDriver.testCliDriver_leftsemijoin org.apache.hadoop.hive.cli.TestMiniTezCliDriver.testCliDriver_limit_pushdown org.apache.hadoop.hive.cli.TestMiniTezCliDriver.testCliDriver_llap_nullscan org.apache.hadoop.hive.cli.TestMiniTezCliDriver.testCliDriver_llapdecider org.apache.hadoop.hive.cli.TestMiniTezCliDriver.testCliDriver_load_dyn_part1 org.apache.hadoop.hive.cli.TestMiniTezCliDriver.testCliDriver_load_dyn_part2 org.apache.hadoop.hive.cli.TestMiniTezCliDriver.testCliDriver_load_dyn_part3 org.apache.hadoop.hive.cli.TestMiniTezCliDriver.testCliDriver_lvj_mapjoin org.apache.hadoop.hive.cli.TestMiniTezCliDriver.testCliDriver_mapjoin_decimal org.apache.hadoop.hive.cli.TestMiniTezCliDriver.testCliDriver_mapjoin_mapjoin org.apache.hadoop.hive.cli.TestMiniTezCliDriver.testCliDriver_mapreduce1 org.apache.hadoop.hive.cli.TestMiniTezCliDriver.testCliDriver_mapreduce2 org.apache.hadoop.hive.cli.TestMiniTezCliDriver.testCliDriver_merge1 org.apache.hadoop.hive.cli.TestMiniTezCliDriver.testCliDriver_merge2 org.apache.hadoop.hive.cli.TestMiniTezCliDriver.testCliDriver_mergejoin org.apache.hadoop.hive.cli.TestMiniTezCliDriver.testCliDriver_mergejoin_3way org.apache.hadoop.hive.cli.TestMiniTezCliDriver.testCliDriver_metadata_only_queries org.apache.hadoop.hive.cli.TestMiniTezCliDriver.testCliDriver_metadata_only_queries_with_filters org.apache.hadoop.hive.cli.TestMiniTezCliDriver.testCliDriver_metadataonly1 org.apache.hadoop.hive.cli.TestMiniTezCliDriver.testCliDriver_mrr org.apache.hadoop.hive.cli.TestMiniTezCliDriver.testCliDriver_nonmr_fetch_threshold org.apache.hadoop.hive.cli.TestMiniTezCliDriver.testCliDriver_optimize_nullscan org.apache.hadoop.hive.cli.TestMiniTezCliDriver.testCliDriver_orc_analyze org.apache.hadoop.hive.cli.TestMiniTezCliDriver.testCliDriver_orc_merge1 org.apache.hadoop.hive.cli.TestMiniTezCliDriver.testCliDriver_orc_merge10 org.apache.hadoop.hive.cli.TestMiniTezCliDriver.testCliDriver_orc_merge11 org.apache.hadoop.hive.cli.TestMiniTezCliDriver.testCliDriver_orc_merge12 org.apache.hadoop.hive.cli.TestMiniTezCliDriver.testCliDriver_orc_merge2 org.apache.hadoop.hive.cli.TestMiniTezCliDriver.testCliDriver_orc_merge3 org.apache.hadoop.hive.cli.TestMiniTezCliDriver.testCliDriver_orc_merge4 org.apache.hadoop.hive.cli.TestMiniTezCliDriver.testCliDriver_orc_merge5 org.apache.hadoop.hive.cli.TestMiniTezCliDriver.testCliDriver_orc_merge6 org.apache.hadoop.hive.cli.TestMiniTezCliDriver.testCliDriver_orc_merge7 org.apache.hadoop.hive.cli.TestMiniTezCliDriver.testCliDriver_orc_merge8 org.apache.hadoop.hive.cli.TestMiniTezCliDriver.testCliDriver_orc_merge9 org.apache.hadoop.hive.cli.TestMiniTezCliDriver.testCliDriver_orc_merge_diff_fs org.apache.hadoop.hive.cli.TestMiniTezCliDriver.testCliDriver_orc_merge_incompat1 org.apache.hadoop.hive.cli.TestMiniTezCliDriver.testCliDriver_orc_merge_incompat2 org.apache.hadoop.hive.cli.TestMiniTezCliDriver.testCliDriver_orc_merge_incompat3 org.apache.hadoop.hive.cli.TestMiniTezCliDriver.testCliDriver_orc_ppd_basic org.apache.hadoop.hive.cli.TestMiniTezCliDriver.testCliDriver_orc_vectorization_ppd org.apache.hadoop.hive.cli.TestMiniTezCliDriver.testCliDriver_order_null org.apache.hadoop.hive.cli.TestMiniTezCliDriver.testCliDriver_parallel org.apache.hadoop.hive.cli.TestMiniTezCliDriver.testCliDriver_ptf org.apache.hadoop.hive.cli.TestMiniTezCliDriver.testCliDriver_ptf_matchpath org.apache.hadoop.hive.cli.TestMiniTezCliDriver.testCliDriver_ptf_streaming org.apache.hadoop.hive.cli.TestMiniTezCliDriver.testCliDriver_sample1 org.apache.hadoop.hive.cli.TestMiniTezCliDriver.testCliDriver_schema_evol_orc_acid_mapwork_part org.apache.hadoop.hive.cli.TestMiniTezCliDriver.testCliDriver_schema_evol_orc_acid_mapwork_table org.apache.hadoop.hive.cli.TestMiniTezCliDriver.testCliDriver_schema_evol_orc_acidvec_mapwork_part org.apache.hadoop.hive.cli.TestMiniTezCliDriver.testCliDriver_schema_evol_orc_acidvec_mapwork_table org.apache.hadoop.hive.cli.TestMiniTezCliDriver.testCliDriver_schema_evol_orc_nonvec_fetchwork_part org.apache.hadoop.hive.cli.TestMiniTezCliDriver.testCliDriver_schema_evol_orc_nonvec_fetchwork_table org.apache.hadoop.hive.cli.TestMiniTezCliDriver.testCliDriver_schema_evol_orc_nonvec_mapwork_part org.apache.hadoop.hive.cli.TestMiniTezCliDriver.testCliDriver_schema_evol_orc_nonvec_mapwork_table org.apache.hadoop.hive.cli.TestMiniTezCliDriver.testCliDriver_schema_evol_orc_vec_mapwork_part org.apache.hadoop.hive.cli.TestMiniTezCliDriver.testCliDriver_schema_evol_orc_vec_mapwork_table org.apache.hadoop.hive.cli.TestMiniTezCliDriver.testCliDriver_schema_evol_stats org.apache.hadoop.hive.cli.TestMiniTezCliDriver.testCliDriver_schema_evol_text_fetchwork_table org.apache.hadoop.hive.cli.TestMiniTezCliDriver.testCliDriver_schema_evol_text_mapwork_table org.apache.hadoop.hive.cli.TestMiniTezCliDriver.testCliDriver_schema_evol_text_nonvec_fetchwork_part org.apache.hadoop.hive.cli.TestMiniTezCliDriver.testCliDriver_schema_evol_text_nonvec_fetchwork_table org.apache.hadoop.hive.cli.TestMiniTezCliDriver.testCliDriver_schema_evol_text_nonvec_mapwork_part org.apache.hadoop.hive.cli.TestMiniTezCliDriver.testCliDriver_schema_evol_text_nonvec_mapwork_table org.apache.hadoop.hive.cli.TestMiniTezCliDriver.testCliDriver_script_env_var1 org.apache.hadoop.hive.cli.TestMiniTezCliDriver.testCliDriver_script_env_var2 org.apache.hadoop.hive.cli.TestMiniTezCliDriver.testCliDriver_script_pipe org.apache.hadoop.hive.cli.TestMiniTezCliDriver.testCliDriver_scriptfile1 org.apache.hadoop.hive.cli.TestMiniTezCliDriver.testCliDriver_selectDistinctStar org.apache.hadoop.hive.cli.TestMiniTezCliDriver.testCliDriver_select_dummy_source org.apache.hadoop.hive.cli.TestMiniTezCliDriver.testCliDriver_skewjoin org.apache.hadoop.hive.cli.TestMiniTezCliDriver.testCliDriver_smb_cache org.apache.hadoop.hive.cli.TestMiniTezCliDriver.testCliDriver_stats_filemetadata org.apache.hadoop.hive.cli.TestMiniTezCliDriver.testCliDriver_stats_noscan_1 org.apache.hadoop.hive.cli.TestMiniTezCliDriver.testCliDriver_stats_only_null org.apache.hadoop.hive.cli.TestMiniTezCliDriver.testCliDriver_subquery_exists org.apache.hadoop.hive.cli.TestMiniTezCliDriver.testCliDriver_subquery_in org.apache.hadoop.hive.cli.TestMiniTezCliDriver.testCliDriver_temp_table org.apache.hadoop.hive.cli.TestMiniTezCliDriver.testCliDriver_tez_bmj_schema_evolution org.apache.hadoop.hive.cli.TestMiniTezCliDriver.testCliDriver_tez_dml org.apache.hadoop.hive.cli.TestMiniTezCliDriver.testCliDriver_tez_dynpart_hashjoin_1 org.apache.hadoop.hive.cli.TestMiniTezCliDriver.testCliDriver_tez_dynpart_hashjoin_2 org.apache.hadoop.hive.cli.TestMiniTezCliDriver.testCliDriver_tez_dynpart_hashjoin_3 org.apache.hadoop.hive.cli.TestMiniTezCliDriver.testCliDriver_tez_fsstat org.apache.hadoop.hive.cli.TestMiniTezCliDriver.testCliDriver_tez_insert_overwrite_local_directory_1 org.apache.hadoop.hive.cli.TestMiniTezCliDriver.testCliDriver_tez_join org.apache.hadoop.hive.cli.TestMiniTezCliDriver.testCliDriver_tez_join_hash org.apache.hadoop.hive.cli.TestMiniTezCliDriver.testCliDriver_tez_join_result_complex org.apache.hadoop.hive.cli.TestMiniTezCliDriver.testCliDriver_tez_join_tests org.apache.hadoop.hive.cli.TestMiniTezCliDriver.testCliDriver_tez_joins_explain org.apache.hadoop.hive.cli.TestMiniTezCliDriver.testCliDriver_tez_multi_union org.apache.hadoop.hive.cli.TestMiniTezCliDriver.testCliDriver_tez_schema_evolution org.apache.hadoop.hive.cli.TestMiniTezCliDriver.testCliDriver_tez_self_join org.apache.hadoop.hive.cli.TestMiniTezCliDriver.testCliDriver_tez_smb_1 org.apache.hadoop.hive.cli.TestMiniTezCliDriver.testCliDriver_tez_smb_empty org.apache.hadoop.hive.cli.TestMiniTezCliDriver.testCliDriver_tez_smb_main org.apache.hadoop.hive.cli.TestMiniTezCliDriver.testCliDriver_tez_union org.apache.hadoop.hive.cli.TestMiniTezCliDriver.testCliDriver_tez_union2 org.apache.hadoop.hive.cli.TestMiniTezCliDriver.testCliDriver_tez_union_decimal org.apache.hadoop.hive.cli.TestMiniTezCliDriver.testCliDriver_tez_union_dynamic_partition org.apache.hadoop.hive.cli.TestMiniTezCliDriver.testCliDriver_tez_union_group_by org.apache.hadoop.hive.cli.TestMiniTezCliDriver.testCliDriver_tez_union_multiinsert org.apache.hadoop.hive.cli.TestMiniTezCliDriver.testCliDriver_tez_union_with_udf org.apache.hadoop.hive.cli.TestMiniTezCliDriver.testCliDriver_tez_vector_dynpart_hashjoin_1 org.apache.hadoop.hive.cli.TestMiniTezCliDriver.testCliDriver_tez_vector_dynpart_hashjoin_2 org.apache.hadoop.hive.cli.TestMiniTezCliDriver.testCliDriver_transform1 org.apache.hadoop.hive.cli.TestMiniTezCliDriver.testCliDriver_transform2 org.apache.hadoop.hive.cli.TestMiniTezCliDriver.testCliDriver_transform_ppr1 org.apache.hadoop.hive.cli.TestMiniTezCliDriver.testCliDriver_transform_ppr2 org.apache.hadoop.hive.cli.TestMiniTezCliDriver.testCliDriver_union2 org.apache.hadoop.hive.cli.TestMiniTezCliDriver.testCliDriver_union3 org.apache.hadoop.hive.cli.TestMiniTezCliDriver.testCliDriver_union4 org.apache.hadoop.hive.cli.TestMiniTezCliDriver.testCliDriver_union5 org.apache.hadoop.hive.cli.TestMiniTezCliDriver.testCliDriver_union6 org.apache.hadoop.hive.cli.TestMiniTezCliDriver.testCliDriver_union7 org.apache.hadoop.hive.cli.TestMiniTezCliDriver.testCliDriver_union8 org.apache.hadoop.hive.cli.TestMiniTezCliDriver.testCliDriver_union9 org.apache.hadoop.hive.cli.TestMiniTezCliDriver.testCliDriver_unionDistinct_1 org.apache.hadoop.hive.cli.TestMiniTezCliDriver.testCliDriver_unionDistinct_2 org.apache.hadoop.hive.cli.TestMiniTezCliDriver.testCliDriver_union_fast_stats org.apache.hadoop.hive.cli.TestMiniTezCliDriver.testCliDriver_union_type_chk org.apache.hadoop.hive.cli.TestMiniTezCliDriver.testCliDriver_update_after_multiple_inserts org.apache.hadoop.hive.cli.TestMiniTezCliDriver.testCliDriver_update_all_non_partitioned org.apache.hadoop.hive.cli.TestMiniTezCliDriver.testCliDriver_update_all_partitioned org.apache.hadoop.hive.cli.TestMiniTezCliDriver.testCliDriver_update_all_types org.apache.hadoop.hive.cli.TestMiniTezCliDriver.testCliDriver_update_orig_table org.apache.hadoop.hive.cli.TestMiniTezCliDriver.testCliDriver_update_tmp_table org.apache.hadoop.hive.cli.TestMiniTezCliDriver.testCliDriver_update_two_cols org.apache.hadoop.hive.cli.TestMiniTezCliDriver.testCliDriver_update_where_no_match org.apache.hadoop.hive.cli.TestMiniTezCliDriver.testCliDriver_update_where_non_partitioned org.apache.hadoop.hive.cli.TestMiniTezCliDriver.testCliDriver_update_where_partitioned org.apache.hadoop.hive.cli.TestMiniTezCliDriver.testCliDriver_vector_acid3 org.apache.hadoop.hive.cli.TestMiniTezCliDriver.testCliDriver_vector_aggregate_9 org.apache.hadoop.hive.cli.TestMiniTezCliDriver.testCliDriver_vector_aggregate_without_gby org.apache.hadoop.hive.cli.TestMiniTezCliDriver.testCliDriver_vector_auto_smb_mapjoin_14 org.apache.hadoop.hive.cli.TestMiniTezCliDriver.testCliDriver_vector_between_columns org.apache.hadoop.hive.cli.TestMiniTezCliDriver.testCliDriver_vector_between_in org.apache.hadoop.hive.cli.TestMiniTezCliDriver.testCliDriver_vector_binary_join_groupby org.apache.hadoop.hive.cli.TestMiniTezCliDriver.testCliDriver_vector_bround org.apache.hadoop.hive.cli.TestMiniTezCliDriver.testCliDriver_vector_bucket org.apache.hadoop.hive.cli.TestMiniTezCliDriver.testCliDriver_vector_cast_constant org.apache.hadoop.hive.cli.TestMiniTezCliDriver.testCliDriver_vector_char_2 org.apache.hadoop.hive.cli.TestMiniTezCliDriver.testCliDriver_vector_char_4 org.apache.hadoop.hive.cli.TestMiniTezCliDriver.testCliDriver_vector_char_cast org.apache.hadoop.hive.cli.TestMiniTezCliDriver.testCliDriver_vector_char_mapjoin1 org.apache.hadoop.hive.cli.TestMiniTezCliDriver.testCliDriver_vector_char_simple org.apache.hadoop.hive.cli.TestMiniTezCliDriver.testCliDriver_vector_coalesce org.apache.hadoop.hive.cli.TestMiniTezCliDriver.testCliDriver_vector_coalesce_2 org.apache.hadoop.hive.cli.TestMiniTezCliDriver.testCliDriver_vector_complex_all org.apache.hadoop.hive.cli.TestMiniTezCliDriver.testCliDriver_vector_complex_join org.apache.hadoop.hive.cli.TestMiniTezCliDriver.testCliDriver_vector_count_distinct org.apache.hadoop.hive.cli.TestMiniTezCliDriver.testCliDriver_vector_data_types org.apache.hadoop.hive.cli.TestMiniTezCliDriver.testCliDriver_vector_date_1 org.apache.hadoop.hive.cli.TestMiniTezCliDriver.testCliDriver_vector_decimal_1 org.apache.hadoop.hive.cli.TestMiniTezCliDriver.testCliDriver_vector_decimal_10_0 org.apache.hadoop.hive.cli.TestMiniTezCliDriver.testCliDriver_vector_decimal_2 org.apache.hadoop.hive.cli.TestMiniTezCliDriver.testCliDriver_vector_decimal_3 org.apache.hadoop.hive.cli.TestMiniTezCliDriver.testCliDriver_vector_decimal_4 org.apache.hadoop.hive.cli.TestMiniTezCliDriver.testCliDriver_vector_decimal_5 org.apache.hadoop.hive.cli.TestMiniTezCliDriver.testCliDriver_vector_decimal_6 org.apache.hadoop.hive.cli.TestMiniTezCliDriver.testCliDriver_vector_decimal_aggregate org.apache.hadoop.hive.cli.TestMiniTezCliDriver.testCliDriver_vector_decimal_cast org.apache.hadoop.hive.cli.TestMiniTezCliDriver.testCliDriver_vector_decimal_expressions org.apache.hadoop.hive.cli.TestMiniTezCliDriver.testCliDriver_vector_decimal_mapjoin org.apache.hadoop.hive.cli.TestMiniTezCliDriver.testCliDriver_vector_decimal_math_funcs org.apache.hadoop.hive.cli.TestMiniTezCliDriver.testCliDriver_vector_decimal_precision org.apache.hadoop.hive.cli.TestMiniTezCliDriver.testCliDriver_vector_decimal_round org.apache.hadoop.hive.cli.TestMiniTezCliDriver.testCliDriver_vector_decimal_round_2 org.apache.hadoop.hive.cli.TestMiniTezCliDriver.testCliDriver_vector_decimal_trailing org.apache.hadoop.hive.cli.TestMiniTezCliDriver.testCliDriver_vector_decimal_udf org.apache.hadoop.hive.cli.TestMiniTezCliDriver.testCliDriver_vector_decimal_udf2 org.apache.hadoop.hive.cli.TestMiniTezCliDriver.testCliDriver_vector_distinct_2 org.apache.hadoop.hive.cli.TestMiniTezCliDriver.testCliDriver_vector_elt org.apache.hadoop.hive.cli.TestMiniTezCliDriver.testCliDriver_vector_groupby_3 org.apache.hadoop.hive.cli.TestMiniTezCliDriver.testCliDriver_vector_groupby_mapjoin org.apache.hadoop.hive.cli.TestMiniTezCliDriver.testCliDriver_vector_groupby_reduce org.apache.hadoop.hive.cli.TestMiniTezCliDriver.testCliDriver_vector_grouping_sets org.apache.hadoop.hive.cli.TestMiniTezCliDriver.testCliDriver_vector_if_expr org.apache.hadoop.hive.cli.TestMiniTezCliDriver.testCliDriver_vector_inner_join org.apache.hadoop.hive.cli.TestMiniTezCliDriver.testCliDriver_vector_interval_1 org.apache.hadoop.hive.cli.TestMiniTezCliDriver.testCliDriver_vector_interval_2 org.apache.hadoop.hive.cli.TestMiniTezCliDriver.testCliDriver_vector_interval_arithmetic org.apache.hadoop.hive.cli.TestMiniTezCliDriver.testCliDriver_vector_interval_mapjoin org.apache.hadoop.hive.cli.TestMiniTezCliDriver.testCliDriver_vector_join30 org.apache.hadoop.hive.cli.TestMiniTezCliDriver.testCliDriver_vector_join_filters org.apache.hadoop.hive.cli.TestMiniTezCliDriver.testCliDriver_vector_join_nulls org.apache.hadoop.hive.cli.TestMiniTezCliDriver.testCliDriver_vector_join_part_col_char org.apache.hadoop.hive.cli.TestMiniTezCliDriver.testCliDriver_vector_left_outer_join org.apache.hadoop.hive.cli.TestMiniTezCliDriver.testCliDriver_vector_left_outer_join2 org.apache.hadoop.hive.cli.TestMiniTezCliDriver.testCliDriver_vector_leftsemi_mapjoin org.apache.hadoop.hive.cli.TestMiniTezCliDriver.testCliDriver_vector_mapjoin_reduce org.apache.hadoop.hive.cli.TestMiniTezCliDriver.testCliDriver_vector_mr_diff_schema_alias org.apache.hadoop.hive.cli.TestMiniTezCliDriver.testCliDriver_vector_multi_insert org.apache.hadoop.hive.cli.TestMiniTezCliDriver.testCliDriver_vector_non_string_partition org.apache.hadoop.hive.cli.TestMiniTezCliDriver.testCliDriver_vector_null_projection org.apache.hadoop.hive.cli.TestMiniTezCliDriver.testCliDriver_vector_nullsafe_join org.apache.hadoop.hive.cli.TestMiniTezCliDriver.testCliDriver_vector_nvl org.apache.hadoop.hive.cli.TestMiniTezCliDriver.testCliDriver_vector_orderby_5 org.apache.hadoop.hive.cli.TestMiniTezCliDriver.testCliDriver_vector_outer_join0 org.apache.hadoop.hive.cli.TestMiniTezCliDriver.testCliDriver_vector_outer_join1 org.apache.hadoop.hive.cli.TestMiniTezCliDriver.testCliDriver_vector_outer_join2 org.apache.hadoop.hive.cli.TestMiniTezCliDriver.testCliDriver_vector_outer_join3 org.apache.hadoop.hive.cli.TestMiniTezCliDriver.testCliDriver_vector_outer_join4 org.apache.hadoop.hive.cli.TestMiniTezCliDriver.testCliDriver_vector_outer_join5 org.apache.hadoop.hive.cli.TestMiniTezCliDriver.testCliDriver_vector_outer_join6 org.apache.hadoop.hive.cli.TestMiniTezCliDriver.testCliDriver_vector_partition_diff_num_cols org.apache.hadoop.hive.cli.TestMiniTezCliDriver.testCliDriver_vector_partitioned_date_time org.apache.hadoop.hive.cli.TestMiniTezCliDriver.testCliDriver_vector_reduce1 org.apache.hadoop.hive.cli.TestMiniTezCliDriver.testCliDriver_vector_reduce2 org.apache.hadoop.hive.cli.TestMiniTezCliDriver.testCliDriver_vector_reduce3 org.apache.hadoop.hive.cli.TestMiniTezCliDriver.testCliDriver_vector_reduce_groupby_decimal org.apache.hadoop.hive.cli.TestMiniTezCliDriver.testCliDriver_vector_string_concat org.apache.hadoop.hive.cli.TestMiniTezCliDriver.testCliDriver_vector_struct_in org.apache.hadoop.hive.cli.TestMiniTezCliDriver.testCliDriver_vector_varchar_4 org.apache.hadoop.hive.cli.TestMiniTezCliDriver.testCliDriver_vector_varchar_mapjoin1 org.apache.hadoop.hive.cli.TestMiniTezCliDriver.testCliDriver_vector_varchar_simple org.apache.hadoop.hive.cli.TestMiniTezCliDriver.testCliDriver_vector_when_case_null org.apache.hadoop.hive.cli.TestMiniTezCliDriver.testCliDriver_vectorization_0 org.apache.hadoop.hive.cli.TestMiniTezCliDriver.testCliDriver_vectorization_1 org.apache.hadoop.hive.cli.TestMiniTezCliDriver.testCliDriver_vectorization_10 org.apache.hadoop.hive.cli.TestMiniTezCliDriver.testCliDriver_vectorization_11 org.apache.hadoop.hive.cli.TestMiniTezCliDriver.testCliDriver_vectorization_12 org.apache.hadoop.hive.cli.TestMiniTezCliDriver.testCliDriver_vectorization_13 org.apache.hadoop.hive.cli.TestMiniTezCliDriver.testCliDriver_vectorization_14 org.apache.hadoop.hive.cli.TestMiniTezCliDriver.testCliDriver_vectorization_15 org.apache.hadoop.hive.cli.TestMiniTezCliDriver.testCliDriver_vectorization_16 org.apache.hadoop.hive.cli.TestMiniTezCliDriver.testCliDriver_vectorization_17 org.apache.hadoop.hive.cli.TestMiniTezCliDriver.testCliDriver_vectorization_2 org.apache.hadoop.hive.cli.TestMiniTezCliDriver.testCliDriver_vectorization_3 org.apache.hadoop.hive.cli.TestMiniTezCliDriver.testCliDriver_vectorization_4 org.apache.hadoop.hive.cli.TestMiniTezCliDriver.testCliDriver_vectorization_5 org.apache.hadoop.hive.cli.TestMiniTezCliDriver.testCliDriver_vectorization_6 org.apache.hadoop.hive.cli.TestMiniTezCliDriver.testCliDriver_vectorization_7 org.apache.hadoop.hive.cli.TestMiniTezCliDriver.testCliDriver_vectorization_8 org.apache.hadoop.hive.cli.TestMiniTezCliDriver.testCliDriver_vectorization_9 org.apache.hadoop.hive.cli.TestMiniTezCliDriver.testCliDriver_vectorization_decimal_date org.apache.hadoop.hive.cli.TestMiniTezCliDriver.testCliDriver_vectorization_div0 org.apache.hadoop.hive.cli.TestMiniTezCliDriver.testCliDriver_vectorization_limit org.apache.hadoop.hive.cli.TestMiniTezCliDriver.testCliDriver_vectorization_nested_udf org.apache.hadoop.hive.cli.TestMiniTezCliDriver.testCliDriver_vectorization_not org.apache.hadoop.hive.cli.TestMiniTezCliDriver.testCliDriver_vectorization_part org.apache.hadoop.hive.cli.TestMiniTezCliDriver.testCliDriver_vectorization_part_project org.apache.hadoop.hive.cli.TestMiniTezCliDriver.testCliDriver_vectorization_part_varchar org.apache.hadoop.hive.cli.TestMiniTezCliDriver.testCliDriver_vectorization_pushdown org.apache.hadoop.hive.cli.TestMiniTezCliDriver.testCliDriver_vectorization_short_regress org.apache.hadoop.hive.cli.TestMiniTezCliDriver.testCliDriver_vectorized_bucketmapjoin1 org.apache.hadoop.hive.cli.TestMiniTezCliDriver.testCliDriver_vectorized_case org.apache.hadoop.hive.cli.TestMiniTezCliDriver.testCliDriver_vectorized_casts org.apache.hadoop.hive.cli.TestMiniTezCliDriver.testCliDriver_vectorized_context org.apache.hadoop.hive.cli.TestMiniTezCliDriver.testCliDriver_vectorized_date_funcs org.apache.hadoop.hive.cli.TestMiniTezCliDriver.testCliDriver_vectorized_distinct_gby org.apache.hadoop.hive.cli.TestMiniTezCliDriver.testCliDriver_vectorized_dynamic_partition_pruning org.apache.hadoop.hive.cli.TestMiniTezCliDriver.testCliDriver_vectorized_mapjoin org.apache.hadoop.hive.cli.TestMiniTezCliDriver.testCliDriver_vectorized_math_funcs org.apache.hadoop.hive.cli.TestMiniTezCliDriver.testCliDriver_vectorized_nested_mapjoin org.apache.hadoop.hive.cli.TestMiniTezCliDriver.testCliDriver_vectorized_parquet org.apache.hadoop.hive.cli.TestMiniTezCliDriver.testCliDriver_vectorized_parquet_types org.apache.hadoop.hive.cli.TestMiniTezCliDriver.testCliDriver_vectorized_ptf org.apache.hadoop.hive.cli.TestMiniTezCliDriver.testCliDriver_vectorized_rcfile_columnar org.apache.hadoop.hive.cli.TestMiniTezCliDriver.testCliDriver_vectorized_shufflejoin org.apache.hadoop.hive.cli.TestMiniTezCliDriver.testCliDriver_vectorized_string_funcs org.apache.hadoop.hive.cli.TestMiniTezCliDriver.testCliDriver_vectorized_timestamp org.apache.hadoop.hive.cli.TestMiniTezCliDriver.testCliDriver_vectorized_timestamp_funcs org.apache.hadoop.hive.cli.TestMiniTezCliDriver.testCliDriver_vectorized_timestamp_ints_casts org.apache.hadoop.hive.cli.TestMiniTezCliDriver.testCliDriver_windowing_gby org.apache.hadoop.hive.cli.TestNegativeMinimrCliDriver.testNegativeCliDriver_minimr_broken_pipe org.apache.hadoop.hive.llap.tezplugins.TestLlapTaskCommunicator.testFinishableStateUpdateFailure org.apache.hadoop.hive.llap.tezplugins.TestLlapTaskSchedulerService.testForcedLocalityPreemption org.apache.hadoop.hive.metastore.TestMetaStoreMetrics.org.apache.hadoop.hive.metastore.TestMetaStoreMetrics org.apache.hadoop.hive.metastore.TestRemoteHiveMetaStore.testSimpleTable org.apache.hadoop.hive.ql.security.TestClientSideAuthorizationProvider.testSimplePrivileges org.apache.hadoop.hive.ql.security.TestFolderPermissions.org.apache.hadoop.hive.ql.security.TestFolderPermissions org.apache.hadoop.hive.ql.security.TestMetastoreAuthorizationProvider.testSimplePrivileges org.apache.hadoop.hive.ql.security.TestMultiAuthorizationPreEventListener.org.apache.hadoop.hive.ql.security.TestMultiAuthorizationPreEventListener org.apache.hadoop.hive.ql.security.TestStorageBasedMetastoreAuthorizationDrops.testDropPartition org.apache.hadoop.hive.ql.security.TestStorageBasedMetastoreAuthorizationProvider.testSimplePrivileges org.apache.hadoop.hive.ql.security.TestStorageBasedMetastoreAuthorizationProviderWithACL.testSimplePrivileges org.apache.hadoop.hive.thrift.TestHadoopAuthBridge23.testDelegationTokenSharedStore org.apache.hadoop.hive.thrift.TestHadoopAuthBridge23.testMetastoreProxyUser org.apache.hadoop.hive.thrift.TestHadoopAuthBridge23.testSaslWithHiveMetaStore org.apache.hive.service.cli.operation.TestOperationLoggingAPIWithMr.testFetchResultsOfLogAsync Test results: http://ec2-174-129-184-35.compute-1.amazonaws.com/jenkins/job/PreCommit-HIVE-TRUNK-Build/7507/testReport Console output: http://ec2-174-129-184-35.compute-1.amazonaws.com/jenkins/job/PreCommit-HIVE-TRUNK-Build/7507/console Test logs: http://ec2-174-129-184-35.compute-1.amazonaws.com/logs/PreCommit-HIVE-TRUNK-Build-7507/ Messages: Executing org.apache.hive.ptest.execution.TestCheckPhase Executing org.apache.hive.ptest.execution.PrepPhase Executing org.apache.hive.ptest.execution.ExecutionPhase Executing org.apache.hive.ptest.execution.ReportingPhase Tests exited with: TestsFailedException: 389 tests failed This message is automatically generated. ATTACHMENT ID: 12797330 - PreCommit-HIVE-TRUNK-Build
          Hide
          hiveqa Hive QA added a comment -

          Here are the results of testing the latest attachment:
          https://issues.apache.org/jira/secure/attachment/12797733/HIVE-13424.3.patch

          SUCCESS: +1 due to 14 test(s) being added or modified.

          ERROR: -1 due to 374 failed/errored test(s), 9983 tests executed
          Failed tests:

          org.apache.hadoop.hive.cli.TestMiniSparkOnYarnCliDriver.testCliDriver_index_bitmap3
          org.apache.hadoop.hive.cli.TestMiniTezCliDriver.org.apache.hadoop.hive.cli.TestMiniTezCliDriver
          org.apache.hadoop.hive.cli.TestMiniTezCliDriver.testCliDriver_acid_globallimit
          org.apache.hadoop.hive.cli.TestMiniTezCliDriver.testCliDriver_alter_merge_2_orc
          org.apache.hadoop.hive.cli.TestMiniTezCliDriver.testCliDriver_alter_merge_orc
          org.apache.hadoop.hive.cli.TestMiniTezCliDriver.testCliDriver_alter_merge_stats_orc
          org.apache.hadoop.hive.cli.TestMiniTezCliDriver.testCliDriver_auto_join0
          org.apache.hadoop.hive.cli.TestMiniTezCliDriver.testCliDriver_auto_join1
          org.apache.hadoop.hive.cli.TestMiniTezCliDriver.testCliDriver_auto_join21
          org.apache.hadoop.hive.cli.TestMiniTezCliDriver.testCliDriver_auto_join29
          org.apache.hadoop.hive.cli.TestMiniTezCliDriver.testCliDriver_auto_join30
          org.apache.hadoop.hive.cli.TestMiniTezCliDriver.testCliDriver_auto_join_filters
          org.apache.hadoop.hive.cli.TestMiniTezCliDriver.testCliDriver_auto_join_nulls
          org.apache.hadoop.hive.cli.TestMiniTezCliDriver.testCliDriver_auto_sortmerge_join_1
          org.apache.hadoop.hive.cli.TestMiniTezCliDriver.testCliDriver_auto_sortmerge_join_10
          org.apache.hadoop.hive.cli.TestMiniTezCliDriver.testCliDriver_auto_sortmerge_join_11
          org.apache.hadoop.hive.cli.TestMiniTezCliDriver.testCliDriver_auto_sortmerge_join_12
          org.apache.hadoop.hive.cli.TestMiniTezCliDriver.testCliDriver_auto_sortmerge_join_13
          org.apache.hadoop.hive.cli.TestMiniTezCliDriver.testCliDriver_auto_sortmerge_join_14
          org.apache.hadoop.hive.cli.TestMiniTezCliDriver.testCliDriver_auto_sortmerge_join_15
          org.apache.hadoop.hive.cli.TestMiniTezCliDriver.testCliDriver_auto_sortmerge_join_16
          org.apache.hadoop.hive.cli.TestMiniTezCliDriver.testCliDriver_auto_sortmerge_join_2
          org.apache.hadoop.hive.cli.TestMiniTezCliDriver.testCliDriver_auto_sortmerge_join_3
          org.apache.hadoop.hive.cli.TestMiniTezCliDriver.testCliDriver_auto_sortmerge_join_4
          org.apache.hadoop.hive.cli.TestMiniTezCliDriver.testCliDriver_auto_sortmerge_join_5
          org.apache.hadoop.hive.cli.TestMiniTezCliDriver.testCliDriver_auto_sortmerge_join_6
          org.apache.hadoop.hive.cli.TestMiniTezCliDriver.testCliDriver_auto_sortmerge_join_7
          org.apache.hadoop.hive.cli.TestMiniTezCliDriver.testCliDriver_auto_sortmerge_join_8
          org.apache.hadoop.hive.cli.TestMiniTezCliDriver.testCliDriver_auto_sortmerge_join_9
          org.apache.hadoop.hive.cli.TestMiniTezCliDriver.testCliDriver_bucket2
          org.apache.hadoop.hive.cli.TestMiniTezCliDriver.testCliDriver_bucket3
          org.apache.hadoop.hive.cli.TestMiniTezCliDriver.testCliDriver_bucket4
          org.apache.hadoop.hive.cli.TestMiniTezCliDriver.testCliDriver_bucket_map_join_tez1
          org.apache.hadoop.hive.cli.TestMiniTezCliDriver.testCliDriver_bucket_map_join_tez2
          org.apache.hadoop.hive.cli.TestMiniTezCliDriver.testCliDriver_bucketpruning1
          org.apache.hadoop.hive.cli.TestMiniTezCliDriver.testCliDriver_cbo_gby
          org.apache.hadoop.hive.cli.TestMiniTezCliDriver.testCliDriver_cbo_gby_empty
          org.apache.hadoop.hive.cli.TestMiniTezCliDriver.testCliDriver_cbo_join
          org.apache.hadoop.hive.cli.TestMiniTezCliDriver.testCliDriver_cbo_limit
          org.apache.hadoop.hive.cli.TestMiniTezCliDriver.testCliDriver_cbo_semijoin
          org.apache.hadoop.hive.cli.TestMiniTezCliDriver.testCliDriver_cbo_simple_select
          org.apache.hadoop.hive.cli.TestMiniTezCliDriver.testCliDriver_cbo_stats
          org.apache.hadoop.hive.cli.TestMiniTezCliDriver.testCliDriver_cbo_subq_exists
          org.apache.hadoop.hive.cli.TestMiniTezCliDriver.testCliDriver_cbo_subq_in
          org.apache.hadoop.hive.cli.TestMiniTezCliDriver.testCliDriver_cbo_subq_not_in
          org.apache.hadoop.hive.cli.TestMiniTezCliDriver.testCliDriver_cbo_udf_udaf
          org.apache.hadoop.hive.cli.TestMiniTezCliDriver.testCliDriver_cbo_union
          org.apache.hadoop.hive.cli.TestMiniTezCliDriver.testCliDriver_cbo_views
          org.apache.hadoop.hive.cli.TestMiniTezCliDriver.testCliDriver_cbo_windowing
          org.apache.hadoop.hive.cli.TestMiniTezCliDriver.testCliDriver_column_names_with_leading_and_trailing_spaces
          org.apache.hadoop.hive.cli.TestMiniTezCliDriver.testCliDriver_constprog_dpp
          org.apache.hadoop.hive.cli.TestMiniTezCliDriver.testCliDriver_constprog_semijoin
          org.apache.hadoop.hive.cli.TestMiniTezCliDriver.testCliDriver_correlationoptimizer1
          org.apache.hadoop.hive.cli.TestMiniTezCliDriver.testCliDriver_count
          org.apache.hadoop.hive.cli.TestMiniTezCliDriver.testCliDriver_create_merge_compressed
          org.apache.hadoop.hive.cli.TestMiniTezCliDriver.testCliDriver_cross_join
          org.apache.hadoop.hive.cli.TestMiniTezCliDriver.testCliDriver_cross_product_check_1
          org.apache.hadoop.hive.cli.TestMiniTezCliDriver.testCliDriver_cross_product_check_2
          org.apache.hadoop.hive.cli.TestMiniTezCliDriver.testCliDriver_ctas
          org.apache.hadoop.hive.cli.TestMiniTezCliDriver.testCliDriver_cte_1
          org.apache.hadoop.hive.cli.TestMiniTezCliDriver.testCliDriver_cte_2
          org.apache.hadoop.hive.cli.TestMiniTezCliDriver.testCliDriver_cte_3
          org.apache.hadoop.hive.cli.TestMiniTezCliDriver.testCliDriver_cte_4
          org.apache.hadoop.hive.cli.TestMiniTezCliDriver.testCliDriver_cte_5
          org.apache.hadoop.hive.cli.TestMiniTezCliDriver.testCliDriver_cte_mat_1
          org.apache.hadoop.hive.cli.TestMiniTezCliDriver.testCliDriver_cte_mat_2
          org.apache.hadoop.hive.cli.TestMiniTezCliDriver.testCliDriver_cte_mat_3
          org.apache.hadoop.hive.cli.TestMiniTezCliDriver.testCliDriver_cte_mat_4
          org.apache.hadoop.hive.cli.TestMiniTezCliDriver.testCliDriver_cte_mat_5
          org.apache.hadoop.hive.cli.TestMiniTezCliDriver.testCliDriver_custom_input_output_format
          org.apache.hadoop.hive.cli.TestMiniTezCliDriver.testCliDriver_delete_all_non_partitioned
          org.apache.hadoop.hive.cli.TestMiniTezCliDriver.testCliDriver_delete_all_partitioned
          org.apache.hadoop.hive.cli.TestMiniTezCliDriver.testCliDriver_delete_orig_table
          org.apache.hadoop.hive.cli.TestMiniTezCliDriver.testCliDriver_delete_tmp_table
          org.apache.hadoop.hive.cli.TestMiniTezCliDriver.testCliDriver_delete_where_no_match
          org.apache.hadoop.hive.cli.TestMiniTezCliDriver.testCliDriver_delete_where_non_partitioned
          org.apache.hadoop.hive.cli.TestMiniTezCliDriver.testCliDriver_delete_where_partitioned
          org.apache.hadoop.hive.cli.TestMiniTezCliDriver.testCliDriver_delete_whole_partition
          org.apache.hadoop.hive.cli.TestMiniTezCliDriver.testCliDriver_disable_merge_for_bucketing
          org.apache.hadoop.hive.cli.TestMiniTezCliDriver.testCliDriver_dynamic_partition_pruning
          org.apache.hadoop.hive.cli.TestMiniTezCliDriver.testCliDriver_dynamic_partition_pruning_2
          org.apache.hadoop.hive.cli.TestMiniTezCliDriver.testCliDriver_dynpart_sort_opt_vectorization
          org.apache.hadoop.hive.cli.TestMiniTezCliDriver.testCliDriver_dynpart_sort_optimization
          org.apache.hadoop.hive.cli.TestMiniTezCliDriver.testCliDriver_dynpart_sort_optimization2
          org.apache.hadoop.hive.cli.TestMiniTezCliDriver.testCliDriver_empty_join
          org.apache.hadoop.hive.cli.TestMiniTezCliDriver.testCliDriver_enforce_order
          org.apache.hadoop.hive.cli.TestMiniTezCliDriver.testCliDriver_explainuser_1
          org.apache.hadoop.hive.cli.TestMiniTezCliDriver.testCliDriver_explainuser_2
          org.apache.hadoop.hive.cli.TestMiniTezCliDriver.testCliDriver_explainuser_3
          org.apache.hadoop.hive.cli.TestMiniTezCliDriver.testCliDriver_explainuser_4
          org.apache.hadoop.hive.cli.TestMiniTezCliDriver.testCliDriver_filter_join_breaktask
          org.apache.hadoop.hive.cli.TestMiniTezCliDriver.testCliDriver_filter_join_breaktask2
          org.apache.hadoop.hive.cli.TestMiniTezCliDriver.testCliDriver_groupby1
          org.apache.hadoop.hive.cli.TestMiniTezCliDriver.testCliDriver_groupby2
          org.apache.hadoop.hive.cli.TestMiniTezCliDriver.testCliDriver_groupby3
          org.apache.hadoop.hive.cli.TestMiniTezCliDriver.testCliDriver_having
          org.apache.hadoop.hive.cli.TestMiniTezCliDriver.testCliDriver_hybridgrace_hashjoin_1
          org.apache.hadoop.hive.cli.TestMiniTezCliDriver.testCliDriver_hybridgrace_hashjoin_2
          org.apache.hadoop.hive.cli.TestMiniTezCliDriver.testCliDriver_insert_into1
          org.apache.hadoop.hive.cli.TestMiniTezCliDriver.testCliDriver_insert_into2
          org.apache.hadoop.hive.cli.TestMiniTezCliDriver.testCliDriver_insert_orig_table
          org.apache.hadoop.hive.cli.TestMiniTezCliDriver.testCliDriver_insert_update_delete
          org.apache.hadoop.hive.cli.TestMiniTezCliDriver.testCliDriver_insert_values_dynamic_partitioned
          org.apache.hadoop.hive.cli.TestMiniTezCliDriver.testCliDriver_insert_values_non_partitioned
          org.apache.hadoop.hive.cli.TestMiniTezCliDriver.testCliDriver_insert_values_tmp_table
          org.apache.hadoop.hive.cli.TestMiniTezCliDriver.testCliDriver_join0
          org.apache.hadoop.hive.cli.TestMiniTezCliDriver.testCliDriver_join1
          org.apache.hadoop.hive.cli.TestMiniTezCliDriver.testCliDriver_join_nullsafe
          org.apache.hadoop.hive.cli.TestMiniTezCliDriver.testCliDriver_leftsemijoin
          org.apache.hadoop.hive.cli.TestMiniTezCliDriver.testCliDriver_limit_pushdown
          org.apache.hadoop.hive.cli.TestMiniTezCliDriver.testCliDriver_llap_nullscan
          org.apache.hadoop.hive.cli.TestMiniTezCliDriver.testCliDriver_llapdecider
          org.apache.hadoop.hive.cli.TestMiniTezCliDriver.testCliDriver_load_dyn_part1
          org.apache.hadoop.hive.cli.TestMiniTezCliDriver.testCliDriver_load_dyn_part2
          org.apache.hadoop.hive.cli.TestMiniTezCliDriver.testCliDriver_load_dyn_part3
          org.apache.hadoop.hive.cli.TestMiniTezCliDriver.testCliDriver_lvj_mapjoin
          org.apache.hadoop.hive.cli.TestMiniTezCliDriver.testCliDriver_mapjoin_decimal
          org.apache.hadoop.hive.cli.TestMiniTezCliDriver.testCliDriver_mapjoin_mapjoin
          org.apache.hadoop.hive.cli.TestMiniTezCliDriver.testCliDriver_mapreduce1
          org.apache.hadoop.hive.cli.TestMiniTezCliDriver.testCliDriver_mapreduce2
          org.apache.hadoop.hive.cli.TestMiniTezCliDriver.testCliDriver_merge1
          org.apache.hadoop.hive.cli.TestMiniTezCliDriver.testCliDriver_merge2
          org.apache.hadoop.hive.cli.TestMiniTezCliDriver.testCliDriver_mergejoin
          org.apache.hadoop.hive.cli.TestMiniTezCliDriver.testCliDriver_mergejoin_3way
          org.apache.hadoop.hive.cli.TestMiniTezCliDriver.testCliDriver_metadata_only_queries
          org.apache.hadoop.hive.cli.TestMiniTezCliDriver.testCliDriver_metadata_only_queries_with_filters
          org.apache.hadoop.hive.cli.TestMiniTezCliDriver.testCliDriver_metadataonly1
          org.apache.hadoop.hive.cli.TestMiniTezCliDriver.testCliDriver_mrr
          org.apache.hadoop.hive.cli.TestMiniTezCliDriver.testCliDriver_nonmr_fetch_threshold
          org.apache.hadoop.hive.cli.TestMiniTezCliDriver.testCliDriver_optimize_nullscan
          org.apache.hadoop.hive.cli.TestMiniTezCliDriver.testCliDriver_orc_analyze
          org.apache.hadoop.hive.cli.TestMiniTezCliDriver.testCliDriver_orc_merge1
          org.apache.hadoop.hive.cli.TestMiniTezCliDriver.testCliDriver_orc_merge10
          org.apache.hadoop.hive.cli.TestMiniTezCliDriver.testCliDriver_orc_merge11
          org.apache.hadoop.hive.cli.TestMiniTezCliDriver.testCliDriver_orc_merge12
          org.apache.hadoop.hive.cli.TestMiniTezCliDriver.testCliDriver_orc_merge2
          org.apache.hadoop.hive.cli.TestMiniTezCliDriver.testCliDriver_orc_merge3
          org.apache.hadoop.hive.cli.TestMiniTezCliDriver.testCliDriver_orc_merge4
          org.apache.hadoop.hive.cli.TestMiniTezCliDriver.testCliDriver_orc_merge5
          org.apache.hadoop.hive.cli.TestMiniTezCliDriver.testCliDriver_orc_merge6
          org.apache.hadoop.hive.cli.TestMiniTezCliDriver.testCliDriver_orc_merge7
          org.apache.hadoop.hive.cli.TestMiniTezCliDriver.testCliDriver_orc_merge8
          org.apache.hadoop.hive.cli.TestMiniTezCliDriver.testCliDriver_orc_merge9
          org.apache.hadoop.hive.cli.TestMiniTezCliDriver.testCliDriver_orc_merge_diff_fs
          org.apache.hadoop.hive.cli.TestMiniTezCliDriver.testCliDriver_orc_merge_incompat1
          org.apache.hadoop.hive.cli.TestMiniTezCliDriver.testCliDriver_orc_merge_incompat2
          org.apache.hadoop.hive.cli.TestMiniTezCliDriver.testCliDriver_orc_merge_incompat3
          org.apache.hadoop.hive.cli.TestMiniTezCliDriver.testCliDriver_orc_ppd_basic
          org.apache.hadoop.hive.cli.TestMiniTezCliDriver.testCliDriver_orc_vectorization_ppd
          org.apache.hadoop.hive.cli.TestMiniTezCliDriver.testCliDriver_order_null
          org.apache.hadoop.hive.cli.TestMiniTezCliDriver.testCliDriver_parallel
          org.apache.hadoop.hive.cli.TestMiniTezCliDriver.testCliDriver_ptf
          org.apache.hadoop.hive.cli.TestMiniTezCliDriver.testCliDriver_ptf_matchpath
          org.apache.hadoop.hive.cli.TestMiniTezCliDriver.testCliDriver_ptf_streaming
          org.apache.hadoop.hive.cli.TestMiniTezCliDriver.testCliDriver_sample1
          org.apache.hadoop.hive.cli.TestMiniTezCliDriver.testCliDriver_schema_evol_orc_acid_mapwork_part
          org.apache.hadoop.hive.cli.TestMiniTezCliDriver.testCliDriver_schema_evol_orc_acid_mapwork_table
          org.apache.hadoop.hive.cli.TestMiniTezCliDriver.testCliDriver_schema_evol_orc_acidvec_mapwork_part
          org.apache.hadoop.hive.cli.TestMiniTezCliDriver.testCliDriver_schema_evol_orc_acidvec_mapwork_table
          org.apache.hadoop.hive.cli.TestMiniTezCliDriver.testCliDriver_schema_evol_orc_nonvec_fetchwork_part
          org.apache.hadoop.hive.cli.TestMiniTezCliDriver.testCliDriver_schema_evol_orc_nonvec_fetchwork_table
          org.apache.hadoop.hive.cli.TestMiniTezCliDriver.testCliDriver_schema_evol_orc_nonvec_mapwork_part
          org.apache.hadoop.hive.cli.TestMiniTezCliDriver.testCliDriver_schema_evol_orc_nonvec_mapwork_table
          org.apache.hadoop.hive.cli.TestMiniTezCliDriver.testCliDriver_schema_evol_orc_vec_mapwork_part
          org.apache.hadoop.hive.cli.TestMiniTezCliDriver.testCliDriver_schema_evol_orc_vec_mapwork_table
          org.apache.hadoop.hive.cli.TestMiniTezCliDriver.testCliDriver_schema_evol_stats
          org.apache.hadoop.hive.cli.TestMiniTezCliDriver.testCliDriver_schema_evol_text_fetchwork_table
          org.apache.hadoop.hive.cli.TestMiniTezCliDriver.testCliDriver_schema_evol_text_mapwork_table
          org.apache.hadoop.hive.cli.TestMiniTezCliDriver.testCliDriver_schema_evol_text_nonvec_fetchwork_part
          org.apache.hadoop.hive.cli.TestMiniTezCliDriver.testCliDriver_schema_evol_text_nonvec_fetchwork_table
          org.apache.hadoop.hive.cli.TestMiniTezCliDriver.testCliDriver_schema_evol_text_nonvec_mapwork_part
          org.apache.hadoop.hive.cli.TestMiniTezCliDriver.testCliDriver_schema_evol_text_nonvec_mapwork_table
          org.apache.hadoop.hive.cli.TestMiniTezCliDriver.testCliDriver_script_env_var1
          org.apache.hadoop.hive.cli.TestMiniTezCliDriver.testCliDriver_script_env_var2
          org.apache.hadoop.hive.cli.TestMiniTezCliDriver.testCliDriver_script_pipe
          org.apache.hadoop.hive.cli.TestMiniTezCliDriver.testCliDriver_scriptfile1
          org.apache.hadoop.hive.cli.TestMiniTezCliDriver.testCliDriver_selectDistinctStar
          org.apache.hadoop.hive.cli.TestMiniTezCliDriver.testCliDriver_select_dummy_source
          org.apache.hadoop.hive.cli.TestMiniTezCliDriver.testCliDriver_skewjoin
          org.apache.hadoop.hive.cli.TestMiniTezCliDriver.testCliDriver_smb_cache
          org.apache.hadoop.hive.cli.TestMiniTezCliDriver.testCliDriver_stats_filemetadata
          org.apache.hadoop.hive.cli.TestMiniTezCliDriver.testCliDriver_stats_noscan_1
          org.apache.hadoop.hive.cli.TestMiniTezCliDriver.testCliDriver_stats_only_null
          org.apache.hadoop.hive.cli.TestMiniTezCliDriver.testCliDriver_subquery_exists
          org.apache.hadoop.hive.cli.TestMiniTezCliDriver.testCliDriver_subquery_in
          org.apache.hadoop.hive.cli.TestMiniTezCliDriver.testCliDriver_temp_table
          org.apache.hadoop.hive.cli.TestMiniTezCliDriver.testCliDriver_tez_bmj_schema_evolution
          org.apache.hadoop.hive.cli.TestMiniTezCliDriver.testCliDriver_tez_dml
          org.apache.hadoop.hive.cli.TestMiniTezCliDriver.testCliDriver_tez_dynpart_hashjoin_1
          org.apache.hadoop.hive.cli.TestMiniTezCliDriver.testCliDriver_tez_dynpart_hashjoin_2
          org.apache.hadoop.hive.cli.TestMiniTezCliDriver.testCliDriver_tez_dynpart_hashjoin_3
          org.apache.hadoop.hive.cli.TestMiniTezCliDriver.testCliDriver_tez_fsstat
          org.apache.hadoop.hive.cli.TestMiniTezCliDriver.testCliDriver_tez_insert_overwrite_local_directory_1
          org.apache.hadoop.hive.cli.TestMiniTezCliDriver.testCliDriver_tez_join
          org.apache.hadoop.hive.cli.TestMiniTezCliDriver.testCliDriver_tez_join_hash
          org.apache.hadoop.hive.cli.TestMiniTezCliDriver.testCliDriver_tez_join_result_complex
          org.apache.hadoop.hive.cli.TestMiniTezCliDriver.testCliDriver_tez_join_tests
          org.apache.hadoop.hive.cli.TestMiniTezCliDriver.testCliDriver_tez_joins_explain
          org.apache.hadoop.hive.cli.TestMiniTezCliDriver.testCliDriver_tez_multi_union
          org.apache.hadoop.hive.cli.TestMiniTezCliDriver.testCliDriver_tez_schema_evolution
          org.apache.hadoop.hive.cli.TestMiniTezCliDriver.testCliDriver_tez_self_join
          org.apache.hadoop.hive.cli.TestMiniTezCliDriver.testCliDriver_tez_smb_1
          org.apache.hadoop.hive.cli.TestMiniTezCliDriver.testCliDriver_tez_smb_empty
          org.apache.hadoop.hive.cli.TestMiniTezCliDriver.testCliDriver_tez_smb_main
          org.apache.hadoop.hive.cli.TestMiniTezCliDriver.testCliDriver_tez_union
          org.apache.hadoop.hive.cli.TestMiniTezCliDriver.testCliDriver_tez_union2
          org.apache.hadoop.hive.cli.TestMiniTezCliDriver.testCliDriver_tez_union_decimal
          org.apache.hadoop.hive.cli.TestMiniTezCliDriver.testCliDriver_tez_union_dynamic_partition
          org.apache.hadoop.hive.cli.TestMiniTezCliDriver.testCliDriver_tez_union_group_by
          org.apache.hadoop.hive.cli.TestMiniTezCliDriver.testCliDriver_tez_union_multiinsert
          org.apache.hadoop.hive.cli.TestMiniTezCliDriver.testCliDriver_tez_union_with_udf
          org.apache.hadoop.hive.cli.TestMiniTezCliDriver.testCliDriver_tez_vector_dynpart_hashjoin_1
          org.apache.hadoop.hive.cli.TestMiniTezCliDriver.testCliDriver_tez_vector_dynpart_hashjoin_2
          org.apache.hadoop.hive.cli.TestMiniTezCliDriver.testCliDriver_transform1
          org.apache.hadoop.hive.cli.TestMiniTezCliDriver.testCliDriver_transform2
          org.apache.hadoop.hive.cli.TestMiniTezCliDriver.testCliDriver_transform_ppr1
          org.apache.hadoop.hive.cli.TestMiniTezCliDriver.testCliDriver_transform_ppr2
          org.apache.hadoop.hive.cli.TestMiniTezCliDriver.testCliDriver_union2
          org.apache.hadoop.hive.cli.TestMiniTezCliDriver.testCliDriver_union3
          org.apache.hadoop.hive.cli.TestMiniTezCliDriver.testCliDriver_union4
          org.apache.hadoop.hive.cli.TestMiniTezCliDriver.testCliDriver_union5
          org.apache.hadoop.hive.cli.TestMiniTezCliDriver.testCliDriver_union6
          org.apache.hadoop.hive.cli.TestMiniTezCliDriver.testCliDriver_union7
          org.apache.hadoop.hive.cli.TestMiniTezCliDriver.testCliDriver_union8
          org.apache.hadoop.hive.cli.TestMiniTezCliDriver.testCliDriver_union9
          org.apache.hadoop.hive.cli.TestMiniTezCliDriver.testCliDriver_unionDistinct_1
          org.apache.hadoop.hive.cli.TestMiniTezCliDriver.testCliDriver_unionDistinct_2
          org.apache.hadoop.hive.cli.TestMiniTezCliDriver.testCliDriver_union_fast_stats
          org.apache.hadoop.hive.cli.TestMiniTezCliDriver.testCliDriver_union_type_chk
          org.apache.hadoop.hive.cli.TestMiniTezCliDriver.testCliDriver_update_after_multiple_inserts
          org.apache.hadoop.hive.cli.TestMiniTezCliDriver.testCliDriver_update_all_non_partitioned
          org.apache.hadoop.hive.cli.TestMiniTezCliDriver.testCliDriver_update_all_partitioned
          org.apache.hadoop.hive.cli.TestMiniTezCliDriver.testCliDriver_update_all_types
          org.apache.hadoop.hive.cli.TestMiniTezCliDriver.testCliDriver_update_orig_table
          org.apache.hadoop.hive.cli.TestMiniTezCliDriver.testCliDriver_update_tmp_table
          org.apache.hadoop.hive.cli.TestMiniTezCliDriver.testCliDriver_update_two_cols
          org.apache.hadoop.hive.cli.TestMiniTezCliDriver.testCliDriver_update_where_no_match
          org.apache.hadoop.hive.cli.TestMiniTezCliDriver.testCliDriver_update_where_non_partitioned
          org.apache.hadoop.hive.cli.TestMiniTezCliDriver.testCliDriver_update_where_partitioned
          org.apache.hadoop.hive.cli.TestMiniTezCliDriver.testCliDriver_vector_acid3
          org.apache.hadoop.hive.cli.TestMiniTezCliDriver.testCliDriver_vector_aggregate_9
          org.apache.hadoop.hive.cli.TestMiniTezCliDriver.testCliDriver_vector_aggregate_without_gby
          org.apache.hadoop.hive.cli.TestMiniTezCliDriver.testCliDriver_vector_auto_smb_mapjoin_14
          org.apache.hadoop.hive.cli.TestMiniTezCliDriver.testCliDriver_vector_between_columns
          org.apache.hadoop.hive.cli.TestMiniTezCliDriver.testCliDriver_vector_between_in
          org.apache.hadoop.hive.cli.TestMiniTezCliDriver.testCliDriver_vector_binary_join_groupby
          org.apache.hadoop.hive.cli.TestMiniTezCliDriver.testCliDriver_vector_bround
          org.apache.hadoop.hive.cli.TestMiniTezCliDriver.testCliDriver_vector_bucket
          org.apache.hadoop.hive.cli.TestMiniTezCliDriver.testCliDriver_vector_cast_constant
          org.apache.hadoop.hive.cli.TestMiniTezCliDriver.testCliDriver_vector_char_2
          org.apache.hadoop.hive.cli.TestMiniTezCliDriver.testCliDriver_vector_char_4
          org.apache.hadoop.hive.cli.TestMiniTezCliDriver.testCliDriver_vector_char_cast
          org.apache.hadoop.hive.cli.TestMiniTezCliDriver.testCliDriver_vector_char_mapjoin1
          org.apache.hadoop.hive.cli.TestMiniTezCliDriver.testCliDriver_vector_char_simple
          org.apache.hadoop.hive.cli.TestMiniTezCliDriver.testCliDriver_vector_coalesce
          org.apache.hadoop.hive.cli.TestMiniTezCliDriver.testCliDriver_vector_coalesce_2
          org.apache.hadoop.hive.cli.TestMiniTezCliDriver.testCliDriver_vector_complex_all
          org.apache.hadoop.hive.cli.TestMiniTezCliDriver.testCliDriver_vector_complex_join
          org.apache.hadoop.hive.cli.TestMiniTezCliDriver.testCliDriver_vector_count_distinct
          org.apache.hadoop.hive.cli.TestMiniTezCliDriver.testCliDriver_vector_data_types
          org.apache.hadoop.hive.cli.TestMiniTezCliDriver.testCliDriver_vector_date_1
          org.apache.hadoop.hive.cli.TestMiniTezCliDriver.testCliDriver_vector_decimal_1
          org.apache.hadoop.hive.cli.TestMiniTezCliDriver.testCliDriver_vector_decimal_10_0
          org.apache.hadoop.hive.cli.TestMiniTezCliDriver.testCliDriver_vector_decimal_2
          org.apache.hadoop.hive.cli.TestMiniTezCliDriver.testCliDriver_vector_decimal_3
          org.apache.hadoop.hive.cli.TestMiniTezCliDriver.testCliDriver_vector_decimal_4
          org.apache.hadoop.hive.cli.TestMiniTezCliDriver.testCliDriver_vector_decimal_5
          org.apache.hadoop.hive.cli.TestMiniTezCliDriver.testCliDriver_vector_decimal_6
          org.apache.hadoop.hive.cli.TestMiniTezCliDriver.testCliDriver_vector_decimal_aggregate
          org.apache.hadoop.hive.cli.TestMiniTezCliDriver.testCliDriver_vector_decimal_cast
          org.apache.hadoop.hive.cli.TestMiniTezCliDriver.testCliDriver_vector_decimal_expressions
          org.apache.hadoop.hive.cli.TestMiniTezCliDriver.testCliDriver_vector_decimal_mapjoin
          org.apache.hadoop.hive.cli.TestMiniTezCliDriver.testCliDriver_vector_decimal_math_funcs
          org.apache.hadoop.hive.cli.TestMiniTezCliDriver.testCliDriver_vector_decimal_precision
          org.apache.hadoop.hive.cli.TestMiniTezCliDriver.testCliDriver_vector_decimal_round
          org.apache.hadoop.hive.cli.TestMiniTezCliDriver.testCliDriver_vector_decimal_round_2
          org.apache.hadoop.hive.cli.TestMiniTezCliDriver.testCliDriver_vector_decimal_trailing
          org.apache.hadoop.hive.cli.TestMiniTezCliDriver.testCliDriver_vector_decimal_udf
          org.apache.hadoop.hive.cli.TestMiniTezCliDriver.testCliDriver_vector_decimal_udf2
          org.apache.hadoop.hive.cli.TestMiniTezCliDriver.testCliDriver_vector_distinct_2
          org.apache.hadoop.hive.cli.TestMiniTezCliDriver.testCliDriver_vector_elt
          org.apache.hadoop.hive.cli.TestMiniTezCliDriver.testCliDriver_vector_groupby_3
          org.apache.hadoop.hive.cli.TestMiniTezCliDriver.testCliDriver_vector_groupby_mapjoin
          org.apache.hadoop.hive.cli.TestMiniTezCliDriver.testCliDriver_vector_groupby_reduce
          org.apache.hadoop.hive.cli.TestMiniTezCliDriver.testCliDriver_vector_grouping_sets
          org.apache.hadoop.hive.cli.TestMiniTezCliDriver.testCliDriver_vector_if_expr
          org.apache.hadoop.hive.cli.TestMiniTezCliDriver.testCliDriver_vector_inner_join
          org.apache.hadoop.hive.cli.TestMiniTezCliDriver.testCliDriver_vector_interval_1
          org.apache.hadoop.hive.cli.TestMiniTezCliDriver.testCliDriver_vector_interval_2
          org.apache.hadoop.hive.cli.TestMiniTezCliDriver.testCliDriver_vector_interval_arithmetic
          org.apache.hadoop.hive.cli.TestMiniTezCliDriver.testCliDriver_vector_interval_mapjoin
          org.apache.hadoop.hive.cli.TestMiniTezCliDriver.testCliDriver_vector_join30
          org.apache.hadoop.hive.cli.TestMiniTezCliDriver.testCliDriver_vector_join_filters
          org.apache.hadoop.hive.cli.TestMiniTezCliDriver.testCliDriver_vector_join_nulls
          org.apache.hadoop.hive.cli.TestMiniTezCliDriver.testCliDriver_vector_join_part_col_char
          org.apache.hadoop.hive.cli.TestMiniTezCliDriver.testCliDriver_vector_left_outer_join
          org.apache.hadoop.hive.cli.TestMiniTezCliDriver.testCliDriver_vector_left_outer_join2
          org.apache.hadoop.hive.cli.TestMiniTezCliDriver.testCliDriver_vector_leftsemi_mapjoin
          org.apache.hadoop.hive.cli.TestMiniTezCliDriver.testCliDriver_vector_mapjoin_reduce
          org.apache.hadoop.hive.cli.TestMiniTezCliDriver.testCliDriver_vector_mr_diff_schema_alias
          org.apache.hadoop.hive.cli.TestMiniTezCliDriver.testCliDriver_vector_multi_insert
          org.apache.hadoop.hive.cli.TestMiniTezCliDriver.testCliDriver_vector_non_string_partition
          org.apache.hadoop.hive.cli.TestMiniTezCliDriver.testCliDriver_vector_null_projection
          org.apache.hadoop.hive.cli.TestMiniTezCliDriver.testCliDriver_vector_nullsafe_join
          org.apache.hadoop.hive.cli.TestMiniTezCliDriver.testCliDriver_vector_nvl
          org.apache.hadoop.hive.cli.TestMiniTezCliDriver.testCliDriver_vector_orderby_5
          org.apache.hadoop.hive.cli.TestMiniTezCliDriver.testCliDriver_vector_outer_join0
          org.apache.hadoop.hive.cli.TestMiniTezCliDriver.testCliDriver_vector_outer_join1
          org.apache.hadoop.hive.cli.TestMiniTezCliDriver.testCliDriver_vector_outer_join2
          org.apache.hadoop.hive.cli.TestMiniTezCliDriver.testCliDriver_vector_outer_join3
          org.apache.hadoop.hive.cli.TestMiniTezCliDriver.testCliDriver_vector_outer_join4
          org.apache.hadoop.hive.cli.TestMiniTezCliDriver.testCliDriver_vector_outer_join5
          org.apache.hadoop.hive.cli.TestMiniTezCliDriver.testCliDriver_vector_outer_join6
          org.apache.hadoop.hive.cli.TestMiniTezCliDriver.testCliDriver_vector_partition_diff_num_cols
          org.apache.hadoop.hive.cli.TestMiniTezCliDriver.testCliDriver_vector_partitioned_date_time
          org.apache.hadoop.hive.cli.TestMiniTezCliDriver.testCliDriver_vector_reduce1
          org.apache.hadoop.hive.cli.TestMiniTezCliDriver.testCliDriver_vector_reduce2
          org.apache.hadoop.hive.cli.TestMiniTezCliDriver.testCliDriver_vector_reduce3
          org.apache.hadoop.hive.cli.TestMiniTezCliDriver.testCliDriver_vector_reduce_groupby_decimal
          org.apache.hadoop.hive.cli.TestMiniTezCliDriver.testCliDriver_vector_string_concat
          org.apache.hadoop.hive.cli.TestMiniTezCliDriver.testCliDriver_vector_struct_in
          org.apache.hadoop.hive.cli.TestMiniTezCliDriver.testCliDriver_vector_varchar_4
          org.apache.hadoop.hive.cli.TestMiniTezCliDriver.testCliDriver_vector_varchar_mapjoin1
          org.apache.hadoop.hive.cli.TestMiniTezCliDriver.testCliDriver_vector_varchar_simple
          org.apache.hadoop.hive.cli.TestMiniTezCliDriver.testCliDriver_vector_when_case_null
          org.apache.hadoop.hive.cli.TestMiniTezCliDriver.testCliDriver_vectorization_0
          org.apache.hadoop.hive.cli.TestMiniTezCliDriver.testCliDriver_vectorization_1
          org.apache.hadoop.hive.cli.TestMiniTezCliDriver.testCliDriver_vectorization_10
          org.apache.hadoop.hive.cli.TestMiniTezCliDriver.testCliDriver_vectorization_11
          org.apache.hadoop.hive.cli.TestMiniTezCliDriver.testCliDriver_vectorization_12
          org.apache.hadoop.hive.cli.TestMiniTezCliDriver.testCliDriver_vectorization_13
          org.apache.hadoop.hive.cli.TestMiniTezCliDriver.testCliDriver_vectorization_14
          org.apache.hadoop.hive.cli.TestMiniTezCliDriver.testCliDriver_vectorization_15
          org.apache.hadoop.hive.cli.TestMiniTezCliDriver.testCliDriver_vectorization_16
          org.apache.hadoop.hive.cli.TestMiniTezCliDriver.testCliDriver_vectorization_17
          org.apache.hadoop.hive.cli.TestMiniTezCliDriver.testCliDriver_vectorization_2
          org.apache.hadoop.hive.cli.TestMiniTezCliDriver.testCliDriver_vectorization_3
          org.apache.hadoop.hive.cli.TestMiniTezCliDriver.testCliDriver_vectorization_4
          org.apache.hadoop.hive.cli.TestMiniTezCliDriver.testCliDriver_vectorization_5
          org.apache.hadoop.hive.cli.TestMiniTezCliDriver.testCliDriver_vectorization_6
          org.apache.hadoop.hive.cli.TestMiniTezCliDriver.testCliDriver_vectorization_7
          org.apache.hadoop.hive.cli.TestMiniTezCliDriver.testCliDriver_vectorization_8
          org.apache.hadoop.hive.cli.TestMiniTezCliDriver.testCliDriver_vectorization_9
          org.apache.hadoop.hive.cli.TestMiniTezCliDriver.testCliDriver_vectorization_decimal_date
          org.apache.hadoop.hive.cli.TestMiniTezCliDriver.testCliDriver_vectorization_div0
          org.apache.hadoop.hive.cli.TestMiniTezCliDriver.testCliDriver_vectorization_limit
          org.apache.hadoop.hive.cli.TestMiniTezCliDriver.testCliDriver_vectorization_nested_udf
          org.apache.hadoop.hive.cli.TestMiniTezCliDriver.testCliDriver_vectorization_not
          org.apache.hadoop.hive.cli.TestMiniTezCliDriver.testCliDriver_vectorization_part
          org.apache.hadoop.hive.cli.TestMiniTezCliDriver.testCliDriver_vectorization_part_project
          org.apache.hadoop.hive.cli.TestMiniTezCliDriver.testCliDriver_vectorization_part_varchar
          org.apache.hadoop.hive.cli.TestMiniTezCliDriver.testCliDriver_vectorization_pushdown
          org.apache.hadoop.hive.cli.TestMiniTezCliDriver.testCliDriver_vectorization_short_regress
          org.apache.hadoop.hive.cli.TestMiniTezCliDriver.testCliDriver_vectorized_bucketmapjoin1
          org.apache.hadoop.hive.cli.TestMiniTezCliDriver.testCliDriver_vectorized_case
          org.apache.hadoop.hive.cli.TestMiniTezCliDriver.testCliDriver_vectorized_casts
          org.apache.hadoop.hive.cli.TestMiniTezCliDriver.testCliDriver_vectorized_context
          org.apache.hadoop.hive.cli.TestMiniTezCliDriver.testCliDriver_vectorized_date_funcs
          org.apache.hadoop.hive.cli.TestMiniTezCliDriver.testCliDriver_vectorized_distinct_gby
          org.apache.hadoop.hive.cli.TestMiniTezCliDriver.testCliDriver_vectorized_dynamic_partition_pruning
          org.apache.hadoop.hive.cli.TestMiniTezCliDriver.testCliDriver_vectorized_mapjoin
          org.apache.hadoop.hive.cli.TestMiniTezCliDriver.testCliDriver_vectorized_math_funcs
          org.apache.hadoop.hive.cli.TestMiniTezCliDriver.testCliDriver_vectorized_nested_mapjoin
          org.apache.hadoop.hive.cli.TestMiniTezCliDriver.testCliDriver_vectorized_parquet
          org.apache.hadoop.hive.cli.TestMiniTezCliDriver.testCliDriver_vectorized_parquet_types
          org.apache.hadoop.hive.cli.TestMiniTezCliDriver.testCliDriver_vectorized_ptf
          org.apache.hadoop.hive.cli.TestMiniTezCliDriver.testCliDriver_vectorized_rcfile_columnar
          org.apache.hadoop.hive.cli.TestMiniTezCliDriver.testCliDriver_vectorized_shufflejoin
          org.apache.hadoop.hive.cli.TestMiniTezCliDriver.testCliDriver_vectorized_string_funcs
          org.apache.hadoop.hive.cli.TestMiniTezCliDriver.testCliDriver_vectorized_timestamp
          org.apache.hadoop.hive.cli.TestMiniTezCliDriver.testCliDriver_vectorized_timestamp_funcs
          org.apache.hadoop.hive.cli.TestMiniTezCliDriver.testCliDriver_vectorized_timestamp_ints_casts
          org.apache.hadoop.hive.cli.TestMiniTezCliDriver.testCliDriver_windowing_gby
          org.apache.hive.service.cli.operation.TestOperationLoggingAPIWithMr.testFetchResultsOfLogAsync
          

          Test results: http://ec2-174-129-184-35.compute-1.amazonaws.com/jenkins/job/PreCommit-HIVE-TRUNK-Build/7540/testReport
          Console output: http://ec2-174-129-184-35.compute-1.amazonaws.com/jenkins/job/PreCommit-HIVE-TRUNK-Build/7540/console
          Test logs: http://ec2-174-129-184-35.compute-1.amazonaws.com/logs/PreCommit-HIVE-TRUNK-Build-7540/

          Messages:

          Executing org.apache.hive.ptest.execution.TestCheckPhase
          Executing org.apache.hive.ptest.execution.PrepPhase
          Executing org.apache.hive.ptest.execution.ExecutionPhase
          Executing org.apache.hive.ptest.execution.ReportingPhase
          Tests exited with: TestsFailedException: 374 tests failed
          

          This message is automatically generated.

          ATTACHMENT ID: 12797733 - PreCommit-HIVE-TRUNK-Build

          Show
          hiveqa Hive QA added a comment - Here are the results of testing the latest attachment: https://issues.apache.org/jira/secure/attachment/12797733/HIVE-13424.3.patch SUCCESS: +1 due to 14 test(s) being added or modified. ERROR: -1 due to 374 failed/errored test(s), 9983 tests executed Failed tests: org.apache.hadoop.hive.cli.TestMiniSparkOnYarnCliDriver.testCliDriver_index_bitmap3 org.apache.hadoop.hive.cli.TestMiniTezCliDriver.org.apache.hadoop.hive.cli.TestMiniTezCliDriver org.apache.hadoop.hive.cli.TestMiniTezCliDriver.testCliDriver_acid_globallimit org.apache.hadoop.hive.cli.TestMiniTezCliDriver.testCliDriver_alter_merge_2_orc org.apache.hadoop.hive.cli.TestMiniTezCliDriver.testCliDriver_alter_merge_orc org.apache.hadoop.hive.cli.TestMiniTezCliDriver.testCliDriver_alter_merge_stats_orc org.apache.hadoop.hive.cli.TestMiniTezCliDriver.testCliDriver_auto_join0 org.apache.hadoop.hive.cli.TestMiniTezCliDriver.testCliDriver_auto_join1 org.apache.hadoop.hive.cli.TestMiniTezCliDriver.testCliDriver_auto_join21 org.apache.hadoop.hive.cli.TestMiniTezCliDriver.testCliDriver_auto_join29 org.apache.hadoop.hive.cli.TestMiniTezCliDriver.testCliDriver_auto_join30 org.apache.hadoop.hive.cli.TestMiniTezCliDriver.testCliDriver_auto_join_filters org.apache.hadoop.hive.cli.TestMiniTezCliDriver.testCliDriver_auto_join_nulls org.apache.hadoop.hive.cli.TestMiniTezCliDriver.testCliDriver_auto_sortmerge_join_1 org.apache.hadoop.hive.cli.TestMiniTezCliDriver.testCliDriver_auto_sortmerge_join_10 org.apache.hadoop.hive.cli.TestMiniTezCliDriver.testCliDriver_auto_sortmerge_join_11 org.apache.hadoop.hive.cli.TestMiniTezCliDriver.testCliDriver_auto_sortmerge_join_12 org.apache.hadoop.hive.cli.TestMiniTezCliDriver.testCliDriver_auto_sortmerge_join_13 org.apache.hadoop.hive.cli.TestMiniTezCliDriver.testCliDriver_auto_sortmerge_join_14 org.apache.hadoop.hive.cli.TestMiniTezCliDriver.testCliDriver_auto_sortmerge_join_15 org.apache.hadoop.hive.cli.TestMiniTezCliDriver.testCliDriver_auto_sortmerge_join_16 org.apache.hadoop.hive.cli.TestMiniTezCliDriver.testCliDriver_auto_sortmerge_join_2 org.apache.hadoop.hive.cli.TestMiniTezCliDriver.testCliDriver_auto_sortmerge_join_3 org.apache.hadoop.hive.cli.TestMiniTezCliDriver.testCliDriver_auto_sortmerge_join_4 org.apache.hadoop.hive.cli.TestMiniTezCliDriver.testCliDriver_auto_sortmerge_join_5 org.apache.hadoop.hive.cli.TestMiniTezCliDriver.testCliDriver_auto_sortmerge_join_6 org.apache.hadoop.hive.cli.TestMiniTezCliDriver.testCliDriver_auto_sortmerge_join_7 org.apache.hadoop.hive.cli.TestMiniTezCliDriver.testCliDriver_auto_sortmerge_join_8 org.apache.hadoop.hive.cli.TestMiniTezCliDriver.testCliDriver_auto_sortmerge_join_9 org.apache.hadoop.hive.cli.TestMiniTezCliDriver.testCliDriver_bucket2 org.apache.hadoop.hive.cli.TestMiniTezCliDriver.testCliDriver_bucket3 org.apache.hadoop.hive.cli.TestMiniTezCliDriver.testCliDriver_bucket4 org.apache.hadoop.hive.cli.TestMiniTezCliDriver.testCliDriver_bucket_map_join_tez1 org.apache.hadoop.hive.cli.TestMiniTezCliDriver.testCliDriver_bucket_map_join_tez2 org.apache.hadoop.hive.cli.TestMiniTezCliDriver.testCliDriver_bucketpruning1 org.apache.hadoop.hive.cli.TestMiniTezCliDriver.testCliDriver_cbo_gby org.apache.hadoop.hive.cli.TestMiniTezCliDriver.testCliDriver_cbo_gby_empty org.apache.hadoop.hive.cli.TestMiniTezCliDriver.testCliDriver_cbo_join org.apache.hadoop.hive.cli.TestMiniTezCliDriver.testCliDriver_cbo_limit org.apache.hadoop.hive.cli.TestMiniTezCliDriver.testCliDriver_cbo_semijoin org.apache.hadoop.hive.cli.TestMiniTezCliDriver.testCliDriver_cbo_simple_select org.apache.hadoop.hive.cli.TestMiniTezCliDriver.testCliDriver_cbo_stats org.apache.hadoop.hive.cli.TestMiniTezCliDriver.testCliDriver_cbo_subq_exists org.apache.hadoop.hive.cli.TestMiniTezCliDriver.testCliDriver_cbo_subq_in org.apache.hadoop.hive.cli.TestMiniTezCliDriver.testCliDriver_cbo_subq_not_in org.apache.hadoop.hive.cli.TestMiniTezCliDriver.testCliDriver_cbo_udf_udaf org.apache.hadoop.hive.cli.TestMiniTezCliDriver.testCliDriver_cbo_union org.apache.hadoop.hive.cli.TestMiniTezCliDriver.testCliDriver_cbo_views org.apache.hadoop.hive.cli.TestMiniTezCliDriver.testCliDriver_cbo_windowing org.apache.hadoop.hive.cli.TestMiniTezCliDriver.testCliDriver_column_names_with_leading_and_trailing_spaces org.apache.hadoop.hive.cli.TestMiniTezCliDriver.testCliDriver_constprog_dpp org.apache.hadoop.hive.cli.TestMiniTezCliDriver.testCliDriver_constprog_semijoin org.apache.hadoop.hive.cli.TestMiniTezCliDriver.testCliDriver_correlationoptimizer1 org.apache.hadoop.hive.cli.TestMiniTezCliDriver.testCliDriver_count org.apache.hadoop.hive.cli.TestMiniTezCliDriver.testCliDriver_create_merge_compressed org.apache.hadoop.hive.cli.TestMiniTezCliDriver.testCliDriver_cross_join org.apache.hadoop.hive.cli.TestMiniTezCliDriver.testCliDriver_cross_product_check_1 org.apache.hadoop.hive.cli.TestMiniTezCliDriver.testCliDriver_cross_product_check_2 org.apache.hadoop.hive.cli.TestMiniTezCliDriver.testCliDriver_ctas org.apache.hadoop.hive.cli.TestMiniTezCliDriver.testCliDriver_cte_1 org.apache.hadoop.hive.cli.TestMiniTezCliDriver.testCliDriver_cte_2 org.apache.hadoop.hive.cli.TestMiniTezCliDriver.testCliDriver_cte_3 org.apache.hadoop.hive.cli.TestMiniTezCliDriver.testCliDriver_cte_4 org.apache.hadoop.hive.cli.TestMiniTezCliDriver.testCliDriver_cte_5 org.apache.hadoop.hive.cli.TestMiniTezCliDriver.testCliDriver_cte_mat_1 org.apache.hadoop.hive.cli.TestMiniTezCliDriver.testCliDriver_cte_mat_2 org.apache.hadoop.hive.cli.TestMiniTezCliDriver.testCliDriver_cte_mat_3 org.apache.hadoop.hive.cli.TestMiniTezCliDriver.testCliDriver_cte_mat_4 org.apache.hadoop.hive.cli.TestMiniTezCliDriver.testCliDriver_cte_mat_5 org.apache.hadoop.hive.cli.TestMiniTezCliDriver.testCliDriver_custom_input_output_format org.apache.hadoop.hive.cli.TestMiniTezCliDriver.testCliDriver_delete_all_non_partitioned org.apache.hadoop.hive.cli.TestMiniTezCliDriver.testCliDriver_delete_all_partitioned org.apache.hadoop.hive.cli.TestMiniTezCliDriver.testCliDriver_delete_orig_table org.apache.hadoop.hive.cli.TestMiniTezCliDriver.testCliDriver_delete_tmp_table org.apache.hadoop.hive.cli.TestMiniTezCliDriver.testCliDriver_delete_where_no_match org.apache.hadoop.hive.cli.TestMiniTezCliDriver.testCliDriver_delete_where_non_partitioned org.apache.hadoop.hive.cli.TestMiniTezCliDriver.testCliDriver_delete_where_partitioned org.apache.hadoop.hive.cli.TestMiniTezCliDriver.testCliDriver_delete_whole_partition org.apache.hadoop.hive.cli.TestMiniTezCliDriver.testCliDriver_disable_merge_for_bucketing org.apache.hadoop.hive.cli.TestMiniTezCliDriver.testCliDriver_dynamic_partition_pruning org.apache.hadoop.hive.cli.TestMiniTezCliDriver.testCliDriver_dynamic_partition_pruning_2 org.apache.hadoop.hive.cli.TestMiniTezCliDriver.testCliDriver_dynpart_sort_opt_vectorization org.apache.hadoop.hive.cli.TestMiniTezCliDriver.testCliDriver_dynpart_sort_optimization org.apache.hadoop.hive.cli.TestMiniTezCliDriver.testCliDriver_dynpart_sort_optimization2 org.apache.hadoop.hive.cli.TestMiniTezCliDriver.testCliDriver_empty_join org.apache.hadoop.hive.cli.TestMiniTezCliDriver.testCliDriver_enforce_order org.apache.hadoop.hive.cli.TestMiniTezCliDriver.testCliDriver_explainuser_1 org.apache.hadoop.hive.cli.TestMiniTezCliDriver.testCliDriver_explainuser_2 org.apache.hadoop.hive.cli.TestMiniTezCliDriver.testCliDriver_explainuser_3 org.apache.hadoop.hive.cli.TestMiniTezCliDriver.testCliDriver_explainuser_4 org.apache.hadoop.hive.cli.TestMiniTezCliDriver.testCliDriver_filter_join_breaktask org.apache.hadoop.hive.cli.TestMiniTezCliDriver.testCliDriver_filter_join_breaktask2 org.apache.hadoop.hive.cli.TestMiniTezCliDriver.testCliDriver_groupby1 org.apache.hadoop.hive.cli.TestMiniTezCliDriver.testCliDriver_groupby2 org.apache.hadoop.hive.cli.TestMiniTezCliDriver.testCliDriver_groupby3 org.apache.hadoop.hive.cli.TestMiniTezCliDriver.testCliDriver_having org.apache.hadoop.hive.cli.TestMiniTezCliDriver.testCliDriver_hybridgrace_hashjoin_1 org.apache.hadoop.hive.cli.TestMiniTezCliDriver.testCliDriver_hybridgrace_hashjoin_2 org.apache.hadoop.hive.cli.TestMiniTezCliDriver.testCliDriver_insert_into1 org.apache.hadoop.hive.cli.TestMiniTezCliDriver.testCliDriver_insert_into2 org.apache.hadoop.hive.cli.TestMiniTezCliDriver.testCliDriver_insert_orig_table org.apache.hadoop.hive.cli.TestMiniTezCliDriver.testCliDriver_insert_update_delete org.apache.hadoop.hive.cli.TestMiniTezCliDriver.testCliDriver_insert_values_dynamic_partitioned org.apache.hadoop.hive.cli.TestMiniTezCliDriver.testCliDriver_insert_values_non_partitioned org.apache.hadoop.hive.cli.TestMiniTezCliDriver.testCliDriver_insert_values_tmp_table org.apache.hadoop.hive.cli.TestMiniTezCliDriver.testCliDriver_join0 org.apache.hadoop.hive.cli.TestMiniTezCliDriver.testCliDriver_join1 org.apache.hadoop.hive.cli.TestMiniTezCliDriver.testCliDriver_join_nullsafe org.apache.hadoop.hive.cli.TestMiniTezCliDriver.testCliDriver_leftsemijoin org.apache.hadoop.hive.cli.TestMiniTezCliDriver.testCliDriver_limit_pushdown org.apache.hadoop.hive.cli.TestMiniTezCliDriver.testCliDriver_llap_nullscan org.apache.hadoop.hive.cli.TestMiniTezCliDriver.testCliDriver_llapdecider org.apache.hadoop.hive.cli.TestMiniTezCliDriver.testCliDriver_load_dyn_part1 org.apache.hadoop.hive.cli.TestMiniTezCliDriver.testCliDriver_load_dyn_part2 org.apache.hadoop.hive.cli.TestMiniTezCliDriver.testCliDriver_load_dyn_part3 org.apache.hadoop.hive.cli.TestMiniTezCliDriver.testCliDriver_lvj_mapjoin org.apache.hadoop.hive.cli.TestMiniTezCliDriver.testCliDriver_mapjoin_decimal org.apache.hadoop.hive.cli.TestMiniTezCliDriver.testCliDriver_mapjoin_mapjoin org.apache.hadoop.hive.cli.TestMiniTezCliDriver.testCliDriver_mapreduce1 org.apache.hadoop.hive.cli.TestMiniTezCliDriver.testCliDriver_mapreduce2 org.apache.hadoop.hive.cli.TestMiniTezCliDriver.testCliDriver_merge1 org.apache.hadoop.hive.cli.TestMiniTezCliDriver.testCliDriver_merge2 org.apache.hadoop.hive.cli.TestMiniTezCliDriver.testCliDriver_mergejoin org.apache.hadoop.hive.cli.TestMiniTezCliDriver.testCliDriver_mergejoin_3way org.apache.hadoop.hive.cli.TestMiniTezCliDriver.testCliDriver_metadata_only_queries org.apache.hadoop.hive.cli.TestMiniTezCliDriver.testCliDriver_metadata_only_queries_with_filters org.apache.hadoop.hive.cli.TestMiniTezCliDriver.testCliDriver_metadataonly1 org.apache.hadoop.hive.cli.TestMiniTezCliDriver.testCliDriver_mrr org.apache.hadoop.hive.cli.TestMiniTezCliDriver.testCliDriver_nonmr_fetch_threshold org.apache.hadoop.hive.cli.TestMiniTezCliDriver.testCliDriver_optimize_nullscan org.apache.hadoop.hive.cli.TestMiniTezCliDriver.testCliDriver_orc_analyze org.apache.hadoop.hive.cli.TestMiniTezCliDriver.testCliDriver_orc_merge1 org.apache.hadoop.hive.cli.TestMiniTezCliDriver.testCliDriver_orc_merge10 org.apache.hadoop.hive.cli.TestMiniTezCliDriver.testCliDriver_orc_merge11 org.apache.hadoop.hive.cli.TestMiniTezCliDriver.testCliDriver_orc_merge12 org.apache.hadoop.hive.cli.TestMiniTezCliDriver.testCliDriver_orc_merge2 org.apache.hadoop.hive.cli.TestMiniTezCliDriver.testCliDriver_orc_merge3 org.apache.hadoop.hive.cli.TestMiniTezCliDriver.testCliDriver_orc_merge4 org.apache.hadoop.hive.cli.TestMiniTezCliDriver.testCliDriver_orc_merge5 org.apache.hadoop.hive.cli.TestMiniTezCliDriver.testCliDriver_orc_merge6 org.apache.hadoop.hive.cli.TestMiniTezCliDriver.testCliDriver_orc_merge7 org.apache.hadoop.hive.cli.TestMiniTezCliDriver.testCliDriver_orc_merge8 org.apache.hadoop.hive.cli.TestMiniTezCliDriver.testCliDriver_orc_merge9 org.apache.hadoop.hive.cli.TestMiniTezCliDriver.testCliDriver_orc_merge_diff_fs org.apache.hadoop.hive.cli.TestMiniTezCliDriver.testCliDriver_orc_merge_incompat1 org.apache.hadoop.hive.cli.TestMiniTezCliDriver.testCliDriver_orc_merge_incompat2 org.apache.hadoop.hive.cli.TestMiniTezCliDriver.testCliDriver_orc_merge_incompat3 org.apache.hadoop.hive.cli.TestMiniTezCliDriver.testCliDriver_orc_ppd_basic org.apache.hadoop.hive.cli.TestMiniTezCliDriver.testCliDriver_orc_vectorization_ppd org.apache.hadoop.hive.cli.TestMiniTezCliDriver.testCliDriver_order_null org.apache.hadoop.hive.cli.TestMiniTezCliDriver.testCliDriver_parallel org.apache.hadoop.hive.cli.TestMiniTezCliDriver.testCliDriver_ptf org.apache.hadoop.hive.cli.TestMiniTezCliDriver.testCliDriver_ptf_matchpath org.apache.hadoop.hive.cli.TestMiniTezCliDriver.testCliDriver_ptf_streaming org.apache.hadoop.hive.cli.TestMiniTezCliDriver.testCliDriver_sample1 org.apache.hadoop.hive.cli.TestMiniTezCliDriver.testCliDriver_schema_evol_orc_acid_mapwork_part org.apache.hadoop.hive.cli.TestMiniTezCliDriver.testCliDriver_schema_evol_orc_acid_mapwork_table org.apache.hadoop.hive.cli.TestMiniTezCliDriver.testCliDriver_schema_evol_orc_acidvec_mapwork_part org.apache.hadoop.hive.cli.TestMiniTezCliDriver.testCliDriver_schema_evol_orc_acidvec_mapwork_table org.apache.hadoop.hive.cli.TestMiniTezCliDriver.testCliDriver_schema_evol_orc_nonvec_fetchwork_part org.apache.hadoop.hive.cli.TestMiniTezCliDriver.testCliDriver_schema_evol_orc_nonvec_fetchwork_table org.apache.hadoop.hive.cli.TestMiniTezCliDriver.testCliDriver_schema_evol_orc_nonvec_mapwork_part org.apache.hadoop.hive.cli.TestMiniTezCliDriver.testCliDriver_schema_evol_orc_nonvec_mapwork_table org.apache.hadoop.hive.cli.TestMiniTezCliDriver.testCliDriver_schema_evol_orc_vec_mapwork_part org.apache.hadoop.hive.cli.TestMiniTezCliDriver.testCliDriver_schema_evol_orc_vec_mapwork_table org.apache.hadoop.hive.cli.TestMiniTezCliDriver.testCliDriver_schema_evol_stats org.apache.hadoop.hive.cli.TestMiniTezCliDriver.testCliDriver_schema_evol_text_fetchwork_table org.apache.hadoop.hive.cli.TestMiniTezCliDriver.testCliDriver_schema_evol_text_mapwork_table org.apache.hadoop.hive.cli.TestMiniTezCliDriver.testCliDriver_schema_evol_text_nonvec_fetchwork_part org.apache.hadoop.hive.cli.TestMiniTezCliDriver.testCliDriver_schema_evol_text_nonvec_fetchwork_table org.apache.hadoop.hive.cli.TestMiniTezCliDriver.testCliDriver_schema_evol_text_nonvec_mapwork_part org.apache.hadoop.hive.cli.TestMiniTezCliDriver.testCliDriver_schema_evol_text_nonvec_mapwork_table org.apache.hadoop.hive.cli.TestMiniTezCliDriver.testCliDriver_script_env_var1 org.apache.hadoop.hive.cli.TestMiniTezCliDriver.testCliDriver_script_env_var2 org.apache.hadoop.hive.cli.TestMiniTezCliDriver.testCliDriver_script_pipe org.apache.hadoop.hive.cli.TestMiniTezCliDriver.testCliDriver_scriptfile1 org.apache.hadoop.hive.cli.TestMiniTezCliDriver.testCliDriver_selectDistinctStar org.apache.hadoop.hive.cli.TestMiniTezCliDriver.testCliDriver_select_dummy_source org.apache.hadoop.hive.cli.TestMiniTezCliDriver.testCliDriver_skewjoin org.apache.hadoop.hive.cli.TestMiniTezCliDriver.testCliDriver_smb_cache org.apache.hadoop.hive.cli.TestMiniTezCliDriver.testCliDriver_stats_filemetadata org.apache.hadoop.hive.cli.TestMiniTezCliDriver.testCliDriver_stats_noscan_1 org.apache.hadoop.hive.cli.TestMiniTezCliDriver.testCliDriver_stats_only_null org.apache.hadoop.hive.cli.TestMiniTezCliDriver.testCliDriver_subquery_exists org.apache.hadoop.hive.cli.TestMiniTezCliDriver.testCliDriver_subquery_in org.apache.hadoop.hive.cli.TestMiniTezCliDriver.testCliDriver_temp_table org.apache.hadoop.hive.cli.TestMiniTezCliDriver.testCliDriver_tez_bmj_schema_evolution org.apache.hadoop.hive.cli.TestMiniTezCliDriver.testCliDriver_tez_dml org.apache.hadoop.hive.cli.TestMiniTezCliDriver.testCliDriver_tez_dynpart_hashjoin_1 org.apache.hadoop.hive.cli.TestMiniTezCliDriver.testCliDriver_tez_dynpart_hashjoin_2 org.apache.hadoop.hive.cli.TestMiniTezCliDriver.testCliDriver_tez_dynpart_hashjoin_3 org.apache.hadoop.hive.cli.TestMiniTezCliDriver.testCliDriver_tez_fsstat org.apache.hadoop.hive.cli.TestMiniTezCliDriver.testCliDriver_tez_insert_overwrite_local_directory_1 org.apache.hadoop.hive.cli.TestMiniTezCliDriver.testCliDriver_tez_join org.apache.hadoop.hive.cli.TestMiniTezCliDriver.testCliDriver_tez_join_hash org.apache.hadoop.hive.cli.TestMiniTezCliDriver.testCliDriver_tez_join_result_complex org.apache.hadoop.hive.cli.TestMiniTezCliDriver.testCliDriver_tez_join_tests org.apache.hadoop.hive.cli.TestMiniTezCliDriver.testCliDriver_tez_joins_explain org.apache.hadoop.hive.cli.TestMiniTezCliDriver.testCliDriver_tez_multi_union org.apache.hadoop.hive.cli.TestMiniTezCliDriver.testCliDriver_tez_schema_evolution org.apache.hadoop.hive.cli.TestMiniTezCliDriver.testCliDriver_tez_self_join org.apache.hadoop.hive.cli.TestMiniTezCliDriver.testCliDriver_tez_smb_1 org.apache.hadoop.hive.cli.TestMiniTezCliDriver.testCliDriver_tez_smb_empty org.apache.hadoop.hive.cli.TestMiniTezCliDriver.testCliDriver_tez_smb_main org.apache.hadoop.hive.cli.TestMiniTezCliDriver.testCliDriver_tez_union org.apache.hadoop.hive.cli.TestMiniTezCliDriver.testCliDriver_tez_union2 org.apache.hadoop.hive.cli.TestMiniTezCliDriver.testCliDriver_tez_union_decimal org.apache.hadoop.hive.cli.TestMiniTezCliDriver.testCliDriver_tez_union_dynamic_partition org.apache.hadoop.hive.cli.TestMiniTezCliDriver.testCliDriver_tez_union_group_by org.apache.hadoop.hive.cli.TestMiniTezCliDriver.testCliDriver_tez_union_multiinsert org.apache.hadoop.hive.cli.TestMiniTezCliDriver.testCliDriver_tez_union_with_udf org.apache.hadoop.hive.cli.TestMiniTezCliDriver.testCliDriver_tez_vector_dynpart_hashjoin_1 org.apache.hadoop.hive.cli.TestMiniTezCliDriver.testCliDriver_tez_vector_dynpart_hashjoin_2 org.apache.hadoop.hive.cli.TestMiniTezCliDriver.testCliDriver_transform1 org.apache.hadoop.hive.cli.TestMiniTezCliDriver.testCliDriver_transform2 org.apache.hadoop.hive.cli.TestMiniTezCliDriver.testCliDriver_transform_ppr1 org.apache.hadoop.hive.cli.TestMiniTezCliDriver.testCliDriver_transform_ppr2 org.apache.hadoop.hive.cli.TestMiniTezCliDriver.testCliDriver_union2 org.apache.hadoop.hive.cli.TestMiniTezCliDriver.testCliDriver_union3 org.apache.hadoop.hive.cli.TestMiniTezCliDriver.testCliDriver_union4 org.apache.hadoop.hive.cli.TestMiniTezCliDriver.testCliDriver_union5 org.apache.hadoop.hive.cli.TestMiniTezCliDriver.testCliDriver_union6 org.apache.hadoop.hive.cli.TestMiniTezCliDriver.testCliDriver_union7 org.apache.hadoop.hive.cli.TestMiniTezCliDriver.testCliDriver_union8 org.apache.hadoop.hive.cli.TestMiniTezCliDriver.testCliDriver_union9 org.apache.hadoop.hive.cli.TestMiniTezCliDriver.testCliDriver_unionDistinct_1 org.apache.hadoop.hive.cli.TestMiniTezCliDriver.testCliDriver_unionDistinct_2 org.apache.hadoop.hive.cli.TestMiniTezCliDriver.testCliDriver_union_fast_stats org.apache.hadoop.hive.cli.TestMiniTezCliDriver.testCliDriver_union_type_chk org.apache.hadoop.hive.cli.TestMiniTezCliDriver.testCliDriver_update_after_multiple_inserts org.apache.hadoop.hive.cli.TestMiniTezCliDriver.testCliDriver_update_all_non_partitioned org.apache.hadoop.hive.cli.TestMiniTezCliDriver.testCliDriver_update_all_partitioned org.apache.hadoop.hive.cli.TestMiniTezCliDriver.testCliDriver_update_all_types org.apache.hadoop.hive.cli.TestMiniTezCliDriver.testCliDriver_update_orig_table org.apache.hadoop.hive.cli.TestMiniTezCliDriver.testCliDriver_update_tmp_table org.apache.hadoop.hive.cli.TestMiniTezCliDriver.testCliDriver_update_two_cols org.apache.hadoop.hive.cli.TestMiniTezCliDriver.testCliDriver_update_where_no_match org.apache.hadoop.hive.cli.TestMiniTezCliDriver.testCliDriver_update_where_non_partitioned org.apache.hadoop.hive.cli.TestMiniTezCliDriver.testCliDriver_update_where_partitioned org.apache.hadoop.hive.cli.TestMiniTezCliDriver.testCliDriver_vector_acid3 org.apache.hadoop.hive.cli.TestMiniTezCliDriver.testCliDriver_vector_aggregate_9 org.apache.hadoop.hive.cli.TestMiniTezCliDriver.testCliDriver_vector_aggregate_without_gby org.apache.hadoop.hive.cli.TestMiniTezCliDriver.testCliDriver_vector_auto_smb_mapjoin_14 org.apache.hadoop.hive.cli.TestMiniTezCliDriver.testCliDriver_vector_between_columns org.apache.hadoop.hive.cli.TestMiniTezCliDriver.testCliDriver_vector_between_in org.apache.hadoop.hive.cli.TestMiniTezCliDriver.testCliDriver_vector_binary_join_groupby org.apache.hadoop.hive.cli.TestMiniTezCliDriver.testCliDriver_vector_bround org.apache.hadoop.hive.cli.TestMiniTezCliDriver.testCliDriver_vector_bucket org.apache.hadoop.hive.cli.TestMiniTezCliDriver.testCliDriver_vector_cast_constant org.apache.hadoop.hive.cli.TestMiniTezCliDriver.testCliDriver_vector_char_2 org.apache.hadoop.hive.cli.TestMiniTezCliDriver.testCliDriver_vector_char_4 org.apache.hadoop.hive.cli.TestMiniTezCliDriver.testCliDriver_vector_char_cast org.apache.hadoop.hive.cli.TestMiniTezCliDriver.testCliDriver_vector_char_mapjoin1 org.apache.hadoop.hive.cli.TestMiniTezCliDriver.testCliDriver_vector_char_simple org.apache.hadoop.hive.cli.TestMiniTezCliDriver.testCliDriver_vector_coalesce org.apache.hadoop.hive.cli.TestMiniTezCliDriver.testCliDriver_vector_coalesce_2 org.apache.hadoop.hive.cli.TestMiniTezCliDriver.testCliDriver_vector_complex_all org.apache.hadoop.hive.cli.TestMiniTezCliDriver.testCliDriver_vector_complex_join org.apache.hadoop.hive.cli.TestMiniTezCliDriver.testCliDriver_vector_count_distinct org.apache.hadoop.hive.cli.TestMiniTezCliDriver.testCliDriver_vector_data_types org.apache.hadoop.hive.cli.TestMiniTezCliDriver.testCliDriver_vector_date_1 org.apache.hadoop.hive.cli.TestMiniTezCliDriver.testCliDriver_vector_decimal_1 org.apache.hadoop.hive.cli.TestMiniTezCliDriver.testCliDriver_vector_decimal_10_0 org.apache.hadoop.hive.cli.TestMiniTezCliDriver.testCliDriver_vector_decimal_2 org.apache.hadoop.hive.cli.TestMiniTezCliDriver.testCliDriver_vector_decimal_3 org.apache.hadoop.hive.cli.TestMiniTezCliDriver.testCliDriver_vector_decimal_4 org.apache.hadoop.hive.cli.TestMiniTezCliDriver.testCliDriver_vector_decimal_5 org.apache.hadoop.hive.cli.TestMiniTezCliDriver.testCliDriver_vector_decimal_6 org.apache.hadoop.hive.cli.TestMiniTezCliDriver.testCliDriver_vector_decimal_aggregate org.apache.hadoop.hive.cli.TestMiniTezCliDriver.testCliDriver_vector_decimal_cast org.apache.hadoop.hive.cli.TestMiniTezCliDriver.testCliDriver_vector_decimal_expressions org.apache.hadoop.hive.cli.TestMiniTezCliDriver.testCliDriver_vector_decimal_mapjoin org.apache.hadoop.hive.cli.TestMiniTezCliDriver.testCliDriver_vector_decimal_math_funcs org.apache.hadoop.hive.cli.TestMiniTezCliDriver.testCliDriver_vector_decimal_precision org.apache.hadoop.hive.cli.TestMiniTezCliDriver.testCliDriver_vector_decimal_round org.apache.hadoop.hive.cli.TestMiniTezCliDriver.testCliDriver_vector_decimal_round_2 org.apache.hadoop.hive.cli.TestMiniTezCliDriver.testCliDriver_vector_decimal_trailing org.apache.hadoop.hive.cli.TestMiniTezCliDriver.testCliDriver_vector_decimal_udf org.apache.hadoop.hive.cli.TestMiniTezCliDriver.testCliDriver_vector_decimal_udf2 org.apache.hadoop.hive.cli.TestMiniTezCliDriver.testCliDriver_vector_distinct_2 org.apache.hadoop.hive.cli.TestMiniTezCliDriver.testCliDriver_vector_elt org.apache.hadoop.hive.cli.TestMiniTezCliDriver.testCliDriver_vector_groupby_3 org.apache.hadoop.hive.cli.TestMiniTezCliDriver.testCliDriver_vector_groupby_mapjoin org.apache.hadoop.hive.cli.TestMiniTezCliDriver.testCliDriver_vector_groupby_reduce org.apache.hadoop.hive.cli.TestMiniTezCliDriver.testCliDriver_vector_grouping_sets org.apache.hadoop.hive.cli.TestMiniTezCliDriver.testCliDriver_vector_if_expr org.apache.hadoop.hive.cli.TestMiniTezCliDriver.testCliDriver_vector_inner_join org.apache.hadoop.hive.cli.TestMiniTezCliDriver.testCliDriver_vector_interval_1 org.apache.hadoop.hive.cli.TestMiniTezCliDriver.testCliDriver_vector_interval_2 org.apache.hadoop.hive.cli.TestMiniTezCliDriver.testCliDriver_vector_interval_arithmetic org.apache.hadoop.hive.cli.TestMiniTezCliDriver.testCliDriver_vector_interval_mapjoin org.apache.hadoop.hive.cli.TestMiniTezCliDriver.testCliDriver_vector_join30 org.apache.hadoop.hive.cli.TestMiniTezCliDriver.testCliDriver_vector_join_filters org.apache.hadoop.hive.cli.TestMiniTezCliDriver.testCliDriver_vector_join_nulls org.apache.hadoop.hive.cli.TestMiniTezCliDriver.testCliDriver_vector_join_part_col_char org.apache.hadoop.hive.cli.TestMiniTezCliDriver.testCliDriver_vector_left_outer_join org.apache.hadoop.hive.cli.TestMiniTezCliDriver.testCliDriver_vector_left_outer_join2 org.apache.hadoop.hive.cli.TestMiniTezCliDriver.testCliDriver_vector_leftsemi_mapjoin org.apache.hadoop.hive.cli.TestMiniTezCliDriver.testCliDriver_vector_mapjoin_reduce org.apache.hadoop.hive.cli.TestMiniTezCliDriver.testCliDriver_vector_mr_diff_schema_alias org.apache.hadoop.hive.cli.TestMiniTezCliDriver.testCliDriver_vector_multi_insert org.apache.hadoop.hive.cli.TestMiniTezCliDriver.testCliDriver_vector_non_string_partition org.apache.hadoop.hive.cli.TestMiniTezCliDriver.testCliDriver_vector_null_projection org.apache.hadoop.hive.cli.TestMiniTezCliDriver.testCliDriver_vector_nullsafe_join org.apache.hadoop.hive.cli.TestMiniTezCliDriver.testCliDriver_vector_nvl org.apache.hadoop.hive.cli.TestMiniTezCliDriver.testCliDriver_vector_orderby_5 org.apache.hadoop.hive.cli.TestMiniTezCliDriver.testCliDriver_vector_outer_join0 org.apache.hadoop.hive.cli.TestMiniTezCliDriver.testCliDriver_vector_outer_join1 org.apache.hadoop.hive.cli.TestMiniTezCliDriver.testCliDriver_vector_outer_join2 org.apache.hadoop.hive.cli.TestMiniTezCliDriver.testCliDriver_vector_outer_join3 org.apache.hadoop.hive.cli.TestMiniTezCliDriver.testCliDriver_vector_outer_join4 org.apache.hadoop.hive.cli.TestMiniTezCliDriver.testCliDriver_vector_outer_join5 org.apache.hadoop.hive.cli.TestMiniTezCliDriver.testCliDriver_vector_outer_join6 org.apache.hadoop.hive.cli.TestMiniTezCliDriver.testCliDriver_vector_partition_diff_num_cols org.apache.hadoop.hive.cli.TestMiniTezCliDriver.testCliDriver_vector_partitioned_date_time org.apache.hadoop.hive.cli.TestMiniTezCliDriver.testCliDriver_vector_reduce1 org.apache.hadoop.hive.cli.TestMiniTezCliDriver.testCliDriver_vector_reduce2 org.apache.hadoop.hive.cli.TestMiniTezCliDriver.testCliDriver_vector_reduce3 org.apache.hadoop.hive.cli.TestMiniTezCliDriver.testCliDriver_vector_reduce_groupby_decimal org.apache.hadoop.hive.cli.TestMiniTezCliDriver.testCliDriver_vector_string_concat org.apache.hadoop.hive.cli.TestMiniTezCliDriver.testCliDriver_vector_struct_in org.apache.hadoop.hive.cli.TestMiniTezCliDriver.testCliDriver_vector_varchar_4 org.apache.hadoop.hive.cli.TestMiniTezCliDriver.testCliDriver_vector_varchar_mapjoin1 org.apache.hadoop.hive.cli.TestMiniTezCliDriver.testCliDriver_vector_varchar_simple org.apache.hadoop.hive.cli.TestMiniTezCliDriver.testCliDriver_vector_when_case_null org.apache.hadoop.hive.cli.TestMiniTezCliDriver.testCliDriver_vectorization_0 org.apache.hadoop.hive.cli.TestMiniTezCliDriver.testCliDriver_vectorization_1 org.apache.hadoop.hive.cli.TestMiniTezCliDriver.testCliDriver_vectorization_10 org.apache.hadoop.hive.cli.TestMiniTezCliDriver.testCliDriver_vectorization_11 org.apache.hadoop.hive.cli.TestMiniTezCliDriver.testCliDriver_vectorization_12 org.apache.hadoop.hive.cli.TestMiniTezCliDriver.testCliDriver_vectorization_13 org.apache.hadoop.hive.cli.TestMiniTezCliDriver.testCliDriver_vectorization_14 org.apache.hadoop.hive.cli.TestMiniTezCliDriver.testCliDriver_vectorization_15 org.apache.hadoop.hive.cli.TestMiniTezCliDriver.testCliDriver_vectorization_16 org.apache.hadoop.hive.cli.TestMiniTezCliDriver.testCliDriver_vectorization_17 org.apache.hadoop.hive.cli.TestMiniTezCliDriver.testCliDriver_vectorization_2 org.apache.hadoop.hive.cli.TestMiniTezCliDriver.testCliDriver_vectorization_3 org.apache.hadoop.hive.cli.TestMiniTezCliDriver.testCliDriver_vectorization_4 org.apache.hadoop.hive.cli.TestMiniTezCliDriver.testCliDriver_vectorization_5 org.apache.hadoop.hive.cli.TestMiniTezCliDriver.testCliDriver_vectorization_6 org.apache.hadoop.hive.cli.TestMiniTezCliDriver.testCliDriver_vectorization_7 org.apache.hadoop.hive.cli.TestMiniTezCliDriver.testCliDriver_vectorization_8 org.apache.hadoop.hive.cli.TestMiniTezCliDriver.testCliDriver_vectorization_9 org.apache.hadoop.hive.cli.TestMiniTezCliDriver.testCliDriver_vectorization_decimal_date org.apache.hadoop.hive.cli.TestMiniTezCliDriver.testCliDriver_vectorization_div0 org.apache.hadoop.hive.cli.TestMiniTezCliDriver.testCliDriver_vectorization_limit org.apache.hadoop.hive.cli.TestMiniTezCliDriver.testCliDriver_vectorization_nested_udf org.apache.hadoop.hive.cli.TestMiniTezCliDriver.testCliDriver_vectorization_not org.apache.hadoop.hive.cli.TestMiniTezCliDriver.testCliDriver_vectorization_part org.apache.hadoop.hive.cli.TestMiniTezCliDriver.testCliDriver_vectorization_part_project org.apache.hadoop.hive.cli.TestMiniTezCliDriver.testCliDriver_vectorization_part_varchar org.apache.hadoop.hive.cli.TestMiniTezCliDriver.testCliDriver_vectorization_pushdown org.apache.hadoop.hive.cli.TestMiniTezCliDriver.testCliDriver_vectorization_short_regress org.apache.hadoop.hive.cli.TestMiniTezCliDriver.testCliDriver_vectorized_bucketmapjoin1 org.apache.hadoop.hive.cli.TestMiniTezCliDriver.testCliDriver_vectorized_case org.apache.hadoop.hive.cli.TestMiniTezCliDriver.testCliDriver_vectorized_casts org.apache.hadoop.hive.cli.TestMiniTezCliDriver.testCliDriver_vectorized_context org.apache.hadoop.hive.cli.TestMiniTezCliDriver.testCliDriver_vectorized_date_funcs org.apache.hadoop.hive.cli.TestMiniTezCliDriver.testCliDriver_vectorized_distinct_gby org.apache.hadoop.hive.cli.TestMiniTezCliDriver.testCliDriver_vectorized_dynamic_partition_pruning org.apache.hadoop.hive.cli.TestMiniTezCliDriver.testCliDriver_vectorized_mapjoin org.apache.hadoop.hive.cli.TestMiniTezCliDriver.testCliDriver_vectorized_math_funcs org.apache.hadoop.hive.cli.TestMiniTezCliDriver.testCliDriver_vectorized_nested_mapjoin org.apache.hadoop.hive.cli.TestMiniTezCliDriver.testCliDriver_vectorized_parquet org.apache.hadoop.hive.cli.TestMiniTezCliDriver.testCliDriver_vectorized_parquet_types org.apache.hadoop.hive.cli.TestMiniTezCliDriver.testCliDriver_vectorized_ptf org.apache.hadoop.hive.cli.TestMiniTezCliDriver.testCliDriver_vectorized_rcfile_columnar org.apache.hadoop.hive.cli.TestMiniTezCliDriver.testCliDriver_vectorized_shufflejoin org.apache.hadoop.hive.cli.TestMiniTezCliDriver.testCliDriver_vectorized_string_funcs org.apache.hadoop.hive.cli.TestMiniTezCliDriver.testCliDriver_vectorized_timestamp org.apache.hadoop.hive.cli.TestMiniTezCliDriver.testCliDriver_vectorized_timestamp_funcs org.apache.hadoop.hive.cli.TestMiniTezCliDriver.testCliDriver_vectorized_timestamp_ints_casts org.apache.hadoop.hive.cli.TestMiniTezCliDriver.testCliDriver_windowing_gby org.apache.hive.service.cli.operation.TestOperationLoggingAPIWithMr.testFetchResultsOfLogAsync Test results: http://ec2-174-129-184-35.compute-1.amazonaws.com/jenkins/job/PreCommit-HIVE-TRUNK-Build/7540/testReport Console output: http://ec2-174-129-184-35.compute-1.amazonaws.com/jenkins/job/PreCommit-HIVE-TRUNK-Build/7540/console Test logs: http://ec2-174-129-184-35.compute-1.amazonaws.com/logs/PreCommit-HIVE-TRUNK-Build-7540/ Messages: Executing org.apache.hive.ptest.execution.TestCheckPhase Executing org.apache.hive.ptest.execution.PrepPhase Executing org.apache.hive.ptest.execution.ExecutionPhase Executing org.apache.hive.ptest.execution.ReportingPhase Tests exited with: TestsFailedException: 374 tests failed This message is automatically generated. ATTACHMENT ID: 12797733 - PreCommit-HIVE-TRUNK-Build
          Hide
          aihuaxu Aihua Xu added a comment -

          Attached the patch-4: minor change which will always initializes queryState in the test to solve NPE issue.

          Show
          aihuaxu Aihua Xu added a comment - Attached the patch-4: minor change which will always initializes queryState in the test to solve NPE issue.
          Hide
          hiveqa Hive QA added a comment -

          Here are the results of testing the latest attachment:
          https://issues.apache.org/jira/secure/attachment/12798280/HIVE-13424.4.patch

          SUCCESS: +1 due to 14 test(s) being added or modified.

          ERROR: -1 due to 3 failed/errored test(s), 9974 tests executed
          Failed tests:

          TestJdbcWithMiniHS2 - did not produce a TEST-*.xml file
          org.apache.hadoop.hive.cli.TestMiniSparkOnYarnCliDriver.testCliDriver_index_bitmap3
          org.apache.hive.service.cli.operation.TestOperationLoggingAPIWithMr.testFetchResultsOfLogAsync
          

          Test results: http://ec2-174-129-184-35.compute-1.amazonaws.com/jenkins/job/PreCommit-HIVE-TRUNK-Build/7569/testReport
          Console output: http://ec2-174-129-184-35.compute-1.amazonaws.com/jenkins/job/PreCommit-HIVE-TRUNK-Build/7569/console
          Test logs: http://ec2-174-129-184-35.compute-1.amazonaws.com/logs/PreCommit-HIVE-TRUNK-Build-7569/

          Messages:

          Executing org.apache.hive.ptest.execution.TestCheckPhase
          Executing org.apache.hive.ptest.execution.PrepPhase
          Executing org.apache.hive.ptest.execution.ExecutionPhase
          Executing org.apache.hive.ptest.execution.ReportingPhase
          Tests exited with: TestsFailedException: 3 tests failed
          

          This message is automatically generated.

          ATTACHMENT ID: 12798280 - PreCommit-HIVE-TRUNK-Build

          Show
          hiveqa Hive QA added a comment - Here are the results of testing the latest attachment: https://issues.apache.org/jira/secure/attachment/12798280/HIVE-13424.4.patch SUCCESS: +1 due to 14 test(s) being added or modified. ERROR: -1 due to 3 failed/errored test(s), 9974 tests executed Failed tests: TestJdbcWithMiniHS2 - did not produce a TEST-*.xml file org.apache.hadoop.hive.cli.TestMiniSparkOnYarnCliDriver.testCliDriver_index_bitmap3 org.apache.hive.service.cli.operation.TestOperationLoggingAPIWithMr.testFetchResultsOfLogAsync Test results: http://ec2-174-129-184-35.compute-1.amazonaws.com/jenkins/job/PreCommit-HIVE-TRUNK-Build/7569/testReport Console output: http://ec2-174-129-184-35.compute-1.amazonaws.com/jenkins/job/PreCommit-HIVE-TRUNK-Build/7569/console Test logs: http://ec2-174-129-184-35.compute-1.amazonaws.com/logs/PreCommit-HIVE-TRUNK-Build-7569/ Messages: Executing org.apache.hive.ptest.execution.TestCheckPhase Executing org.apache.hive.ptest.execution.PrepPhase Executing org.apache.hive.ptest.execution.ExecutionPhase Executing org.apache.hive.ptest.execution.ReportingPhase Tests exited with: TestsFailedException: 3 tests failed This message is automatically generated. ATTACHMENT ID: 12798280 - PreCommit-HIVE-TRUNK-Build
          Hide
          aihuaxu Aihua Xu added a comment -

          Attached the patch 5: fixed the unit test which is caused by null confOverlay.

          Show
          aihuaxu Aihua Xu added a comment - Attached the patch 5: fixed the unit test which is caused by null confOverlay.
          Hide
          hiveqa Hive QA added a comment -

          Here are the results of testing the latest attachment:
          https://issues.apache.org/jira/secure/attachment/12798565/HIVE-13424.5.patch

          ERROR: -1 due to build exiting with an error

          Test results: http://ec2-174-129-184-35.compute-1.amazonaws.com/jenkins/job/PreCommit-HIVE-TRUNK-Build/7610/testReport
          Console output: http://ec2-174-129-184-35.compute-1.amazonaws.com/jenkins/job/PreCommit-HIVE-TRUNK-Build/7610/console
          Test logs: http://ec2-174-129-184-35.compute-1.amazonaws.com/logs/PreCommit-HIVE-TRUNK-Build-7610/

          Messages:

          **** This message was trimmed, see log for full details ****
          [INFO] 
          [INFO] --- maven-jar-plugin:2.2:test-jar (default) @ hive-service-rpc ---
          [INFO] Building jar: /data/hive-ptest/working/apache-github-source-source/service-rpc/target/hive-service-rpc-2.1.0-SNAPSHOT-tests.jar
          [INFO] 
          [INFO] --- maven-install-plugin:2.4:install (default-install) @ hive-service-rpc ---
          [INFO] Installing /data/hive-ptest/working/apache-github-source-source/service-rpc/target/hive-service-rpc-2.1.0-SNAPSHOT.jar to /data/hive-ptest/working/maven/org/apache/hive/hive-service-rpc/2.1.0-SNAPSHOT/hive-service-rpc-2.1.0-SNAPSHOT.jar
          [INFO] Installing /data/hive-ptest/working/apache-github-source-source/service-rpc/pom.xml to /data/hive-ptest/working/maven/org/apache/hive/hive-service-rpc/2.1.0-SNAPSHOT/hive-service-rpc-2.1.0-SNAPSHOT.pom
          [INFO] Installing /data/hive-ptest/working/apache-github-source-source/service-rpc/target/hive-service-rpc-2.1.0-SNAPSHOT-tests.jar to /data/hive-ptest/working/maven/org/apache/hive/hive-service-rpc/2.1.0-SNAPSHOT/hive-service-rpc-2.1.0-SNAPSHOT-tests.jar
          [INFO]                                                                         
          [INFO] ------------------------------------------------------------------------
          [INFO] Building Spark Remote Client 2.1.0-SNAPSHOT
          [INFO] ------------------------------------------------------------------------
          [INFO] 
          [INFO] --- maven-clean-plugin:2.5:clean (default-clean) @ spark-client ---
          [INFO] Deleting /data/hive-ptest/working/apache-github-source-source/spark-client/target
          [INFO] Deleting /data/hive-ptest/working/apache-github-source-source/spark-client (includes = [datanucleus.log, derby.log], excludes = [])
          [INFO] 
          [INFO] --- maven-enforcer-plugin:1.3.1:enforce (enforce-no-snapshots) @ spark-client ---
          [INFO] 
          [INFO] --- maven-remote-resources-plugin:1.5:process (default) @ spark-client ---
          [INFO] 
          [INFO] --- maven-resources-plugin:2.6:resources (default-resources) @ spark-client ---
          [INFO] Using 'UTF-8' encoding to copy filtered resources.
          [INFO] skip non existing resourceDirectory /data/hive-ptest/working/apache-github-source-source/spark-client/src/main/resources
          [INFO] Copying 3 resources
          [INFO] 
          [INFO] --- maven-antrun-plugin:1.7:run (define-classpath) @ spark-client ---
          [INFO] Executing tasks
          
          main:
          [INFO] Executed tasks
          [INFO] 
          [INFO] --- maven-compiler-plugin:3.1:compile (default-compile) @ spark-client ---
          [INFO] Compiling 28 source files to /data/hive-ptest/working/apache-github-source-source/spark-client/target/classes
          [WARNING] /data/hive-ptest/working/apache-github-source-source/spark-client/src/main/java/org/apache/hive/spark/client/SparkClientUtilities.java: /data/hive-ptest/working/apache-github-source-source/spark-client/src/main/java/org/apache/hive/spark/client/SparkClientUtilities.java uses or overrides a deprecated API.
          [WARNING] /data/hive-ptest/working/apache-github-source-source/spark-client/src/main/java/org/apache/hive/spark/client/SparkClientUtilities.java: Recompile with -Xlint:deprecation for details.
          [WARNING] /data/hive-ptest/working/apache-github-source-source/spark-client/src/main/java/org/apache/hive/spark/client/rpc/RpcDispatcher.java: Some input files use unchecked or unsafe operations.
          [WARNING] /data/hive-ptest/working/apache-github-source-source/spark-client/src/main/java/org/apache/hive/spark/client/rpc/RpcDispatcher.java: Recompile with -Xlint:unchecked for details.
          [INFO] 
          [INFO] --- maven-resources-plugin:2.6:testResources (default-testResources) @ spark-client ---
          [INFO] Using 'UTF-8' encoding to copy filtered resources.
          [INFO] Copying 1 resource
          [INFO] Copying 3 resources
          [INFO] 
          [INFO] --- maven-antrun-plugin:1.7:run (setup-test-dirs) @ spark-client ---
          [INFO] Executing tasks
          
          main:
              [mkdir] Created dir: /data/hive-ptest/working/apache-github-source-source/spark-client/target/tmp
              [mkdir] Created dir: /data/hive-ptest/working/apache-github-source-source/spark-client/target/warehouse
              [mkdir] Created dir: /data/hive-ptest/working/apache-github-source-source/spark-client/target/tmp/conf
               [copy] Copying 15 files to /data/hive-ptest/working/apache-github-source-source/spark-client/target/tmp/conf
          [INFO] Executed tasks
          [INFO] 
          [INFO] --- maven-compiler-plugin:3.1:testCompile (default-testCompile) @ spark-client ---
          [INFO] Compiling 5 source files to /data/hive-ptest/working/apache-github-source-source/spark-client/target/test-classes
          [INFO] 
          [INFO] --- maven-dependency-plugin:2.8:copy (copy-guava-14) @ spark-client ---
          [INFO] Configured Artifact: com.google.guava:guava:14.0.1:jar
          [INFO] Copying guava-14.0.1.jar to /data/hive-ptest/working/apache-github-source-source/spark-client/target/dependency/guava-14.0.1.jar
          [INFO] 
          [INFO] --- maven-surefire-plugin:2.16:test (default-test) @ spark-client ---
          [INFO] Tests are skipped.
          [INFO] 
          [INFO] --- maven-jar-plugin:2.2:jar (default-jar) @ spark-client ---
          [INFO] Building jar: /data/hive-ptest/working/apache-github-source-source/spark-client/target/spark-client-2.1.0-SNAPSHOT.jar
          [INFO] 
          [INFO] --- maven-site-plugin:3.3:attach-descriptor (attach-descriptor) @ spark-client ---
          [INFO] 
          [INFO] --- maven-install-plugin:2.4:install (default-install) @ spark-client ---
          [INFO] Installing /data/hive-ptest/working/apache-github-source-source/spark-client/target/spark-client-2.1.0-SNAPSHOT.jar to /data/hive-ptest/working/maven/org/apache/hive/spark-client/2.1.0-SNAPSHOT/spark-client-2.1.0-SNAPSHOT.jar
          [INFO] Installing /data/hive-ptest/working/apache-github-source-source/spark-client/pom.xml to /data/hive-ptest/working/maven/org/apache/hive/spark-client/2.1.0-SNAPSHOT/spark-client-2.1.0-SNAPSHOT.pom
          [INFO]                                                                         
          [INFO] ------------------------------------------------------------------------
          [INFO] Building Hive Query Language 2.1.0-SNAPSHOT
          [INFO] ------------------------------------------------------------------------
          [INFO] 
          [INFO] --- maven-clean-plugin:2.5:clean (default-clean) @ hive-exec ---
          [INFO] Deleting /data/hive-ptest/working/apache-github-source-source/ql/target
          [INFO] Deleting /data/hive-ptest/working/apache-github-source-source/ql (includes = [datanucleus.log, derby.log], excludes = [])
          [INFO] 
          [INFO] --- maven-enforcer-plugin:1.3.1:enforce (enforce-no-snapshots) @ hive-exec ---
          [INFO] 
          [INFO] --- maven-antrun-plugin:1.7:run (generate-sources) @ hive-exec ---
          [INFO] Executing tasks
          
          main:
              [mkdir] Created dir: /data/hive-ptest/working/apache-github-source-source/ql/target/generated-sources/java/org/apache/hadoop/hive/ql/exec/vector/expressions/gen
              [mkdir] Created dir: /data/hive-ptest/working/apache-github-source-source/ql/target/generated-sources/java/org/apache/hadoop/hive/ql/exec/vector/expressions/aggregates/gen
              [mkdir] Created dir: /data/hive-ptest/working/apache-github-source-source/ql/target/generated-test-sources/java/org/apache/hadoop/hive/ql/exec/vector/expressions/gen
          Generating vector expression code
          Generating vector expression test code
          [INFO] Executed tasks
          [INFO] 
          [INFO] --- build-helper-maven-plugin:1.8:add-source (add-source) @ hive-exec ---
          [INFO] Source directory: /data/hive-ptest/working/apache-github-source-source/ql/src/gen/thrift/gen-javabean added.
          [INFO] Source directory: /data/hive-ptest/working/apache-github-source-source/ql/target/generated-sources/java added.
          [INFO] 
          [INFO] --- antlr3-maven-plugin:3.4:antlr (default) @ hive-exec ---
          [INFO] ANTLR: Processing source directory /data/hive-ptest/working/apache-github-source-source/ql/src/java
          ANTLR Parser Generator  Version 3.4
          org/apache/hadoop/hive/ql/parse/HiveLexer.g
          org/apache/hadoop/hive/ql/parse/HiveParser.g
          [INFO] 
          [INFO] --- maven-remote-resources-plugin:1.5:process (default) @ hive-exec ---
          [INFO] 
          [INFO] --- maven-resources-plugin:2.6:resources (default-resources) @ hive-exec ---
          [INFO] Using 'UTF-8' encoding to copy filtered resources.
          [INFO] Copying 4 resources
          [INFO] Copying 3 resources
          [INFO] 
          [INFO] --- maven-antrun-plugin:1.7:run (define-classpath) @ hive-exec ---
          [INFO] Executing tasks
          
          main:
          [INFO] Executed tasks
          [INFO] 
          [INFO] --- maven-compiler-plugin:3.1:compile (default-compile) @ hive-exec ---
          [INFO] Compiling 2626 source files to /data/hive-ptest/working/apache-github-source-source/ql/target/classes
          [INFO] -------------------------------------------------------------
          [WARNING] COMPILATION WARNING : 
          [INFO] -------------------------------------------------------------
          [WARNING] /data/hive-ptest/working/apache-github-source-source/ql/src/java/org/apache/hadoop/hive/ql/parse/spark/SparkPartitionPruningSinkOperator.java: Some input files use or override a deprecated API.
          [WARNING] /data/hive-ptest/working/apache-github-source-source/ql/src/java/org/apache/hadoop/hive/ql/parse/spark/SparkPartitionPruningSinkOperator.java: Recompile with -Xlint:deprecation for details.
          [WARNING] /data/hive-ptest/working/apache-github-source-source/ql/src/java/org/apache/hadoop/hive/ql/metadata/Table.java: Some input files use unchecked or unsafe operations.
          [WARNING] /data/hive-ptest/working/apache-github-source-source/ql/src/java/org/apache/hadoop/hive/ql/metadata/Table.java: Recompile with -Xlint:unchecked for details.
          [INFO] 4 warnings 
          [INFO] -------------------------------------------------------------
          [INFO] -------------------------------------------------------------
          [ERROR] COMPILATION ERROR : 
          [INFO] -------------------------------------------------------------
          [ERROR] /data/hive-ptest/working/apache-github-source-source/ql/src/java/org/apache/hadoop/hive/ql/session/SessionState.java:[543,36] cannot find symbol
            symbol:   variable conf
            location: variable startSs of type org.apache.hadoop.hive.ql.session.SessionState
          [INFO] 1 error
          [INFO] -------------------------------------------------------------
          [INFO] ------------------------------------------------------------------------
          [INFO] Reactor Summary:
          [INFO] 
          [INFO] Hive .............................................. SUCCESS [12.851s]
          [INFO] Hive Shims Common ................................. SUCCESS [16.380s]
          [INFO] Hive Shims 0.23 ................................... SUCCESS [13.297s]
          [INFO] Hive Shims Scheduler .............................. SUCCESS [3.917s]
          [INFO] Hive Shims ........................................ SUCCESS [2.707s]
          [INFO] Hive Storage API .................................. SUCCESS [6.372s]
          [INFO] Hive ORC .......................................... SUCCESS [12.667s]
          [INFO] Hive Common ....................................... SUCCESS [26.664s]
          [INFO] Hive Serde ........................................ SUCCESS [15.283s]
          [INFO] Hive Metastore .................................... SUCCESS [53.776s]
          [INFO] Hive Ant Utilities ................................ SUCCESS [1.759s]
          [INFO] Hive Llap Common .................................. SUCCESS [18.254s]
          [INFO] Hive Llap Client .................................. SUCCESS [9.547s]
          [INFO] Hive Llap Tez ..................................... SUCCESS [13.826s]
          [INFO] Hive Service RPC .................................. SUCCESS [8.810s]
          [INFO] Spark Remote Client ............................... SUCCESS [15.579s]
          [INFO] Hive Query Language ............................... FAILURE [1:07.698s]
          [INFO] Hive Service ...................................... SKIPPED
          [INFO] Hive Accumulo Handler ............................. SKIPPED
          [INFO] Hive JDBC ......................................... SKIPPED
          [INFO] Hive Beeline ...................................... SKIPPED
          [INFO] Hive CLI .......................................... SKIPPED
          [INFO] Hive Contrib ...................................... SKIPPED
          [INFO] Hive HBase Handler ................................ SKIPPED
          [INFO] Hive HCatalog ..................................... SKIPPED
          [INFO] Hive HCatalog Core ................................ SKIPPED
          [INFO] Hive HCatalog Pig Adapter ......................... SKIPPED
          [INFO] Hive HCatalog Server Extensions ................... SKIPPED
          [INFO] Hive HCatalog Webhcat Java Client ................. SKIPPED
          [INFO] Hive HCatalog Webhcat ............................. SKIPPED
          [INFO] Hive HCatalog Streaming ........................... SKIPPED
          [INFO] Hive HPL/SQL ...................................... SKIPPED
          [INFO] Hive HWI .......................................... SKIPPED
          [INFO] Hive Llap Server .................................. SKIPPED
          [INFO] Hive Shims Aggregator ............................. SKIPPED
          [INFO] Hive TestUtils .................................... SKIPPED
          [INFO] Hive Packaging .................................... SKIPPED
          [INFO] ------------------------------------------------------------------------
          [INFO] BUILD FAILURE
          [INFO] ------------------------------------------------------------------------
          [INFO] Total time: 5:02.731s
          [INFO] Finished at: Fri Apr 15 19:52:55 EDT 2016
          [INFO] Final Memory: 133M/1144M
          [INFO] ------------------------------------------------------------------------
          [WARNING] The requested profile "hadoop-2" could not be activated because it does not exist.
          [ERROR] Failed to execute goal org.apache.maven.plugins:maven-compiler-plugin:3.1:compile (default-compile) on project hive-exec: Compilation failure
          [ERROR] /data/hive-ptest/working/apache-github-source-source/ql/src/java/org/apache/hadoop/hive/ql/session/SessionState.java:[543,36] cannot find symbol
          [ERROR] symbol:   variable conf
          [ERROR] location: variable startSs of type org.apache.hadoop.hive.ql.session.SessionState
          [ERROR] -> [Help 1]
          [ERROR] 
          [ERROR] To see the full stack trace of the errors, re-run Maven with the -e switch.
          [ERROR] Re-run Maven using the -X switch to enable full debug logging.
          [ERROR] 
          [ERROR] For more information about the errors and possible solutions, please read the following articles:
          [ERROR] [Help 1] http://cwiki.apache.org/confluence/display/MAVEN/MojoFailureException
          [ERROR] 
          [ERROR] After correcting the problems, you can resume the build with the command
          [ERROR]   mvn <goals> -rf :hive-exec
          + exit 1
          '
          

          This message is automatically generated.

          ATTACHMENT ID: 12798565 - PreCommit-HIVE-TRUNK-Build

          Show
          hiveqa Hive QA added a comment - Here are the results of testing the latest attachment: https://issues.apache.org/jira/secure/attachment/12798565/HIVE-13424.5.patch ERROR: -1 due to build exiting with an error Test results: http://ec2-174-129-184-35.compute-1.amazonaws.com/jenkins/job/PreCommit-HIVE-TRUNK-Build/7610/testReport Console output: http://ec2-174-129-184-35.compute-1.amazonaws.com/jenkins/job/PreCommit-HIVE-TRUNK-Build/7610/console Test logs: http://ec2-174-129-184-35.compute-1.amazonaws.com/logs/PreCommit-HIVE-TRUNK-Build-7610/ Messages: **** This message was trimmed, see log for full details **** [INFO] [INFO] --- maven-jar-plugin:2.2:test-jar (default) @ hive-service-rpc --- [INFO] Building jar: /data/hive-ptest/working/apache-github-source-source/service-rpc/target/hive-service-rpc-2.1.0-SNAPSHOT-tests.jar [INFO] [INFO] --- maven-install-plugin:2.4:install (default-install) @ hive-service-rpc --- [INFO] Installing /data/hive-ptest/working/apache-github-source-source/service-rpc/target/hive-service-rpc-2.1.0-SNAPSHOT.jar to /data/hive-ptest/working/maven/org/apache/hive/hive-service-rpc/2.1.0-SNAPSHOT/hive-service-rpc-2.1.0-SNAPSHOT.jar [INFO] Installing /data/hive-ptest/working/apache-github-source-source/service-rpc/pom.xml to /data/hive-ptest/working/maven/org/apache/hive/hive-service-rpc/2.1.0-SNAPSHOT/hive-service-rpc-2.1.0-SNAPSHOT.pom [INFO] Installing /data/hive-ptest/working/apache-github-source-source/service-rpc/target/hive-service-rpc-2.1.0-SNAPSHOT-tests.jar to /data/hive-ptest/working/maven/org/apache/hive/hive-service-rpc/2.1.0-SNAPSHOT/hive-service-rpc-2.1.0-SNAPSHOT-tests.jar [INFO] [INFO] ------------------------------------------------------------------------ [INFO] Building Spark Remote Client 2.1.0-SNAPSHOT [INFO] ------------------------------------------------------------------------ [INFO] [INFO] --- maven-clean-plugin:2.5:clean (default-clean) @ spark-client --- [INFO] Deleting /data/hive-ptest/working/apache-github-source-source/spark-client/target [INFO] Deleting /data/hive-ptest/working/apache-github-source-source/spark-client (includes = [datanucleus.log, derby.log], excludes = []) [INFO] [INFO] --- maven-enforcer-plugin:1.3.1:enforce (enforce-no-snapshots) @ spark-client --- [INFO] [INFO] --- maven-remote-resources-plugin:1.5:process (default) @ spark-client --- [INFO] [INFO] --- maven-resources-plugin:2.6:resources (default-resources) @ spark-client --- [INFO] Using 'UTF-8' encoding to copy filtered resources. [INFO] skip non existing resourceDirectory /data/hive-ptest/working/apache-github-source-source/spark-client/src/main/resources [INFO] Copying 3 resources [INFO] [INFO] --- maven-antrun-plugin:1.7:run (define-classpath) @ spark-client --- [INFO] Executing tasks main: [INFO] Executed tasks [INFO] [INFO] --- maven-compiler-plugin:3.1:compile (default-compile) @ spark-client --- [INFO] Compiling 28 source files to /data/hive-ptest/working/apache-github-source-source/spark-client/target/classes [WARNING] /data/hive-ptest/working/apache-github-source-source/spark-client/src/main/java/org/apache/hive/spark/client/SparkClientUtilities.java: /data/hive-ptest/working/apache-github-source-source/spark-client/src/main/java/org/apache/hive/spark/client/SparkClientUtilities.java uses or overrides a deprecated API. [WARNING] /data/hive-ptest/working/apache-github-source-source/spark-client/src/main/java/org/apache/hive/spark/client/SparkClientUtilities.java: Recompile with -Xlint:deprecation for details. [WARNING] /data/hive-ptest/working/apache-github-source-source/spark-client/src/main/java/org/apache/hive/spark/client/rpc/RpcDispatcher.java: Some input files use unchecked or unsafe operations. [WARNING] /data/hive-ptest/working/apache-github-source-source/spark-client/src/main/java/org/apache/hive/spark/client/rpc/RpcDispatcher.java: Recompile with -Xlint:unchecked for details. [INFO] [INFO] --- maven-resources-plugin:2.6:testResources (default-testResources) @ spark-client --- [INFO] Using 'UTF-8' encoding to copy filtered resources. [INFO] Copying 1 resource [INFO] Copying 3 resources [INFO] [INFO] --- maven-antrun-plugin:1.7:run (setup-test-dirs) @ spark-client --- [INFO] Executing tasks main: [mkdir] Created dir: /data/hive-ptest/working/apache-github-source-source/spark-client/target/tmp [mkdir] Created dir: /data/hive-ptest/working/apache-github-source-source/spark-client/target/warehouse [mkdir] Created dir: /data/hive-ptest/working/apache-github-source-source/spark-client/target/tmp/conf [copy] Copying 15 files to /data/hive-ptest/working/apache-github-source-source/spark-client/target/tmp/conf [INFO] Executed tasks [INFO] [INFO] --- maven-compiler-plugin:3.1:testCompile (default-testCompile) @ spark-client --- [INFO] Compiling 5 source files to /data/hive-ptest/working/apache-github-source-source/spark-client/target/test-classes [INFO] [INFO] --- maven-dependency-plugin:2.8:copy (copy-guava-14) @ spark-client --- [INFO] Configured Artifact: com.google.guava:guava:14.0.1:jar [INFO] Copying guava-14.0.1.jar to /data/hive-ptest/working/apache-github-source-source/spark-client/target/dependency/guava-14.0.1.jar [INFO] [INFO] --- maven-surefire-plugin:2.16:test (default-test) @ spark-client --- [INFO] Tests are skipped. [INFO] [INFO] --- maven-jar-plugin:2.2:jar (default-jar) @ spark-client --- [INFO] Building jar: /data/hive-ptest/working/apache-github-source-source/spark-client/target/spark-client-2.1.0-SNAPSHOT.jar [INFO] [INFO] --- maven-site-plugin:3.3:attach-descriptor (attach-descriptor) @ spark-client --- [INFO] [INFO] --- maven-install-plugin:2.4:install (default-install) @ spark-client --- [INFO] Installing /data/hive-ptest/working/apache-github-source-source/spark-client/target/spark-client-2.1.0-SNAPSHOT.jar to /data/hive-ptest/working/maven/org/apache/hive/spark-client/2.1.0-SNAPSHOT/spark-client-2.1.0-SNAPSHOT.jar [INFO] Installing /data/hive-ptest/working/apache-github-source-source/spark-client/pom.xml to /data/hive-ptest/working/maven/org/apache/hive/spark-client/2.1.0-SNAPSHOT/spark-client-2.1.0-SNAPSHOT.pom [INFO] [INFO] ------------------------------------------------------------------------ [INFO] Building Hive Query Language 2.1.0-SNAPSHOT [INFO] ------------------------------------------------------------------------ [INFO] [INFO] --- maven-clean-plugin:2.5:clean (default-clean) @ hive-exec --- [INFO] Deleting /data/hive-ptest/working/apache-github-source-source/ql/target [INFO] Deleting /data/hive-ptest/working/apache-github-source-source/ql (includes = [datanucleus.log, derby.log], excludes = []) [INFO] [INFO] --- maven-enforcer-plugin:1.3.1:enforce (enforce-no-snapshots) @ hive-exec --- [INFO] [INFO] --- maven-antrun-plugin:1.7:run (generate-sources) @ hive-exec --- [INFO] Executing tasks main: [mkdir] Created dir: /data/hive-ptest/working/apache-github-source-source/ql/target/generated-sources/java/org/apache/hadoop/hive/ql/exec/vector/expressions/gen [mkdir] Created dir: /data/hive-ptest/working/apache-github-source-source/ql/target/generated-sources/java/org/apache/hadoop/hive/ql/exec/vector/expressions/aggregates/gen [mkdir] Created dir: /data/hive-ptest/working/apache-github-source-source/ql/target/generated-test-sources/java/org/apache/hadoop/hive/ql/exec/vector/expressions/gen Generating vector expression code Generating vector expression test code [INFO] Executed tasks [INFO] [INFO] --- build-helper-maven-plugin:1.8:add-source (add-source) @ hive-exec --- [INFO] Source directory: /data/hive-ptest/working/apache-github-source-source/ql/src/gen/thrift/gen-javabean added. [INFO] Source directory: /data/hive-ptest/working/apache-github-source-source/ql/target/generated-sources/java added. [INFO] [INFO] --- antlr3-maven-plugin:3.4:antlr (default) @ hive-exec --- [INFO] ANTLR: Processing source directory /data/hive-ptest/working/apache-github-source-source/ql/src/java ANTLR Parser Generator Version 3.4 org/apache/hadoop/hive/ql/parse/HiveLexer.g org/apache/hadoop/hive/ql/parse/HiveParser.g [INFO] [INFO] --- maven-remote-resources-plugin:1.5:process (default) @ hive-exec --- [INFO] [INFO] --- maven-resources-plugin:2.6:resources (default-resources) @ hive-exec --- [INFO] Using 'UTF-8' encoding to copy filtered resources. [INFO] Copying 4 resources [INFO] Copying 3 resources [INFO] [INFO] --- maven-antrun-plugin:1.7:run (define-classpath) @ hive-exec --- [INFO] Executing tasks main: [INFO] Executed tasks [INFO] [INFO] --- maven-compiler-plugin:3.1:compile (default-compile) @ hive-exec --- [INFO] Compiling 2626 source files to /data/hive-ptest/working/apache-github-source-source/ql/target/classes [INFO] ------------------------------------------------------------- [WARNING] COMPILATION WARNING : [INFO] ------------------------------------------------------------- [WARNING] /data/hive-ptest/working/apache-github-source-source/ql/src/java/org/apache/hadoop/hive/ql/parse/spark/SparkPartitionPruningSinkOperator.java: Some input files use or override a deprecated API. [WARNING] /data/hive-ptest/working/apache-github-source-source/ql/src/java/org/apache/hadoop/hive/ql/parse/spark/SparkPartitionPruningSinkOperator.java: Recompile with -Xlint:deprecation for details. [WARNING] /data/hive-ptest/working/apache-github-source-source/ql/src/java/org/apache/hadoop/hive/ql/metadata/Table.java: Some input files use unchecked or unsafe operations. [WARNING] /data/hive-ptest/working/apache-github-source-source/ql/src/java/org/apache/hadoop/hive/ql/metadata/Table.java: Recompile with -Xlint:unchecked for details. [INFO] 4 warnings [INFO] ------------------------------------------------------------- [INFO] ------------------------------------------------------------- [ERROR] COMPILATION ERROR : [INFO] ------------------------------------------------------------- [ERROR] /data/hive-ptest/working/apache-github-source-source/ql/src/java/org/apache/hadoop/hive/ql/session/SessionState.java:[543,36] cannot find symbol symbol: variable conf location: variable startSs of type org.apache.hadoop.hive.ql.session.SessionState [INFO] 1 error [INFO] ------------------------------------------------------------- [INFO] ------------------------------------------------------------------------ [INFO] Reactor Summary: [INFO] [INFO] Hive .............................................. SUCCESS [12.851s] [INFO] Hive Shims Common ................................. SUCCESS [16.380s] [INFO] Hive Shims 0.23 ................................... SUCCESS [13.297s] [INFO] Hive Shims Scheduler .............................. SUCCESS [3.917s] [INFO] Hive Shims ........................................ SUCCESS [2.707s] [INFO] Hive Storage API .................................. SUCCESS [6.372s] [INFO] Hive ORC .......................................... SUCCESS [12.667s] [INFO] Hive Common ....................................... SUCCESS [26.664s] [INFO] Hive Serde ........................................ SUCCESS [15.283s] [INFO] Hive Metastore .................................... SUCCESS [53.776s] [INFO] Hive Ant Utilities ................................ SUCCESS [1.759s] [INFO] Hive Llap Common .................................. SUCCESS [18.254s] [INFO] Hive Llap Client .................................. SUCCESS [9.547s] [INFO] Hive Llap Tez ..................................... SUCCESS [13.826s] [INFO] Hive Service RPC .................................. SUCCESS [8.810s] [INFO] Spark Remote Client ............................... SUCCESS [15.579s] [INFO] Hive Query Language ............................... FAILURE [1:07.698s] [INFO] Hive Service ...................................... SKIPPED [INFO] Hive Accumulo Handler ............................. SKIPPED [INFO] Hive JDBC ......................................... SKIPPED [INFO] Hive Beeline ...................................... SKIPPED [INFO] Hive CLI .......................................... SKIPPED [INFO] Hive Contrib ...................................... SKIPPED [INFO] Hive HBase Handler ................................ SKIPPED [INFO] Hive HCatalog ..................................... SKIPPED [INFO] Hive HCatalog Core ................................ SKIPPED [INFO] Hive HCatalog Pig Adapter ......................... SKIPPED [INFO] Hive HCatalog Server Extensions ................... SKIPPED [INFO] Hive HCatalog Webhcat Java Client ................. SKIPPED [INFO] Hive HCatalog Webhcat ............................. SKIPPED [INFO] Hive HCatalog Streaming ........................... SKIPPED [INFO] Hive HPL/SQL ...................................... SKIPPED [INFO] Hive HWI .......................................... SKIPPED [INFO] Hive Llap Server .................................. SKIPPED [INFO] Hive Shims Aggregator ............................. SKIPPED [INFO] Hive TestUtils .................................... SKIPPED [INFO] Hive Packaging .................................... SKIPPED [INFO] ------------------------------------------------------------------------ [INFO] BUILD FAILURE [INFO] ------------------------------------------------------------------------ [INFO] Total time: 5:02.731s [INFO] Finished at: Fri Apr 15 19:52:55 EDT 2016 [INFO] Final Memory: 133M/1144M [INFO] ------------------------------------------------------------------------ [WARNING] The requested profile "hadoop-2" could not be activated because it does not exist. [ERROR] Failed to execute goal org.apache.maven.plugins:maven-compiler-plugin:3.1:compile (default-compile) on project hive-exec: Compilation failure [ERROR] /data/hive-ptest/working/apache-github-source-source/ql/src/java/org/apache/hadoop/hive/ql/session/SessionState.java:[543,36] cannot find symbol [ERROR] symbol: variable conf [ERROR] location: variable startSs of type org.apache.hadoop.hive.ql.session.SessionState [ERROR] -> [Help 1] [ERROR] [ERROR] To see the full stack trace of the errors, re-run Maven with the -e switch. [ERROR] Re-run Maven using the -X switch to enable full debug logging. [ERROR] [ERROR] For more information about the errors and possible solutions, please read the following articles: [ERROR] [Help 1] http://cwiki.apache.org/confluence/display/MAVEN/MojoFailureException [ERROR] [ERROR] After correcting the problems, you can resume the build with the command [ERROR] mvn <goals> -rf :hive-exec + exit 1 ' This message is automatically generated. ATTACHMENT ID: 12798565 - PreCommit-HIVE-TRUNK-Build
          Hide
          aihuaxu Aihua Xu added a comment -

          Patch-5: rebase.

          Show
          aihuaxu Aihua Xu added a comment - Patch-5: rebase.
          Hide
          hiveqa Hive QA added a comment -

          Here are the results of testing the latest attachment:
          https://issues.apache.org/jira/secure/attachment/12800074/HIVE-13424.5.patch

          SUCCESS: +1 due to 14 test(s) being added or modified.

          ERROR: -1 due to 3 failed/errored test(s), 9995 tests executed
          Failed tests:

          TestHWISessionManager - did not produce a TEST-*.xml file
          org.apache.hadoop.hive.cli.TestMiniSparkOnYarnCliDriver.testCliDriver_index_bitmap3
          org.apache.hive.beeline.TestSchemaTool.testSchemaInit
          

          Test results: http://ec2-54-177-240-2.us-west-1.compute.amazonaws.com/job/PreCommit-HIVE-MASTER-Build/29/testReport
          Console output: http://ec2-54-177-240-2.us-west-1.compute.amazonaws.com/job/PreCommit-HIVE-MASTER-Build/29/console
          Test logs: http://ec2-50-18-27-0.us-west-1.compute.amazonaws.com/logs/PreCommit-HIVE-MASTER-Build-29/

          Messages:

          Executing org.apache.hive.ptest.execution.TestCheckPhase
          Executing org.apache.hive.ptest.execution.PrepPhase
          Executing org.apache.hive.ptest.execution.ExecutionPhase
          Executing org.apache.hive.ptest.execution.ReportingPhase
          Tests exited with: TestsFailedException: 3 tests failed
          

          This message is automatically generated.

          ATTACHMENT ID: 12800074 - PreCommit-HIVE-MASTER-Build

          Show
          hiveqa Hive QA added a comment - Here are the results of testing the latest attachment: https://issues.apache.org/jira/secure/attachment/12800074/HIVE-13424.5.patch SUCCESS: +1 due to 14 test(s) being added or modified. ERROR: -1 due to 3 failed/errored test(s), 9995 tests executed Failed tests: TestHWISessionManager - did not produce a TEST-*.xml file org.apache.hadoop.hive.cli.TestMiniSparkOnYarnCliDriver.testCliDriver_index_bitmap3 org.apache.hive.beeline.TestSchemaTool.testSchemaInit Test results: http://ec2-54-177-240-2.us-west-1.compute.amazonaws.com/job/PreCommit-HIVE-MASTER-Build/29/testReport Console output: http://ec2-54-177-240-2.us-west-1.compute.amazonaws.com/job/PreCommit-HIVE-MASTER-Build/29/console Test logs: http://ec2-50-18-27-0.us-west-1.compute.amazonaws.com/logs/PreCommit-HIVE-MASTER-Build-29/ Messages: Executing org.apache.hive.ptest.execution.TestCheckPhase Executing org.apache.hive.ptest.execution.PrepPhase Executing org.apache.hive.ptest.execution.ExecutionPhase Executing org.apache.hive.ptest.execution.ReportingPhase Tests exited with: TestsFailedException: 3 tests failed This message is automatically generated. ATTACHMENT ID: 12800074 - PreCommit-HIVE-MASTER-Build
          Hide
          aihuaxu Aihua Xu added a comment -

          Sergey Shelukhin Can you take another look at the code? The tests above are not related.

          Show
          aihuaxu Aihua Xu added a comment - Sergey Shelukhin Can you take another look at the code? The tests above are not related.
          Hide
          sershe Sergey Shelukhin added a comment -

          +1

          Show
          sershe Sergey Shelukhin added a comment - +1
          Hide
          aihuaxu Aihua Xu added a comment -

          Pushed to master. Thanks Sergey Shelukhin for reviewing the code.

          Show
          aihuaxu Aihua Xu added a comment - Pushed to master. Thanks Sergey Shelukhin for reviewing the code.

            People

            • Assignee:
              aihuaxu Aihua Xu
              Reporter:
              aihuaxu Aihua Xu
            • Votes:
              0 Vote for this issue
              Watchers:
              3 Start watching this issue

              Dates

              • Created:
                Updated:
                Resolved:

                Development