Uploaded image for project: 'Hive'
  1. Hive
  2. HIVE-13030

Javadocs issue: Hive HCatalog build failed with IBM JDK 1.8 during Maven release

    XMLWordPrintableJSON

Details

    Description

      When building Hive with IBM JDK1.8, the maven release build is failing because of missing javadocs in Hive HCatolog webhcat module.

      All the errors are related to missing javadocs-
      10:55:17 [INFO] [INFO] Hive HCatalog Webhcat ............................. FAILURE [12.229s]
      10:55:17 [INFO] [INFO] Hive HCatalog Streaming ........................... SKIPPED
      10:55:17 [INFO] [INFO] Hive HWI .......................................... SKIPPED
      10:55:17 [INFO] [INFO] Hive ODBC ......................................... SKIPPED
      10:55:17 [INFO] [INFO] Hive Shims Aggregator ............................. SKIPPED
      10:55:17 [INFO] [INFO] Hive TestUtils .................................... SKIPPED
      10:55:17 [INFO] [INFO] Hive Packaging .................................... SKIPPED
      10:55:17 [INFO] [INFO] ------------------------------------------------------------------------
      10:55:17 [INFO] [INFO] BUILD FAILURE
      10:55:17 [INFO] [INFO] ------------------------------------------------------------------------
      10:55:17 [INFO] [INFO] Total time: 4:10.477s
      10:55:17 [INFO] [INFO] Finished at: Wed Feb 03 10:55:18 PST 2016
      10:55:17 [INFO] [INFO] Final Memory: 79M/377M
      10:55:17 [INFO] [INFO] ------------------------------------------------------------------------
      10:55:17 [INFO] [ERROR] Failed to execute goal org.apache.maven.plugins:maven-javadoc-plugin:2.4:jar (attach-javadocs) on project hive-webhcat: Error while creating archive:Exit code: 1 - /a/workspace/<Jenkins-Job-Name>/hcatalog/webhcat/svr/src/main/java/org/apache/hive/hcatalog/templeton/AppConfig.java:353: warning: no @return
      10:55:17 [INFO] [ERROR] public Collection<String> hiveProps() {
      10:55:17 [INFO] [ERROR] ^
      .
      .
      .
      .
      .

      There are lots of such errors coming in HCatlog package.

      Attachments

        1. hive_build_javadocs_errors.txt
          149 kB
          Devendra Vishwakarma
        2. HIVE-13030.patch
          37 kB
          Devendra Vishwakarma

        Activity

          People

            vvvvvdev Devendra Vishwakarma
            vvvvvdev Devendra Vishwakarma
            Votes:
            1 Vote for this issue
            Watchers:
            2 Start watching this issue

            Dates

              Created:
              Updated: