Uploaded image for project: 'Hadoop HDFS'
  1. Hadoop HDFS
  2. HDFS-9490

MiniDFSCluster should change block generation stamp via FsDatasetTestUtils

    Details

    • Type: Improvement
    • Status: Resolved
    • Priority: Minor
    • Resolution: Fixed
    • Affects Version/s: 2.7.1
    • Fix Version/s: 2.8.0, 3.0.0-alpha1
    • Component/s: test
    • Labels:
      None
    • Target Version/s:

      Description

      MiniDFSCluster#changeGenStampOfBlock directly manipulates the block meta file to update the generation stamp. This depends on file based FsDataset.

      We can abstract the change generation stamp operation in FsDatasetTestUtils.

      1. HDFS-9490.001.patch
        4 kB
        Tony Wu
      2. HDFS-9490.002.patch
        5 kB
        Tony Wu

        Activity

        Hide
        twu Tony Wu added a comment -

        In v1 patch:

        • Add FsDatasetTestUtils#changeStoredGenerationStamp.
        • Update MiniDFSCluster#changeGenStampOfBlock to use the new API.
        Show
        twu Tony Wu added a comment - In v1 patch: Add FsDatasetTestUtils#changeStoredGenerationStamp . Update MiniDFSCluster#changeGenStampOfBlock to use the new API.
        Hide
        eddyxu Lei (Eddy) Xu added a comment -

        Hi, Tony Wu Thanks for working on this.

        Could you change changeStoredGenerationStamp to be void and just throw IOException for errors. It is more consistent with MaterialziedReplica. You can use Files#move() in this case.

        The rest LGTM. Will +1 once address the comments.

        Show
        eddyxu Lei (Eddy) Xu added a comment - Hi, Tony Wu Thanks for working on this. Could you change changeStoredGenerationStamp to be void and just throw IOException for errors. It is more consistent with MaterialziedReplica . You can use Files#move() in this case. The rest LGTM. Will +1 once address the comments.
        Hide
        hadoopqa Hadoop QA added a comment -
        -1 overall



        Vote Subsystem Runtime Comment
        0 reexec 0m 0s Docker mode activated.
        +1 @author 0m 0s The patch does not contain any @author tags.
        +1 test4tests 0m 0s The patch appears to include 3 new or modified test files.
        +1 mvninstall 8m 59s trunk passed
        +1 compile 0m 54s trunk passed with JDK v1.8.0_66
        +1 compile 0m 50s trunk passed with JDK v1.7.0_85
        +1 checkstyle 0m 19s trunk passed
        +1 mvnsite 1m 3s trunk passed
        +1 mvneclipse 0m 16s trunk passed
        +1 findbugs 2m 19s trunk passed
        +1 javadoc 1m 19s trunk passed with JDK v1.8.0_66
        +1 javadoc 2m 12s trunk passed with JDK v1.7.0_85
        +1 mvninstall 1m 1s the patch passed
        +1 compile 0m 54s the patch passed with JDK v1.8.0_66
        +1 javac 0m 54s the patch passed
        +1 compile 0m 51s the patch passed with JDK v1.7.0_85
        +1 javac 0m 51s the patch passed
        +1 checkstyle 0m 19s the patch passed
        +1 mvnsite 1m 4s the patch passed
        +1 mvneclipse 0m 17s the patch passed
        +1 whitespace 0m 0s Patch has no whitespace issues.
        +1 findbugs 2m 29s the patch passed
        +1 javadoc 1m 21s the patch passed with JDK v1.8.0_66
        +1 javadoc 2m 15s the patch passed with JDK v1.7.0_85
        -1 unit 71m 21s hadoop-hdfs in the patch failed with JDK v1.8.0_66.
        -1 unit 68m 9s hadoop-hdfs in the patch failed with JDK v1.7.0_85.
        -1 asflicense 0m 24s Patch generated 58 ASF License warnings.
        172m 20s



        Reason Tests
        JDK v1.8.0_66 Failed junit tests hadoop.hdfs.server.datanode.TestDirectoryScanner
          hadoop.hdfs.tools.TestDFSZKFailoverController
          hadoop.hdfs.server.namenode.TestFavoredNodesEndToEnd
          hadoop.hdfs.TestDFSUpgradeFromImage
          hadoop.hdfs.server.datanode.TestBlockScanner
        JDK v1.8.0_66 Timed out junit tests org.apache.hadoop.hdfs.TestWriteRead
          org.apache.hadoop.hdfs.TestDFSStripedOutputStreamWithFailure
          org.apache.hadoop.hdfs.TestHDFSFileSystemContract
          org.apache.hadoop.hdfs.TestParallelShortCircuitReadNoChecksum
        JDK v1.7.0_85 Failed junit tests hadoop.hdfs.server.namenode.TestNameNodeXAttr
          hadoop.hdfs.TestWriteReadStripedFile
          hadoop.hdfs.server.namenode.TestBackupNode
          hadoop.hdfs.server.namenode.ha.TestFailureToReadEdits
          hadoop.hdfs.server.datanode.TestBlockReplacement



        Subsystem Report/Notes
        Docker Image:yetus/hadoop:0ca8df7
        JIRA Patch URL https://issues.apache.org/jira/secure/attachment/12775093/HDFS-9490.001.patch
        JIRA Issue HDFS-9490
        Optional Tests asflicense compile javac javadoc mvninstall mvnsite unit findbugs checkstyle
        uname Linux 7e165bd4ce99 3.13.0-36-lowlatency #63-Ubuntu SMP PREEMPT Wed Sep 3 21:56:12 UTC 2014 x86_64 x86_64 x86_64 GNU/Linux
        Build tool maven
        Personality /testptch/hadoop/patchprocess/precommit/personality/provided.sh
        git revision trunk / 3c4a34e
        findbugs v3.0.0
        unit https://builds.apache.org/job/PreCommit-HDFS-Build/13726/artifact/patchprocess/patch-unit-hadoop-hdfs-project_hadoop-hdfs-jdk1.8.0_66.txt
        unit https://builds.apache.org/job/PreCommit-HDFS-Build/13726/artifact/patchprocess/patch-unit-hadoop-hdfs-project_hadoop-hdfs-jdk1.7.0_85.txt
        unit test logs https://builds.apache.org/job/PreCommit-HDFS-Build/13726/artifact/patchprocess/patch-unit-hadoop-hdfs-project_hadoop-hdfs-jdk1.8.0_66.txt https://builds.apache.org/job/PreCommit-HDFS-Build/13726/artifact/patchprocess/patch-unit-hadoop-hdfs-project_hadoop-hdfs-jdk1.7.0_85.txt
        JDK v1.7.0_85 Test Results https://builds.apache.org/job/PreCommit-HDFS-Build/13726/testReport/
        asflicense https://builds.apache.org/job/PreCommit-HDFS-Build/13726/artifact/patchprocess/patch-asflicense-problems.txt
        modules C: hadoop-hdfs-project/hadoop-hdfs U: hadoop-hdfs-project/hadoop-hdfs
        Max memory used 76MB
        Powered by Apache Yetus http://yetus.apache.org
        Console output https://builds.apache.org/job/PreCommit-HDFS-Build/13726/console

        This message was automatically generated.

        Show
        hadoopqa Hadoop QA added a comment - -1 overall Vote Subsystem Runtime Comment 0 reexec 0m 0s Docker mode activated. +1 @author 0m 0s The patch does not contain any @author tags. +1 test4tests 0m 0s The patch appears to include 3 new or modified test files. +1 mvninstall 8m 59s trunk passed +1 compile 0m 54s trunk passed with JDK v1.8.0_66 +1 compile 0m 50s trunk passed with JDK v1.7.0_85 +1 checkstyle 0m 19s trunk passed +1 mvnsite 1m 3s trunk passed +1 mvneclipse 0m 16s trunk passed +1 findbugs 2m 19s trunk passed +1 javadoc 1m 19s trunk passed with JDK v1.8.0_66 +1 javadoc 2m 12s trunk passed with JDK v1.7.0_85 +1 mvninstall 1m 1s the patch passed +1 compile 0m 54s the patch passed with JDK v1.8.0_66 +1 javac 0m 54s the patch passed +1 compile 0m 51s the patch passed with JDK v1.7.0_85 +1 javac 0m 51s the patch passed +1 checkstyle 0m 19s the patch passed +1 mvnsite 1m 4s the patch passed +1 mvneclipse 0m 17s the patch passed +1 whitespace 0m 0s Patch has no whitespace issues. +1 findbugs 2m 29s the patch passed +1 javadoc 1m 21s the patch passed with JDK v1.8.0_66 +1 javadoc 2m 15s the patch passed with JDK v1.7.0_85 -1 unit 71m 21s hadoop-hdfs in the patch failed with JDK v1.8.0_66. -1 unit 68m 9s hadoop-hdfs in the patch failed with JDK v1.7.0_85. -1 asflicense 0m 24s Patch generated 58 ASF License warnings. 172m 20s Reason Tests JDK v1.8.0_66 Failed junit tests hadoop.hdfs.server.datanode.TestDirectoryScanner   hadoop.hdfs.tools.TestDFSZKFailoverController   hadoop.hdfs.server.namenode.TestFavoredNodesEndToEnd   hadoop.hdfs.TestDFSUpgradeFromImage   hadoop.hdfs.server.datanode.TestBlockScanner JDK v1.8.0_66 Timed out junit tests org.apache.hadoop.hdfs.TestWriteRead   org.apache.hadoop.hdfs.TestDFSStripedOutputStreamWithFailure   org.apache.hadoop.hdfs.TestHDFSFileSystemContract   org.apache.hadoop.hdfs.TestParallelShortCircuitReadNoChecksum JDK v1.7.0_85 Failed junit tests hadoop.hdfs.server.namenode.TestNameNodeXAttr   hadoop.hdfs.TestWriteReadStripedFile   hadoop.hdfs.server.namenode.TestBackupNode   hadoop.hdfs.server.namenode.ha.TestFailureToReadEdits   hadoop.hdfs.server.datanode.TestBlockReplacement Subsystem Report/Notes Docker Image:yetus/hadoop:0ca8df7 JIRA Patch URL https://issues.apache.org/jira/secure/attachment/12775093/HDFS-9490.001.patch JIRA Issue HDFS-9490 Optional Tests asflicense compile javac javadoc mvninstall mvnsite unit findbugs checkstyle uname Linux 7e165bd4ce99 3.13.0-36-lowlatency #63-Ubuntu SMP PREEMPT Wed Sep 3 21:56:12 UTC 2014 x86_64 x86_64 x86_64 GNU/Linux Build tool maven Personality /testptch/hadoop/patchprocess/precommit/personality/provided.sh git revision trunk / 3c4a34e findbugs v3.0.0 unit https://builds.apache.org/job/PreCommit-HDFS-Build/13726/artifact/patchprocess/patch-unit-hadoop-hdfs-project_hadoop-hdfs-jdk1.8.0_66.txt unit https://builds.apache.org/job/PreCommit-HDFS-Build/13726/artifact/patchprocess/patch-unit-hadoop-hdfs-project_hadoop-hdfs-jdk1.7.0_85.txt unit test logs https://builds.apache.org/job/PreCommit-HDFS-Build/13726/artifact/patchprocess/patch-unit-hadoop-hdfs-project_hadoop-hdfs-jdk1.8.0_66.txt https://builds.apache.org/job/PreCommit-HDFS-Build/13726/artifact/patchprocess/patch-unit-hadoop-hdfs-project_hadoop-hdfs-jdk1.7.0_85.txt JDK v1.7.0_85 Test Results https://builds.apache.org/job/PreCommit-HDFS-Build/13726/testReport/ asflicense https://builds.apache.org/job/PreCommit-HDFS-Build/13726/artifact/patchprocess/patch-asflicense-problems.txt modules C: hadoop-hdfs-project/hadoop-hdfs U: hadoop-hdfs-project/hadoop-hdfs Max memory used 76MB Powered by Apache Yetus http://yetus.apache.org Console output https://builds.apache.org/job/PreCommit-HDFS-Build/13726/console This message was automatically generated.
        Hide
        twu Tony Wu added a comment -

        In v2 patch:

        • Addressed Lei (Eddy) Xu's review comments by changing changeStoredGenerationStamp to be void.
        • Updated relevant functions and tests for the change.
        Show
        twu Tony Wu added a comment - In v2 patch: Addressed Lei (Eddy) Xu 's review comments by changing changeStoredGenerationStamp to be void . Updated relevant functions and tests for the change.
        Hide
        twu Tony Wu added a comment -

        Hi Lei (Eddy) Xu,

        Thanks a lot for the quick review. I have updated the patch to address your comments. Please take a look at the v2 patch.

        Regards,
        Tony

        Show
        twu Tony Wu added a comment - Hi Lei (Eddy) Xu , Thanks a lot for the quick review. I have updated the patch to address your comments. Please take a look at the v2 patch. Regards, Tony
        Hide
        hadoopqa Hadoop QA added a comment -
        -1 overall



        Vote Subsystem Runtime Comment
        0 reexec 0m 0s Docker mode activated.
        +1 @author 0m 0s The patch does not contain any @author tags.
        +1 test4tests 0m 0s The patch appears to include 4 new or modified test files.
        +1 mvninstall 10m 32s trunk passed
        +1 compile 1m 9s trunk passed with JDK v1.8.0_66
        +1 compile 0m 57s trunk passed with JDK v1.7.0_85
        +1 checkstyle 0m 21s trunk passed
        +1 mvnsite 1m 9s trunk passed
        +1 mvneclipse 0m 19s trunk passed
        +1 findbugs 2m 24s trunk passed
        +1 javadoc 1m 22s trunk passed with JDK v1.8.0_66
        +1 javadoc 2m 16s trunk passed with JDK v1.7.0_85
        +1 mvninstall 1m 4s the patch passed
        +1 compile 0m 57s the patch passed with JDK v1.8.0_66
        +1 javac 0m 57s the patch passed
        +1 compile 0m 51s the patch passed with JDK v1.7.0_85
        +1 javac 0m 51s the patch passed
        +1 checkstyle 0m 19s the patch passed
        +1 mvnsite 1m 3s the patch passed
        +1 mvneclipse 0m 16s the patch passed
        +1 whitespace 0m 0s Patch has no whitespace issues.
        +1 findbugs 2m 25s the patch passed
        +1 javadoc 1m 19s the patch passed with JDK v1.8.0_66
        +1 javadoc 2m 10s the patch passed with JDK v1.7.0_85
        -1 unit 66m 27s hadoop-hdfs in the patch failed with JDK v1.8.0_66.
        -1 unit 69m 13s hadoop-hdfs in the patch failed with JDK v1.7.0_85.
        -1 asflicense 0m 26s Patch generated 58 ASF License warnings.
        170m 47s



        Reason Tests
        JDK v1.8.0_66 Failed junit tests hadoop.hdfs.server.namenode.ha.TestSeveralNameNodes
          hadoop.hdfs.server.datanode.TestBlockReplacement
          hadoop.hdfs.server.blockmanagement.TestPendingInvalidateBlock
          hadoop.hdfs.server.datanode.TestBlockScanner
        JDK v1.7.0_85 Failed junit tests hadoop.hdfs.server.namenode.ha.TestRetryCacheWithHA
          hadoop.hdfs.TestRecoverStripedFile



        Subsystem Report/Notes
        Docker Image:yetus/hadoop:0ca8df7
        JIRA Patch URL https://issues.apache.org/jira/secure/attachment/12775332/HDFS-9490.002.patch
        JIRA Issue HDFS-9490
        Optional Tests asflicense compile javac javadoc mvninstall mvnsite unit findbugs checkstyle
        uname Linux ee47a9d8ba9f 3.13.0-36-lowlatency #63-Ubuntu SMP PREEMPT Wed Sep 3 21:56:12 UTC 2014 x86_64 x86_64 x86_64 GNU/Linux
        Build tool maven
        Personality /testptch/hadoop/patchprocess/precommit/personality/provided.sh
        git revision trunk / 53e3bf7
        findbugs v3.0.0
        unit https://builds.apache.org/job/PreCommit-HDFS-Build/13734/artifact/patchprocess/patch-unit-hadoop-hdfs-project_hadoop-hdfs-jdk1.8.0_66.txt
        unit https://builds.apache.org/job/PreCommit-HDFS-Build/13734/artifact/patchprocess/patch-unit-hadoop-hdfs-project_hadoop-hdfs-jdk1.7.0_85.txt
        unit test logs https://builds.apache.org/job/PreCommit-HDFS-Build/13734/artifact/patchprocess/patch-unit-hadoop-hdfs-project_hadoop-hdfs-jdk1.8.0_66.txt https://builds.apache.org/job/PreCommit-HDFS-Build/13734/artifact/patchprocess/patch-unit-hadoop-hdfs-project_hadoop-hdfs-jdk1.7.0_85.txt
        JDK v1.7.0_85 Test Results https://builds.apache.org/job/PreCommit-HDFS-Build/13734/testReport/
        asflicense https://builds.apache.org/job/PreCommit-HDFS-Build/13734/artifact/patchprocess/patch-asflicense-problems.txt
        modules C: hadoop-hdfs-project/hadoop-hdfs U: hadoop-hdfs-project/hadoop-hdfs
        Max memory used 76MB
        Powered by Apache Yetus http://yetus.apache.org
        Console output https://builds.apache.org/job/PreCommit-HDFS-Build/13734/console

        This message was automatically generated.

        Show
        hadoopqa Hadoop QA added a comment - -1 overall Vote Subsystem Runtime Comment 0 reexec 0m 0s Docker mode activated. +1 @author 0m 0s The patch does not contain any @author tags. +1 test4tests 0m 0s The patch appears to include 4 new or modified test files. +1 mvninstall 10m 32s trunk passed +1 compile 1m 9s trunk passed with JDK v1.8.0_66 +1 compile 0m 57s trunk passed with JDK v1.7.0_85 +1 checkstyle 0m 21s trunk passed +1 mvnsite 1m 9s trunk passed +1 mvneclipse 0m 19s trunk passed +1 findbugs 2m 24s trunk passed +1 javadoc 1m 22s trunk passed with JDK v1.8.0_66 +1 javadoc 2m 16s trunk passed with JDK v1.7.0_85 +1 mvninstall 1m 4s the patch passed +1 compile 0m 57s the patch passed with JDK v1.8.0_66 +1 javac 0m 57s the patch passed +1 compile 0m 51s the patch passed with JDK v1.7.0_85 +1 javac 0m 51s the patch passed +1 checkstyle 0m 19s the patch passed +1 mvnsite 1m 3s the patch passed +1 mvneclipse 0m 16s the patch passed +1 whitespace 0m 0s Patch has no whitespace issues. +1 findbugs 2m 25s the patch passed +1 javadoc 1m 19s the patch passed with JDK v1.8.0_66 +1 javadoc 2m 10s the patch passed with JDK v1.7.0_85 -1 unit 66m 27s hadoop-hdfs in the patch failed with JDK v1.8.0_66. -1 unit 69m 13s hadoop-hdfs in the patch failed with JDK v1.7.0_85. -1 asflicense 0m 26s Patch generated 58 ASF License warnings. 170m 47s Reason Tests JDK v1.8.0_66 Failed junit tests hadoop.hdfs.server.namenode.ha.TestSeveralNameNodes   hadoop.hdfs.server.datanode.TestBlockReplacement   hadoop.hdfs.server.blockmanagement.TestPendingInvalidateBlock   hadoop.hdfs.server.datanode.TestBlockScanner JDK v1.7.0_85 Failed junit tests hadoop.hdfs.server.namenode.ha.TestRetryCacheWithHA   hadoop.hdfs.TestRecoverStripedFile Subsystem Report/Notes Docker Image:yetus/hadoop:0ca8df7 JIRA Patch URL https://issues.apache.org/jira/secure/attachment/12775332/HDFS-9490.002.patch JIRA Issue HDFS-9490 Optional Tests asflicense compile javac javadoc mvninstall mvnsite unit findbugs checkstyle uname Linux ee47a9d8ba9f 3.13.0-36-lowlatency #63-Ubuntu SMP PREEMPT Wed Sep 3 21:56:12 UTC 2014 x86_64 x86_64 x86_64 GNU/Linux Build tool maven Personality /testptch/hadoop/patchprocess/precommit/personality/provided.sh git revision trunk / 53e3bf7 findbugs v3.0.0 unit https://builds.apache.org/job/PreCommit-HDFS-Build/13734/artifact/patchprocess/patch-unit-hadoop-hdfs-project_hadoop-hdfs-jdk1.8.0_66.txt unit https://builds.apache.org/job/PreCommit-HDFS-Build/13734/artifact/patchprocess/patch-unit-hadoop-hdfs-project_hadoop-hdfs-jdk1.7.0_85.txt unit test logs https://builds.apache.org/job/PreCommit-HDFS-Build/13734/artifact/patchprocess/patch-unit-hadoop-hdfs-project_hadoop-hdfs-jdk1.8.0_66.txt https://builds.apache.org/job/PreCommit-HDFS-Build/13734/artifact/patchprocess/patch-unit-hadoop-hdfs-project_hadoop-hdfs-jdk1.7.0_85.txt JDK v1.7.0_85 Test Results https://builds.apache.org/job/PreCommit-HDFS-Build/13734/testReport/ asflicense https://builds.apache.org/job/PreCommit-HDFS-Build/13734/artifact/patchprocess/patch-asflicense-problems.txt modules C: hadoop-hdfs-project/hadoop-hdfs U: hadoop-hdfs-project/hadoop-hdfs Max memory used 76MB Powered by Apache Yetus http://yetus.apache.org Console output https://builds.apache.org/job/PreCommit-HDFS-Build/13734/console This message was automatically generated.
        Hide
        twu Tony Wu added a comment -

        The failed tests are not related to this patch. Only TestPendingCorruptDnMessages and TestNameNodeMetadataConsistency uses the updated MiniDFSCluster#changeGenStampOfBlock. Both of these tests pass fine.

        Manually ran the failed tests with jdk 1.8 on OSX and they all pass.

        The failed JDK 1.7 tests both suffer from permission denied error (might be a test system issue):
        org.apache.hadoop.hdfs.server.namenode.ha.TestRetryCacheWithHA.testListCacheDirectives:
        Error while running command to get file permissions : ExitCodeException exitCode=127: /bin/ls: error while loading shared libraries: libc.so.6: failed to map segment from shared object: Permission denied
        org.apache.hadoop.hdfs.server.namenode.ha.TestRetryCacheWithHA.testListCacheDirectives:
        bash: error while loading shared libraries: libdl.so.2: failed to map segment from shared object: Permission denied

        The failed JDK 1.8 tests :
        TestSeveralNameNodes is tracked by HDFS-9376

        Show
        twu Tony Wu added a comment - The failed tests are not related to this patch. Only TestPendingCorruptDnMessages and TestNameNodeMetadataConsistency uses the updated MiniDFSCluster#changeGenStampOfBlock . Both of these tests pass fine. Manually ran the failed tests with jdk 1.8 on OSX and they all pass. The failed JDK 1.7 tests both suffer from permission denied error (might be a test system issue): org.apache.hadoop.hdfs.server.namenode.ha.TestRetryCacheWithHA.testListCacheDirectives: Error while running command to get file permissions : ExitCodeException exitCode=127: /bin/ls: error while loading shared libraries: libc.so.6: failed to map segment from shared object: Permission denied org.apache.hadoop.hdfs.server.namenode.ha.TestRetryCacheWithHA.testListCacheDirectives: bash: error while loading shared libraries: libdl.so.2: failed to map segment from shared object: Permission denied The failed JDK 1.8 tests : TestSeveralNameNodes is tracked by HDFS-9376
        Hide
        eddyxu Lei (Eddy) Xu added a comment -

        Thanks for the explanation, Tony Wu. The v2 patch LGTM.

        +1, will commit shortly.

        Show
        eddyxu Lei (Eddy) Xu added a comment - Thanks for the explanation, Tony Wu . The v2 patch LGTM. +1, will commit shortly.
        Hide
        twu Tony Wu added a comment -

        Thanks a lot Lei (Eddy) Xu, for reviewing and providing comments.

        Show
        twu Tony Wu added a comment - Thanks a lot Lei (Eddy) Xu , for reviewing and providing comments.
        Hide
        hudson Hudson added a comment -

        FAILURE: Integrated in Hadoop-trunk-Commit #8921 (See https://builds.apache.org/job/Hadoop-trunk-Commit/8921/)
        HDFS-9490. MiniDFSCluster should change block generation stamp via (lei: rev 0ac8fb4b336dd03a037092c9712b962e7ed8f852)

        • hadoop-hdfs-project/hadoop-hdfs/src/test/java/org/apache/hadoop/hdfs/MiniDFSCluster.java
        • hadoop-hdfs-project/hadoop-hdfs/src/test/java/org/apache/hadoop/hdfs/server/namenode/ha/TestPendingCorruptDnMessages.java
        • hadoop-hdfs-project/hadoop-hdfs/src/test/java/org/apache/hadoop/hdfs/server/datanode/fsdataset/impl/FsDatasetImplTestUtils.java
        • hadoop-hdfs-project/hadoop-hdfs/src/test/java/org/apache/hadoop/hdfs/server/datanode/FsDatasetTestUtils.java
        • hadoop-hdfs-project/hadoop-hdfs/CHANGES.txt
        Show
        hudson Hudson added a comment - FAILURE: Integrated in Hadoop-trunk-Commit #8921 (See https://builds.apache.org/job/Hadoop-trunk-Commit/8921/ ) HDFS-9490 . MiniDFSCluster should change block generation stamp via (lei: rev 0ac8fb4b336dd03a037092c9712b962e7ed8f852) hadoop-hdfs-project/hadoop-hdfs/src/test/java/org/apache/hadoop/hdfs/MiniDFSCluster.java hadoop-hdfs-project/hadoop-hdfs/src/test/java/org/apache/hadoop/hdfs/server/namenode/ha/TestPendingCorruptDnMessages.java hadoop-hdfs-project/hadoop-hdfs/src/test/java/org/apache/hadoop/hdfs/server/datanode/fsdataset/impl/FsDatasetImplTestUtils.java hadoop-hdfs-project/hadoop-hdfs/src/test/java/org/apache/hadoop/hdfs/server/datanode/FsDatasetTestUtils.java hadoop-hdfs-project/hadoop-hdfs/CHANGES.txt
        Hide
        hudson Hudson added a comment -

        FAILURE: Integrated in Hadoop-Hdfs-trunk-Java8 #665 (See https://builds.apache.org/job/Hadoop-Hdfs-trunk-Java8/665/)
        HDFS-9490. MiniDFSCluster should change block generation stamp via (lei: rev 0ac8fb4b336dd03a037092c9712b962e7ed8f852)

        • hadoop-hdfs-project/hadoop-hdfs/src/test/java/org/apache/hadoop/hdfs/server/datanode/FsDatasetTestUtils.java
        • hadoop-hdfs-project/hadoop-hdfs/src/test/java/org/apache/hadoop/hdfs/MiniDFSCluster.java
        • hadoop-hdfs-project/hadoop-hdfs/src/test/java/org/apache/hadoop/hdfs/server/namenode/ha/TestPendingCorruptDnMessages.java
        • hadoop-hdfs-project/hadoop-hdfs/CHANGES.txt
        • hadoop-hdfs-project/hadoop-hdfs/src/test/java/org/apache/hadoop/hdfs/server/datanode/fsdataset/impl/FsDatasetImplTestUtils.java
        Show
        hudson Hudson added a comment - FAILURE: Integrated in Hadoop-Hdfs-trunk-Java8 #665 (See https://builds.apache.org/job/Hadoop-Hdfs-trunk-Java8/665/ ) HDFS-9490 . MiniDFSCluster should change block generation stamp via (lei: rev 0ac8fb4b336dd03a037092c9712b962e7ed8f852) hadoop-hdfs-project/hadoop-hdfs/src/test/java/org/apache/hadoop/hdfs/server/datanode/FsDatasetTestUtils.java hadoop-hdfs-project/hadoop-hdfs/src/test/java/org/apache/hadoop/hdfs/MiniDFSCluster.java hadoop-hdfs-project/hadoop-hdfs/src/test/java/org/apache/hadoop/hdfs/server/namenode/ha/TestPendingCorruptDnMessages.java hadoop-hdfs-project/hadoop-hdfs/CHANGES.txt hadoop-hdfs-project/hadoop-hdfs/src/test/java/org/apache/hadoop/hdfs/server/datanode/fsdataset/impl/FsDatasetImplTestUtils.java
        Hide
        leftnoteasy Wangda Tan added a comment -

        Committed to branch-2.8.

        Show
        leftnoteasy Wangda Tan added a comment - Committed to branch-2.8.

          People

          • Assignee:
            twu Tony Wu
            Reporter:
            twu Tony Wu
          • Votes:
            0 Vote for this issue
            Watchers:
            5 Start watching this issue

            Dates

            • Created:
              Updated:
              Resolved:

              Development