Uploaded image for project: 'Hadoop HDFS'
  1. Hadoop HDFS
  2. HDFS-9451

Clean up depreated umasks and related unit tests

    Details

    • Type: Bug
    • Status: Resolved
    • Priority: Major
    • Resolution: Fixed
    • Affects Version/s: None
    • Fix Version/s: 3.0.0-alpha1
    • Component/s: None
    • Labels:
      None
    • Target Version/s:
    • Hadoop Flags:
      Reviewed

      Description

      I noticed this test failed consistently since yesterday. The first failed jenkins job is https://builds.apache.org/job/Hadoop-common-trunk-Java8/723/changes, and from the change log:

      Changes:
      
      [wheat9] HDFS-9402. Switch DataNode.LOG to use slf4j. Contributed by Walter Su.
      
      [wheat9] HADOOP-11218. Add TLSv1.1,TLSv1.2 to KMS, HttpFS, SSLFactory.
      
      [wheat9] HADOOP-12467. Respect user-defined JAVA_LIBRARY_PATH in Windows Hadoop
      
      [wheat9] HDFS-8914. Document HA support in the HDFS HdfsDesign.md. Contributed by
      
      [wheat9] HDFS-9153. Pretty-format the output for DFSIO. Contributed by Kai Zheng.
      
      [wheat9] HDFS-7796. Include X-editable for slick contenteditable fields in the
      
      [wheat9] HDFS-3302. Review and improve HDFS trash documentation. Contributed by
      
      [wheat9] HADOOP-12294. Remove the support of the deprecated dfs.umask.
      

      HADOOP-12294 looks to be the most likely cause.

      1. HDFS-9451.001.patch
        1 kB
        Wei-Chiu Chuang
      2. HDFS-9451.002.patch
        3 kB
        Wei-Chiu Chuang
      3. HDFS-9451.003.patch
        4 kB
        Wei-Chiu Chuang
      4. HDFS-9451.004.patch
        5 kB
        Wei-Chiu Chuang

        Issue Links

          Activity

          Hide
          jojochuang Wei-Chiu Chuang added a comment -

          From the description of HADOOP-12294, the behavior tested by the test case was already deprecated. After HADOOP-12294, the deprecated behavior was removed and therefore this test case should be removed as well.

          Show
          jojochuang Wei-Chiu Chuang added a comment - From the description of HADOOP-12294 , the behavior tested by the test case was already deprecated. After HADOOP-12294 , the deprecated behavior was removed and therefore this test case should be removed as well.
          Hide
          jojochuang Wei-Chiu Chuang added a comment -

          Hi Haohui Mai zhihai xu Jason Lowe Chang Li,
          I would like to ask for your comments on this issue, because you have previously discussed in HADOOP-12294. I want to make sure that my understanding about the patch for HADOOP-12294 is correct, that the test case should be removed.

          Thank you.

          Show
          jojochuang Wei-Chiu Chuang added a comment - Hi Haohui Mai zhihai xu Jason Lowe Chang Li , I would like to ask for your comments on this issue, because you have previously discussed in HADOOP-12294 . I want to make sure that my understanding about the patch for HADOOP-12294 is correct, that the test case should be removed. Thank you.
          Hide
          hadoopqa Hadoop QA added a comment -
          -1 overall



          Vote Subsystem Runtime Comment
          0 reexec 0m 0s Docker mode activated.
          +1 @author 0m 0s The patch does not contain any @author tags.
          +1 test4tests 0m 0s The patch appears to include 1 new or modified test files.
          +1 mvninstall 8m 35s trunk passed
          +1 compile 9m 2s trunk passed with JDK v1.8.0_66
          +1 compile 9m 25s trunk passed with JDK v1.7.0_85
          +1 checkstyle 0m 17s trunk passed
          +1 mvnsite 1m 5s trunk passed
          +1 mvneclipse 0m 14s trunk passed
          -1 findbugs 1m 56s hadoop-common-project/hadoop-common in trunk has 1 extant Findbugs warnings.
          +1 javadoc 1m 0s trunk passed with JDK v1.8.0_66
          +1 javadoc 1m 7s trunk passed with JDK v1.7.0_85
          +1 mvninstall 1m 37s the patch passed
          +1 compile 9m 4s the patch passed with JDK v1.8.0_66
          +1 javac 9m 4s the patch passed
          +1 compile 9m 24s the patch passed with JDK v1.7.0_85
          +1 javac 9m 24s the patch passed
          +1 checkstyle 0m 16s the patch passed
          +1 mvnsite 1m 4s the patch passed
          +1 mvneclipse 0m 13s the patch passed
          +1 whitespace 0m 0s Patch has no whitespace issues.
          +1 findbugs 2m 5s the patch passed
          +1 javadoc 0m 55s the patch passed with JDK v1.8.0_66
          +1 javadoc 1m 8s the patch passed with JDK v1.7.0_85
          -1 unit 17m 13s hadoop-common in the patch failed with JDK v1.8.0_66.
          -1 unit 8m 14s hadoop-common in the patch failed with JDK v1.7.0_85.
          +1 asflicense 0m 23s Patch does not generate ASF License warnings.
          85m 22s



          Reason Tests
          JDK v1.8.0_66 Failed junit tests hadoop.metrics2.impl.TestGangliaMetrics
            hadoop.io.compress.TestCompressorDecompressor
          JDK v1.8.0_66 Timed out junit tests org.apache.hadoop.io.compress.lz4.TestLz4CompressorDecompressor
            org.apache.hadoop.http.TestHttpServerLifecycle
          JDK v1.7.0_85 Failed junit tests hadoop.metrics2.impl.TestGangliaMetrics
            hadoop.io.compress.TestCompressorDecompressor
          JDK v1.7.0_85 Timed out junit tests org.apache.hadoop.io.compress.lz4.TestLz4CompressorDecompressor



          Subsystem Report/Notes
          Docker Image:yetus/hadoop:0ca8df7
          JIRA Patch URL https://issues.apache.org/jira/secure/attachment/12773921/HDFS-9451.001.patch
          JIRA Issue HDFS-9451
          Optional Tests asflicense compile javac javadoc mvninstall mvnsite unit findbugs checkstyle
          uname Linux a92baa1c317c 3.13.0-36-lowlatency #63-Ubuntu SMP PREEMPT Wed Sep 3 21:56:12 UTC 2014 x86_64 x86_64 x86_64 GNU/Linux
          Build tool maven
          Personality /testptch/hadoop/patchprocess/precommit/personality/provided.sh
          git revision trunk / aa2009c
          findbugs v3.0.0
          findbugs https://builds.apache.org/job/PreCommit-HDFS-Build/13624/artifact/patchprocess/branch-findbugs-hadoop-common-project_hadoop-common-warnings.html
          unit https://builds.apache.org/job/PreCommit-HDFS-Build/13624/artifact/patchprocess/patch-unit-hadoop-common-project_hadoop-common-jdk1.8.0_66.txt
          unit https://builds.apache.org/job/PreCommit-HDFS-Build/13624/artifact/patchprocess/patch-unit-hadoop-common-project_hadoop-common-jdk1.7.0_85.txt
          unit test logs https://builds.apache.org/job/PreCommit-HDFS-Build/13624/artifact/patchprocess/patch-unit-hadoop-common-project_hadoop-common-jdk1.8.0_66.txt https://builds.apache.org/job/PreCommit-HDFS-Build/13624/artifact/patchprocess/patch-unit-hadoop-common-project_hadoop-common-jdk1.7.0_85.txt
          JDK v1.7.0_85 Test Results https://builds.apache.org/job/PreCommit-HDFS-Build/13624/testReport/
          modules C: hadoop-common-project/hadoop-common U: hadoop-common-project/hadoop-common
          Max memory used 76MB
          Powered by Apache Yetus http://yetus.apache.org
          Console output https://builds.apache.org/job/PreCommit-HDFS-Build/13624/console

          This message was automatically generated.

          Show
          hadoopqa Hadoop QA added a comment - -1 overall Vote Subsystem Runtime Comment 0 reexec 0m 0s Docker mode activated. +1 @author 0m 0s The patch does not contain any @author tags. +1 test4tests 0m 0s The patch appears to include 1 new or modified test files. +1 mvninstall 8m 35s trunk passed +1 compile 9m 2s trunk passed with JDK v1.8.0_66 +1 compile 9m 25s trunk passed with JDK v1.7.0_85 +1 checkstyle 0m 17s trunk passed +1 mvnsite 1m 5s trunk passed +1 mvneclipse 0m 14s trunk passed -1 findbugs 1m 56s hadoop-common-project/hadoop-common in trunk has 1 extant Findbugs warnings. +1 javadoc 1m 0s trunk passed with JDK v1.8.0_66 +1 javadoc 1m 7s trunk passed with JDK v1.7.0_85 +1 mvninstall 1m 37s the patch passed +1 compile 9m 4s the patch passed with JDK v1.8.0_66 +1 javac 9m 4s the patch passed +1 compile 9m 24s the patch passed with JDK v1.7.0_85 +1 javac 9m 24s the patch passed +1 checkstyle 0m 16s the patch passed +1 mvnsite 1m 4s the patch passed +1 mvneclipse 0m 13s the patch passed +1 whitespace 0m 0s Patch has no whitespace issues. +1 findbugs 2m 5s the patch passed +1 javadoc 0m 55s the patch passed with JDK v1.8.0_66 +1 javadoc 1m 8s the patch passed with JDK v1.7.0_85 -1 unit 17m 13s hadoop-common in the patch failed with JDK v1.8.0_66. -1 unit 8m 14s hadoop-common in the patch failed with JDK v1.7.0_85. +1 asflicense 0m 23s Patch does not generate ASF License warnings. 85m 22s Reason Tests JDK v1.8.0_66 Failed junit tests hadoop.metrics2.impl.TestGangliaMetrics   hadoop.io.compress.TestCompressorDecompressor JDK v1.8.0_66 Timed out junit tests org.apache.hadoop.io.compress.lz4.TestLz4CompressorDecompressor   org.apache.hadoop.http.TestHttpServerLifecycle JDK v1.7.0_85 Failed junit tests hadoop.metrics2.impl.TestGangliaMetrics   hadoop.io.compress.TestCompressorDecompressor JDK v1.7.0_85 Timed out junit tests org.apache.hadoop.io.compress.lz4.TestLz4CompressorDecompressor Subsystem Report/Notes Docker Image:yetus/hadoop:0ca8df7 JIRA Patch URL https://issues.apache.org/jira/secure/attachment/12773921/HDFS-9451.001.patch JIRA Issue HDFS-9451 Optional Tests asflicense compile javac javadoc mvninstall mvnsite unit findbugs checkstyle uname Linux a92baa1c317c 3.13.0-36-lowlatency #63-Ubuntu SMP PREEMPT Wed Sep 3 21:56:12 UTC 2014 x86_64 x86_64 x86_64 GNU/Linux Build tool maven Personality /testptch/hadoop/patchprocess/precommit/personality/provided.sh git revision trunk / aa2009c findbugs v3.0.0 findbugs https://builds.apache.org/job/PreCommit-HDFS-Build/13624/artifact/patchprocess/branch-findbugs-hadoop-common-project_hadoop-common-warnings.html unit https://builds.apache.org/job/PreCommit-HDFS-Build/13624/artifact/patchprocess/patch-unit-hadoop-common-project_hadoop-common-jdk1.8.0_66.txt unit https://builds.apache.org/job/PreCommit-HDFS-Build/13624/artifact/patchprocess/patch-unit-hadoop-common-project_hadoop-common-jdk1.7.0_85.txt unit test logs https://builds.apache.org/job/PreCommit-HDFS-Build/13624/artifact/patchprocess/patch-unit-hadoop-common-project_hadoop-common-jdk1.8.0_66.txt https://builds.apache.org/job/PreCommit-HDFS-Build/13624/artifact/patchprocess/patch-unit-hadoop-common-project_hadoop-common-jdk1.7.0_85.txt JDK v1.7.0_85 Test Results https://builds.apache.org/job/PreCommit-HDFS-Build/13624/testReport/ modules C: hadoop-common-project/hadoop-common U: hadoop-common-project/hadoop-common Max memory used 76MB Powered by Apache Yetus http://yetus.apache.org Console output https://builds.apache.org/job/PreCommit-HDFS-Build/13624/console This message was automatically generated.
          Hide
          jojochuang Wei-Chiu Chuang added a comment -

          TestPermission#testBackwardCompatibility is also broken by HADOOP-12294. Should also be taken care of.

          Show
          jojochuang Wei-Chiu Chuang added a comment - TestPermission#testBackwardCompatibility is also broken by HADOOP-12294 . Should also be taken care of.
          Hide
          jojochuang Wei-Chiu Chuang added a comment -

          Removed unit tests that broken due to HADOOP-12294.

          Show
          jojochuang Wei-Chiu Chuang added a comment - Removed unit tests that broken due to HADOOP-12294 .
          Hide
          ozawa Tsuyoshi Ozawa added a comment -

          Targeting this to 3.0.0 since HADOOP-12294 is only for 3.0.0.

          Show
          ozawa Tsuyoshi Ozawa added a comment - Targeting this to 3.0.0 since HADOOP-12294 is only for 3.0.0.
          Hide
          ozawa Tsuyoshi Ozawa added a comment -

          LGTM, pending for Jenkins.

          Show
          ozawa Tsuyoshi Ozawa added a comment - LGTM, pending for Jenkins.
          Hide
          hadoopqa Hadoop QA added a comment -
          -1 overall



          Vote Subsystem Runtime Comment
          0 reexec 0m 0s Docker mode activated.
          +1 @author 0m 0s The patch does not contain any @author tags.
          +1 test4tests 0m 0s The patch appears to include 2 new or modified test files.
          +1 mvninstall 9m 7s trunk passed
          +1 compile 10m 40s trunk passed with JDK v1.8.0_66
          +1 compile 11m 14s trunk passed with JDK v1.7.0_85
          +1 checkstyle 1m 20s trunk passed
          +1 mvnsite 2m 32s trunk passed
          +1 mvneclipse 0m 36s trunk passed
          -1 findbugs 2m 32s hadoop-common-project/hadoop-common in trunk has 1 extant Findbugs warnings.
          +1 javadoc 2m 48s trunk passed with JDK v1.8.0_66
          +1 javadoc 3m 48s trunk passed with JDK v1.7.0_85
          +1 mvninstall 3m 18s the patch passed
          +1 compile 12m 31s the patch passed with JDK v1.8.0_66
          +1 javac 12m 31s the patch passed
          +1 compile 12m 4s the patch passed with JDK v1.7.0_85
          +1 javac 12m 4s the patch passed
          +1 checkstyle 1m 19s the patch passed
          +1 mvnsite 2m 29s the patch passed
          +1 mvneclipse 0m 36s the patch passed
          +1 whitespace 0m 0s Patch has no whitespace issues.
          +1 findbugs 5m 37s the patch passed
          +1 javadoc 2m 50s the patch passed with JDK v1.8.0_66
          +1 javadoc 3m 54s the patch passed with JDK v1.7.0_85
          -1 unit 9m 7s hadoop-common in the patch failed with JDK v1.8.0_66.
          -1 unit 73m 14s hadoop-hdfs in the patch failed with JDK v1.8.0_66.
          -1 unit 8m 17s hadoop-common in the patch failed with JDK v1.7.0_85.
          -1 unit 65m 4s hadoop-hdfs in the patch failed with JDK v1.7.0_85.
          -1 asflicense 0m 22s Patch generated 58 ASF License warnings.
          249m 36s



          Reason Tests
          JDK v1.8.0_66 Failed junit tests hadoop.metrics2.impl.TestGangliaMetrics
            hadoop.test.TestTimedOutTestsListener
            hadoop.hdfs.TestReplaceDatanodeOnFailure
            hadoop.hdfs.server.namenode.ha.TestSeveralNameNodes
            hadoop.fs.TestSymlinkHdfsFileContext
            hadoop.hdfs.server.namenode.TestBackupNode
            hadoop.hdfs.server.namenode.ha.TestDFSUpgradeWithHA
            hadoop.hdfs.server.datanode.TestDataNodeMetrics
            hadoop.hdfs.server.datanode.TestBlockScanner
          JDK v1.7.0_85 Failed junit tests hadoop.fs.shell.TestCopyPreserveFlag
            hadoop.ipc.TestDecayRpcScheduler
            hadoop.metrics2.impl.TestGangliaMetrics
            hadoop.hdfs.server.blockmanagement.TestBlockTokenWithDFSStriped
            hadoop.hdfs.TestDFSStripedOutputStreamWithFailure020
            hadoop.hdfs.TestDFSStripedOutputStreamWithFailure160



          Subsystem Report/Notes
          Docker Image:yetus/hadoop:0ca8df7
          JIRA Patch URL https://issues.apache.org/jira/secure/attachment/12774013/HDFS-9451.002.patch
          JIRA Issue HDFS-9451
          Optional Tests asflicense compile javac javadoc mvninstall mvnsite unit findbugs checkstyle
          uname Linux 2432e32b5afe 3.13.0-36-lowlatency #63-Ubuntu SMP PREEMPT Wed Sep 3 21:56:12 UTC 2014 x86_64 x86_64 x86_64 GNU/Linux
          Build tool maven
          Personality /testptch/hadoop/patchprocess/precommit/personality/provided.sh
          git revision trunk / f80dc6f
          findbugs v3.0.0
          findbugs https://builds.apache.org/job/PreCommit-HDFS-Build/13631/artifact/patchprocess/branch-findbugs-hadoop-common-project_hadoop-common-warnings.html
          unit https://builds.apache.org/job/PreCommit-HDFS-Build/13631/artifact/patchprocess/patch-unit-hadoop-common-project_hadoop-common-jdk1.8.0_66.txt
          unit https://builds.apache.org/job/PreCommit-HDFS-Build/13631/artifact/patchprocess/patch-unit-hadoop-hdfs-project_hadoop-hdfs-jdk1.8.0_66.txt
          unit https://builds.apache.org/job/PreCommit-HDFS-Build/13631/artifact/patchprocess/patch-unit-hadoop-common-project_hadoop-common-jdk1.7.0_85.txt
          unit https://builds.apache.org/job/PreCommit-HDFS-Build/13631/artifact/patchprocess/patch-unit-hadoop-hdfs-project_hadoop-hdfs-jdk1.7.0_85.txt
          unit test logs https://builds.apache.org/job/PreCommit-HDFS-Build/13631/artifact/patchprocess/patch-unit-hadoop-common-project_hadoop-common-jdk1.8.0_66.txt https://builds.apache.org/job/PreCommit-HDFS-Build/13631/artifact/patchprocess/patch-unit-hadoop-hdfs-project_hadoop-hdfs-jdk1.8.0_66.txt https://builds.apache.org/job/PreCommit-HDFS-Build/13631/artifact/patchprocess/patch-unit-hadoop-common-project_hadoop-common-jdk1.7.0_85.txt https://builds.apache.org/job/PreCommit-HDFS-Build/13631/artifact/patchprocess/patch-unit-hadoop-hdfs-project_hadoop-hdfs-jdk1.7.0_85.txt
          JDK v1.7.0_85 Test Results https://builds.apache.org/job/PreCommit-HDFS-Build/13631/testReport/
          asflicense https://builds.apache.org/job/PreCommit-HDFS-Build/13631/artifact/patchprocess/patch-asflicense-problems.txt
          modules C: hadoop-common-project/hadoop-common hadoop-hdfs-project/hadoop-hdfs U: .
          Max memory used 76MB
          Powered by Apache Yetus http://yetus.apache.org
          Console output https://builds.apache.org/job/PreCommit-HDFS-Build/13631/console

          This message was automatically generated.

          Show
          hadoopqa Hadoop QA added a comment - -1 overall Vote Subsystem Runtime Comment 0 reexec 0m 0s Docker mode activated. +1 @author 0m 0s The patch does not contain any @author tags. +1 test4tests 0m 0s The patch appears to include 2 new or modified test files. +1 mvninstall 9m 7s trunk passed +1 compile 10m 40s trunk passed with JDK v1.8.0_66 +1 compile 11m 14s trunk passed with JDK v1.7.0_85 +1 checkstyle 1m 20s trunk passed +1 mvnsite 2m 32s trunk passed +1 mvneclipse 0m 36s trunk passed -1 findbugs 2m 32s hadoop-common-project/hadoop-common in trunk has 1 extant Findbugs warnings. +1 javadoc 2m 48s trunk passed with JDK v1.8.0_66 +1 javadoc 3m 48s trunk passed with JDK v1.7.0_85 +1 mvninstall 3m 18s the patch passed +1 compile 12m 31s the patch passed with JDK v1.8.0_66 +1 javac 12m 31s the patch passed +1 compile 12m 4s the patch passed with JDK v1.7.0_85 +1 javac 12m 4s the patch passed +1 checkstyle 1m 19s the patch passed +1 mvnsite 2m 29s the patch passed +1 mvneclipse 0m 36s the patch passed +1 whitespace 0m 0s Patch has no whitespace issues. +1 findbugs 5m 37s the patch passed +1 javadoc 2m 50s the patch passed with JDK v1.8.0_66 +1 javadoc 3m 54s the patch passed with JDK v1.7.0_85 -1 unit 9m 7s hadoop-common in the patch failed with JDK v1.8.0_66. -1 unit 73m 14s hadoop-hdfs in the patch failed with JDK v1.8.0_66. -1 unit 8m 17s hadoop-common in the patch failed with JDK v1.7.0_85. -1 unit 65m 4s hadoop-hdfs in the patch failed with JDK v1.7.0_85. -1 asflicense 0m 22s Patch generated 58 ASF License warnings. 249m 36s Reason Tests JDK v1.8.0_66 Failed junit tests hadoop.metrics2.impl.TestGangliaMetrics   hadoop.test.TestTimedOutTestsListener   hadoop.hdfs.TestReplaceDatanodeOnFailure   hadoop.hdfs.server.namenode.ha.TestSeveralNameNodes   hadoop.fs.TestSymlinkHdfsFileContext   hadoop.hdfs.server.namenode.TestBackupNode   hadoop.hdfs.server.namenode.ha.TestDFSUpgradeWithHA   hadoop.hdfs.server.datanode.TestDataNodeMetrics   hadoop.hdfs.server.datanode.TestBlockScanner JDK v1.7.0_85 Failed junit tests hadoop.fs.shell.TestCopyPreserveFlag   hadoop.ipc.TestDecayRpcScheduler   hadoop.metrics2.impl.TestGangliaMetrics   hadoop.hdfs.server.blockmanagement.TestBlockTokenWithDFSStriped   hadoop.hdfs.TestDFSStripedOutputStreamWithFailure020   hadoop.hdfs.TestDFSStripedOutputStreamWithFailure160 Subsystem Report/Notes Docker Image:yetus/hadoop:0ca8df7 JIRA Patch URL https://issues.apache.org/jira/secure/attachment/12774013/HDFS-9451.002.patch JIRA Issue HDFS-9451 Optional Tests asflicense compile javac javadoc mvninstall mvnsite unit findbugs checkstyle uname Linux 2432e32b5afe 3.13.0-36-lowlatency #63-Ubuntu SMP PREEMPT Wed Sep 3 21:56:12 UTC 2014 x86_64 x86_64 x86_64 GNU/Linux Build tool maven Personality /testptch/hadoop/patchprocess/precommit/personality/provided.sh git revision trunk / f80dc6f findbugs v3.0.0 findbugs https://builds.apache.org/job/PreCommit-HDFS-Build/13631/artifact/patchprocess/branch-findbugs-hadoop-common-project_hadoop-common-warnings.html unit https://builds.apache.org/job/PreCommit-HDFS-Build/13631/artifact/patchprocess/patch-unit-hadoop-common-project_hadoop-common-jdk1.8.0_66.txt unit https://builds.apache.org/job/PreCommit-HDFS-Build/13631/artifact/patchprocess/patch-unit-hadoop-hdfs-project_hadoop-hdfs-jdk1.8.0_66.txt unit https://builds.apache.org/job/PreCommit-HDFS-Build/13631/artifact/patchprocess/patch-unit-hadoop-common-project_hadoop-common-jdk1.7.0_85.txt unit https://builds.apache.org/job/PreCommit-HDFS-Build/13631/artifact/patchprocess/patch-unit-hadoop-hdfs-project_hadoop-hdfs-jdk1.7.0_85.txt unit test logs https://builds.apache.org/job/PreCommit-HDFS-Build/13631/artifact/patchprocess/patch-unit-hadoop-common-project_hadoop-common-jdk1.8.0_66.txt https://builds.apache.org/job/PreCommit-HDFS-Build/13631/artifact/patchprocess/patch-unit-hadoop-hdfs-project_hadoop-hdfs-jdk1.8.0_66.txt https://builds.apache.org/job/PreCommit-HDFS-Build/13631/artifact/patchprocess/patch-unit-hadoop-common-project_hadoop-common-jdk1.7.0_85.txt https://builds.apache.org/job/PreCommit-HDFS-Build/13631/artifact/patchprocess/patch-unit-hadoop-hdfs-project_hadoop-hdfs-jdk1.7.0_85.txt JDK v1.7.0_85 Test Results https://builds.apache.org/job/PreCommit-HDFS-Build/13631/testReport/ asflicense https://builds.apache.org/job/PreCommit-HDFS-Build/13631/artifact/patchprocess/patch-asflicense-problems.txt modules C: hadoop-common-project/hadoop-common hadoop-hdfs-project/hadoop-hdfs U: . Max memory used 76MB Powered by Apache Yetus http://yetus.apache.org Console output https://builds.apache.org/job/PreCommit-HDFS-Build/13631/console This message was automatically generated.
          Hide
          lichangleo Chang Li added a comment -

          Thanks Wei-Chiu Chuang for working on this! The test changes are correct since we decide to remove the use of deprecated old umask key in getUMask in HADOOP-12294.
          The failed unit tests are not related. TestDecayRpcScheduler is flaky.
          If possible could you also help remove the line

           int oldUmask = conf.getInt(DEPRECATED_UMASK_LABEL, Integer.MIN_VALUE); 

          in getUMask ?
          Otherwise, +1(non-binding) on the latest patch

          Show
          lichangleo Chang Li added a comment - Thanks Wei-Chiu Chuang for working on this! The test changes are correct since we decide to remove the use of deprecated old umask key in getUMask in HADOOP-12294 . The failed unit tests are not related. TestDecayRpcScheduler is flaky. If possible could you also help remove the line int oldUmask = conf.getInt(DEPRECATED_UMASK_LABEL, Integer .MIN_VALUE); in getUMask ? Otherwise, +1(non-binding) on the latest patch
          Hide
          jojochuang Wei-Chiu Chuang added a comment -

          Hi Chang Li thanks for the review.
          Is the intention remove DEPRECATED_UMASK_LABEL entirely?
          Other than this, DEPRECATED_UMASK_LABEL is also being used in two other places in FsPermission.java and TestPermission.java

          Show
          jojochuang Wei-Chiu Chuang added a comment - Hi Chang Li thanks for the review. Is the intention remove DEPRECATED_UMASK_LABEL entirely? Other than this, DEPRECATED_UMASK_LABEL is also being used in two other places in FsPermission.java and TestPermission.java
          Hide
          lichangleo Chang Li added a comment -

          Hi Wei-Chiu Chuang, though it could be removed entirely for 3.0, but the scope of HADOOP-12294 only intends to remove it from getUMask

          Show
          lichangleo Chang Li added a comment - Hi Wei-Chiu Chuang , though it could be removed entirely for 3.0, but the scope of HADOOP-12294 only intends to remove it from getUMask
          Hide
          jojochuang Wei-Chiu Chuang added a comment -

          Thanks Chang Li for the explanation. Agree to take a minimalist approach. Rev03 is Rev02 with the unused variable removed.

          Show
          jojochuang Wei-Chiu Chuang added a comment - Thanks Chang Li for the explanation. Agree to take a minimalist approach. Rev03 is Rev02 with the unused variable removed.
          Hide
          cnauroth Chris Nauroth added a comment -

          I've asked for some clarification on HADOOP-12294 about what that patch was trying to achieve, and I asked that we consider reverting it. Please see my comment in HADOOP-12294 for more details.

          Show
          cnauroth Chris Nauroth added a comment - I've asked for some clarification on HADOOP-12294 about what that patch was trying to achieve, and I asked that we consider reverting it. Please see my comment in HADOOP-12294 for more details.
          Hide
          wheat9 Haohui Mai added a comment -
          public static final String DEPRECATED_UMASK_LABEL = "dfs.umask";
          

          Should be removed as well. +1 once addressed.

          Show
          wheat9 Haohui Mai added a comment - public static final String DEPRECATED_UMASK_LABEL = "dfs.umask" ; Should be removed as well. +1 once addressed.
          Hide
          lichangleo Chang Li added a comment -

          Haohui Mai, I have opened HADOOP-12595 to track the whole work of remove deprecated dfs.umask, how about let me do the cleanup work there. If

          public static final String DEPRECATED_UMASK_LABEL = "dfs.umask";

          is removed,

          conf.setInt(DEPRECATED_UMASK_LABEL, umask.toShort());

          also needs to be removed in setUMask

          Show
          lichangleo Chang Li added a comment - Haohui Mai , I have opened HADOOP-12595 to track the whole work of remove deprecated dfs.umask, how about let me do the cleanup work there. If public static final String DEPRECATED_UMASK_LABEL = "dfs.umask" ; is removed, conf.setInt(DEPRECATED_UMASK_LABEL, umask.toShort()); also needs to be removed in setUMask
          Hide
          lichangleo Chang Li added a comment -

          Haohui Mai, I have opened HADOOP-12595 to track the whole work of remove deprecated dfs.umask, how about let me do the cleanup work there. If

          public static final String DEPRECATED_UMASK_LABEL = "dfs.umask";

          is removed,

          conf.setInt(DEPRECATED_UMASK_LABEL, umask.toShort());

          also needs to be removed in setUMask

          Show
          lichangleo Chang Li added a comment - Haohui Mai , I have opened HADOOP-12595 to track the whole work of remove deprecated dfs.umask, how about let me do the cleanup work there. If public static final String DEPRECATED_UMASK_LABEL = "dfs.umask" ; is removed, conf.setInt(DEPRECATED_UMASK_LABEL, umask.toShort()); also needs to be removed in setUMask
          Hide
          wheat9 Haohui Mai added a comment -

          It makes sense to remove it from setUMask as well since it is a deprecated functionality, and it is only used to pass umask internally.

          Show
          wheat9 Haohui Mai added a comment - It makes sense to remove it from setUMask as well since it is a deprecated functionality, and it is only used to pass umask internally.
          Hide
          jojochuang Wei-Chiu Chuang added a comment -

          I am thinking to remove all usages of DEPRECATED_UMASK_LABEL in tests in the next revision, before HADOOP-12595 is committed. Otherwise removing DEPRECATED_UMASK_LABEL in HADOOP-12595 will make it unable to build.

          Show
          jojochuang Wei-Chiu Chuang added a comment - I am thinking to remove all usages of DEPRECATED_UMASK_LABEL in tests in the next revision, before HADOOP-12595 is committed. Otherwise removing DEPRECATED_UMASK_LABEL in HADOOP-12595 will make it unable to build.
          Hide
          lichangleo Chang Li added a comment -

          Since this jira only intends to fix test, it's better to avoid touching src code. Prefer to let HADOOP-12595 to remove all reference of DEPRECATED_UMASK_LABEL.

          Show
          lichangleo Chang Li added a comment - Since this jira only intends to fix test, it's better to avoid touching src code. Prefer to let HADOOP-12595 to remove all reference of DEPRECATED_UMASK_LABEL.
          Hide
          wheat9 Haohui Mai added a comment -

          The issue is trivial enough thus I see little values of having multiple jiras on fixing the same issue. Let's combine the effort and use one jira to address it here.

          Show
          wheat9 Haohui Mai added a comment - The issue is trivial enough thus I see little values of having multiple jiras on fixing the same issue. Let's combine the effort and use one jira to address it here.
          Hide
          lichangleo Chang Li added a comment -

          Well... then let's do what Haohui Mai said, to totally remove the support of the deprecated dfs.umask here

          Show
          lichangleo Chang Li added a comment - Well... then let's do what Haohui Mai said, to totally remove the support of the deprecated dfs.umask here
          Hide
          hadoopqa Hadoop QA added a comment -
          -1 overall



          Vote Subsystem Runtime Comment
          0 reexec 0m 0s Docker mode activated.
          +1 @author 0m 0s The patch does not contain any @author tags.
          +1 test4tests 0m 0s The patch appears to include 2 new or modified test files.
          +1 mvninstall 9m 4s trunk passed
          +1 compile 9m 55s trunk passed with JDK v1.8.0_66
          +1 compile 10m 9s trunk passed with JDK v1.7.0_85
          +1 checkstyle 1m 9s trunk passed
          +1 mvnsite 2m 14s trunk passed
          +1 mvneclipse 0m 30s trunk passed
          -1 findbugs 2m 11s hadoop-common-project/hadoop-common in trunk has 1 extant Findbugs warnings.
          +1 javadoc 2m 23s trunk passed with JDK v1.8.0_66
          +1 javadoc 3m 16s trunk passed with JDK v1.7.0_85
          +1 mvninstall 2m 40s the patch passed
          +1 compile 10m 11s the patch passed with JDK v1.8.0_66
          +1 javac 10m 11s the patch passed
          +1 compile 10m 9s the patch passed with JDK v1.7.0_85
          +1 javac 10m 9s the patch passed
          +1 checkstyle 1m 1s the patch passed
          +1 mvnsite 1m 59s the patch passed
          +1 mvneclipse 0m 28s the patch passed
          +1 whitespace 0m 0s Patch has no whitespace issues.
          +1 findbugs 4m 15s the patch passed
          +1 javadoc 2m 4s the patch passed with JDK v1.8.0_66
          +1 javadoc 3m 7s the patch passed with JDK v1.7.0_85
          +1 unit 8m 23s hadoop-common in the patch passed with JDK v1.8.0_66.
          -1 unit 58m 35s hadoop-hdfs in the patch failed with JDK v1.8.0_66.
          +1 unit 8m 47s hadoop-common in the patch passed with JDK v1.7.0_85.
          -1 unit 57m 34s hadoop-hdfs in the patch failed with JDK v1.7.0_85.
          -1 asflicense 0m 22s Patch generated 56 ASF License warnings.
          214m 1s



          Reason Tests
          JDK v1.8.0_66 Failed junit tests hadoop.hdfs.TestRenameWhileOpen
            hadoop.hdfs.server.namenode.ha.TestSeveralNameNodes
            hadoop.hdfs.server.datanode.TestFsDatasetCache
            hadoop.hdfs.TestReplication
            hadoop.hdfs.shortcircuit.TestShortCircuitCache
          JDK v1.7.0_85 Failed junit tests hadoop.hdfs.TestWriteReadStripedFile
            hadoop.hdfs.server.namenode.snapshot.TestRenameWithSnapshots



          Subsystem Report/Notes
          Docker Image:yetus/hadoop:0ca8df7
          JIRA Patch URL https://issues.apache.org/jira/secure/attachment/12774095/HDFS-9451.003.patch
          JIRA Issue HDFS-9451
          Optional Tests asflicense compile javac javadoc mvninstall mvnsite unit findbugs checkstyle
          uname Linux 242b9238a472 3.13.0-36-lowlatency #63-Ubuntu SMP PREEMPT Wed Sep 3 21:56:12 UTC 2014 x86_64 x86_64 x86_64 GNU/Linux
          Build tool maven
          Personality /testptch/hadoop/patchprocess/precommit/personality/provided.sh
          git revision trunk / 28dfe72
          findbugs v3.0.0
          findbugs https://builds.apache.org/job/PreCommit-HDFS-Build/13635/artifact/patchprocess/branch-findbugs-hadoop-common-project_hadoop-common-warnings.html
          unit https://builds.apache.org/job/PreCommit-HDFS-Build/13635/artifact/patchprocess/patch-unit-hadoop-hdfs-project_hadoop-hdfs-jdk1.8.0_66.txt
          unit https://builds.apache.org/job/PreCommit-HDFS-Build/13635/artifact/patchprocess/patch-unit-hadoop-hdfs-project_hadoop-hdfs-jdk1.7.0_85.txt
          unit test logs https://builds.apache.org/job/PreCommit-HDFS-Build/13635/artifact/patchprocess/patch-unit-hadoop-hdfs-project_hadoop-hdfs-jdk1.8.0_66.txt https://builds.apache.org/job/PreCommit-HDFS-Build/13635/artifact/patchprocess/patch-unit-hadoop-hdfs-project_hadoop-hdfs-jdk1.7.0_85.txt
          JDK v1.7.0_85 Test Results https://builds.apache.org/job/PreCommit-HDFS-Build/13635/testReport/
          asflicense https://builds.apache.org/job/PreCommit-HDFS-Build/13635/artifact/patchprocess/patch-asflicense-problems.txt
          modules C: hadoop-common-project/hadoop-common hadoop-hdfs-project/hadoop-hdfs U: .
          Max memory used 75MB
          Powered by Apache Yetus http://yetus.apache.org
          Console output https://builds.apache.org/job/PreCommit-HDFS-Build/13635/console

          This message was automatically generated.

          Show
          hadoopqa Hadoop QA added a comment - -1 overall Vote Subsystem Runtime Comment 0 reexec 0m 0s Docker mode activated. +1 @author 0m 0s The patch does not contain any @author tags. +1 test4tests 0m 0s The patch appears to include 2 new or modified test files. +1 mvninstall 9m 4s trunk passed +1 compile 9m 55s trunk passed with JDK v1.8.0_66 +1 compile 10m 9s trunk passed with JDK v1.7.0_85 +1 checkstyle 1m 9s trunk passed +1 mvnsite 2m 14s trunk passed +1 mvneclipse 0m 30s trunk passed -1 findbugs 2m 11s hadoop-common-project/hadoop-common in trunk has 1 extant Findbugs warnings. +1 javadoc 2m 23s trunk passed with JDK v1.8.0_66 +1 javadoc 3m 16s trunk passed with JDK v1.7.0_85 +1 mvninstall 2m 40s the patch passed +1 compile 10m 11s the patch passed with JDK v1.8.0_66 +1 javac 10m 11s the patch passed +1 compile 10m 9s the patch passed with JDK v1.7.0_85 +1 javac 10m 9s the patch passed +1 checkstyle 1m 1s the patch passed +1 mvnsite 1m 59s the patch passed +1 mvneclipse 0m 28s the patch passed +1 whitespace 0m 0s Patch has no whitespace issues. +1 findbugs 4m 15s the patch passed +1 javadoc 2m 4s the patch passed with JDK v1.8.0_66 +1 javadoc 3m 7s the patch passed with JDK v1.7.0_85 +1 unit 8m 23s hadoop-common in the patch passed with JDK v1.8.0_66. -1 unit 58m 35s hadoop-hdfs in the patch failed with JDK v1.8.0_66. +1 unit 8m 47s hadoop-common in the patch passed with JDK v1.7.0_85. -1 unit 57m 34s hadoop-hdfs in the patch failed with JDK v1.7.0_85. -1 asflicense 0m 22s Patch generated 56 ASF License warnings. 214m 1s Reason Tests JDK v1.8.0_66 Failed junit tests hadoop.hdfs.TestRenameWhileOpen   hadoop.hdfs.server.namenode.ha.TestSeveralNameNodes   hadoop.hdfs.server.datanode.TestFsDatasetCache   hadoop.hdfs.TestReplication   hadoop.hdfs.shortcircuit.TestShortCircuitCache JDK v1.7.0_85 Failed junit tests hadoop.hdfs.TestWriteReadStripedFile   hadoop.hdfs.server.namenode.snapshot.TestRenameWithSnapshots Subsystem Report/Notes Docker Image:yetus/hadoop:0ca8df7 JIRA Patch URL https://issues.apache.org/jira/secure/attachment/12774095/HDFS-9451.003.patch JIRA Issue HDFS-9451 Optional Tests asflicense compile javac javadoc mvninstall mvnsite unit findbugs checkstyle uname Linux 242b9238a472 3.13.0-36-lowlatency #63-Ubuntu SMP PREEMPT Wed Sep 3 21:56:12 UTC 2014 x86_64 x86_64 x86_64 GNU/Linux Build tool maven Personality /testptch/hadoop/patchprocess/precommit/personality/provided.sh git revision trunk / 28dfe72 findbugs v3.0.0 findbugs https://builds.apache.org/job/PreCommit-HDFS-Build/13635/artifact/patchprocess/branch-findbugs-hadoop-common-project_hadoop-common-warnings.html unit https://builds.apache.org/job/PreCommit-HDFS-Build/13635/artifact/patchprocess/patch-unit-hadoop-hdfs-project_hadoop-hdfs-jdk1.8.0_66.txt unit https://builds.apache.org/job/PreCommit-HDFS-Build/13635/artifact/patchprocess/patch-unit-hadoop-hdfs-project_hadoop-hdfs-jdk1.7.0_85.txt unit test logs https://builds.apache.org/job/PreCommit-HDFS-Build/13635/artifact/patchprocess/patch-unit-hadoop-hdfs-project_hadoop-hdfs-jdk1.8.0_66.txt https://builds.apache.org/job/PreCommit-HDFS-Build/13635/artifact/patchprocess/patch-unit-hadoop-hdfs-project_hadoop-hdfs-jdk1.7.0_85.txt JDK v1.7.0_85 Test Results https://builds.apache.org/job/PreCommit-HDFS-Build/13635/testReport/ asflicense https://builds.apache.org/job/PreCommit-HDFS-Build/13635/artifact/patchprocess/patch-asflicense-problems.txt modules C: hadoop-common-project/hadoop-common hadoop-hdfs-project/hadoop-hdfs U: . Max memory used 75MB Powered by Apache Yetus http://yetus.apache.org Console output https://builds.apache.org/job/PreCommit-HDFS-Build/13635/console This message was automatically generated.
          Hide
          jojochuang Wei-Chiu Chuang added a comment -

          Thanks for the reviews and suggestions! Rev04 removes all usage of DEPRECATED_UMASK_LABEL (getUMask(), setUMask()) in src/ and removes three tests that use DEPRECATED_UMASK_LABEL.

          Show
          jojochuang Wei-Chiu Chuang added a comment - Thanks for the reviews and suggestions! Rev04 removes all usage of DEPRECATED_UMASK_LABEL (getUMask(), setUMask()) in src/ and removes three tests that use DEPRECATED_UMASK_LABEL.
          Hide
          lichangleo Chang Li added a comment -

          Thanks for update! lgtm, +1(non binding)

          Show
          lichangleo Chang Li added a comment - Thanks for update! lgtm, +1(non binding)
          Hide
          wheat9 Haohui Mai added a comment -

          +1 pending jenkins

          Show
          wheat9 Haohui Mai added a comment - +1 pending jenkins
          Hide
          hadoopqa Hadoop QA added a comment -
          -1 overall



          Vote Subsystem Runtime Comment
          0 reexec 0m 0s Docker mode activated.
          +1 @author 0m 0s The patch does not contain any @author tags.
          +1 test4tests 0m 0s The patch appears to include 2 new or modified test files.
          +1 mvninstall 10m 52s trunk passed
          +1 compile 14m 44s trunk passed with JDK v1.8.0_66
          +1 compile 12m 36s trunk passed with JDK v1.7.0_85
          +1 checkstyle 1m 24s trunk passed
          +1 mvnsite 2m 41s trunk passed
          +1 mvneclipse 0m 37s trunk passed
          -1 findbugs 2m 33s hadoop-common-project/hadoop-common in trunk has 1 extant Findbugs warnings.
          +1 javadoc 3m 15s trunk passed with JDK v1.8.0_66
          +1 javadoc 4m 10s trunk passed with JDK v1.7.0_85
          +1 mvninstall 3m 17s the patch passed
          +1 compile 14m 37s the patch passed with JDK v1.8.0_66
          +1 javac 14m 37s the patch passed
          +1 compile 13m 46s the patch passed with JDK v1.7.0_85
          +1 javac 13m 46s the patch passed
          +1 checkstyle 1m 38s the patch passed
          +1 mvnsite 3m 7s the patch passed
          +1 mvneclipse 0m 45s the patch passed
          +1 whitespace 0m 0s Patch has no whitespace issues.
          +1 findbugs 6m 54s the patch passed
          +1 javadoc 3m 41s the patch passed with JDK v1.8.0_66
          +1 javadoc 4m 19s the patch passed with JDK v1.7.0_85
          -1 unit 11m 45s hadoop-common in the patch failed with JDK v1.8.0_66.
          -1 unit 98m 11s hadoop-hdfs in the patch failed with JDK v1.8.0_66.
          -1 unit 9m 57s hadoop-common in the patch failed with JDK v1.7.0_85.
          -1 unit 78m 19s hadoop-hdfs in the patch failed with JDK v1.7.0_85.
          -1 asflicense 0m 28s Patch generated 56 ASF License warnings.
          308m 25s



          Reason Tests
          JDK v1.8.0_66 Failed junit tests hadoop.ipc.TestDecayRpcScheduler
            hadoop.fs.shell.find.TestName
            hadoop.fs.shell.find.TestIname
            hadoop.fs.shell.find.TestFind
            hadoop.test.TestTimedOutTestsListener
            hadoop.fs.shell.find.TestPrint
            hadoop.ipc.TestRPCWaitForProxy
            hadoop.tracing.TestTracing
            hadoop.hdfs.server.namenode.ha.TestDFSUpgradeWithHA
            hadoop.hdfs.server.namenode.ha.TestRequestHedgingProxyProvider
            hadoop.hdfs.security.TestDelegationTokenForProxyUser
            hadoop.hdfs.server.namenode.ha.TestSeveralNameNodes
            hadoop.hdfs.server.datanode.TestDirectoryScanner
            hadoop.hdfs.TestRecoverStripedFile
            hadoop.hdfs.server.namenode.TestDecommissioningStatus
            hadoop.hdfs.server.datanode.fsdataset.impl.TestLazyPersistReplicaRecovery
            hadoop.hdfs.server.namenode.ha.TestEditLogTailer
          JDK v1.7.0_85 Failed junit tests hadoop.metrics2.impl.TestMetricsSystemImpl
            hadoop.security.ssl.TestReloadingX509TrustManager
            hadoop.test.TestTimedOutTestsListener
            hadoop.hdfs.TestDFSStripedOutputStreamWithFailure160
            hadoop.hdfs.qjournal.TestSecureNNWithQJM
            hadoop.hdfs.server.datanode.TestDirectoryScanner
            hadoop.hdfs.server.namenode.TestCheckpoint
            hadoop.hdfs.TestDFSPermission
            hadoop.hdfs.server.namenode.snapshot.TestRenameWithSnapshots
            hadoop.hdfs.TestEncryptionZones



          Subsystem Report/Notes
          Docker Image:yetus/hadoop:0ca8df7
          JIRA Patch URL https://issues.apache.org/jira/secure/attachment/12774153/HDFS-9451.004.patch
          JIRA Issue HDFS-9451
          Optional Tests asflicense compile javac javadoc mvninstall mvnsite unit findbugs checkstyle
          uname Linux 3a1bc93afd56 3.13.0-36-lowlatency #63-Ubuntu SMP PREEMPT Wed Sep 3 21:56:12 UTC 2014 x86_64 x86_64 x86_64 GNU/Linux
          Build tool maven
          Personality /testptch/hadoop/patchprocess/precommit/personality/provided.sh
          git revision trunk / 977e0b3
          findbugs v3.0.0
          findbugs https://builds.apache.org/job/PreCommit-HDFS-Build/13645/artifact/patchprocess/branch-findbugs-hadoop-common-project_hadoop-common-warnings.html
          unit https://builds.apache.org/job/PreCommit-HDFS-Build/13645/artifact/patchprocess/patch-unit-hadoop-common-project_hadoop-common-jdk1.8.0_66.txt
          unit https://builds.apache.org/job/PreCommit-HDFS-Build/13645/artifact/patchprocess/patch-unit-hadoop-hdfs-project_hadoop-hdfs-jdk1.8.0_66.txt
          unit https://builds.apache.org/job/PreCommit-HDFS-Build/13645/artifact/patchprocess/patch-unit-hadoop-common-project_hadoop-common-jdk1.7.0_85.txt
          unit https://builds.apache.org/job/PreCommit-HDFS-Build/13645/artifact/patchprocess/patch-unit-hadoop-hdfs-project_hadoop-hdfs-jdk1.7.0_85.txt
          unit test logs https://builds.apache.org/job/PreCommit-HDFS-Build/13645/artifact/patchprocess/patch-unit-hadoop-common-project_hadoop-common-jdk1.8.0_66.txt https://builds.apache.org/job/PreCommit-HDFS-Build/13645/artifact/patchprocess/patch-unit-hadoop-hdfs-project_hadoop-hdfs-jdk1.8.0_66.txt https://builds.apache.org/job/PreCommit-HDFS-Build/13645/artifact/patchprocess/patch-unit-hadoop-common-project_hadoop-common-jdk1.7.0_85.txt https://builds.apache.org/job/PreCommit-HDFS-Build/13645/artifact/patchprocess/patch-unit-hadoop-hdfs-project_hadoop-hdfs-jdk1.7.0_85.txt
          JDK v1.7.0_85 Test Results https://builds.apache.org/job/PreCommit-HDFS-Build/13645/testReport/
          asflicense https://builds.apache.org/job/PreCommit-HDFS-Build/13645/artifact/patchprocess/patch-asflicense-problems.txt
          modules C: hadoop-common-project/hadoop-common hadoop-hdfs-project/hadoop-hdfs U: .
          Max memory used 76MB
          Powered by Apache Yetus http://yetus.apache.org
          Console output https://builds.apache.org/job/PreCommit-HDFS-Build/13645/console

          This message was automatically generated.

          Show
          hadoopqa Hadoop QA added a comment - -1 overall Vote Subsystem Runtime Comment 0 reexec 0m 0s Docker mode activated. +1 @author 0m 0s The patch does not contain any @author tags. +1 test4tests 0m 0s The patch appears to include 2 new or modified test files. +1 mvninstall 10m 52s trunk passed +1 compile 14m 44s trunk passed with JDK v1.8.0_66 +1 compile 12m 36s trunk passed with JDK v1.7.0_85 +1 checkstyle 1m 24s trunk passed +1 mvnsite 2m 41s trunk passed +1 mvneclipse 0m 37s trunk passed -1 findbugs 2m 33s hadoop-common-project/hadoop-common in trunk has 1 extant Findbugs warnings. +1 javadoc 3m 15s trunk passed with JDK v1.8.0_66 +1 javadoc 4m 10s trunk passed with JDK v1.7.0_85 +1 mvninstall 3m 17s the patch passed +1 compile 14m 37s the patch passed with JDK v1.8.0_66 +1 javac 14m 37s the patch passed +1 compile 13m 46s the patch passed with JDK v1.7.0_85 +1 javac 13m 46s the patch passed +1 checkstyle 1m 38s the patch passed +1 mvnsite 3m 7s the patch passed +1 mvneclipse 0m 45s the patch passed +1 whitespace 0m 0s Patch has no whitespace issues. +1 findbugs 6m 54s the patch passed +1 javadoc 3m 41s the patch passed with JDK v1.8.0_66 +1 javadoc 4m 19s the patch passed with JDK v1.7.0_85 -1 unit 11m 45s hadoop-common in the patch failed with JDK v1.8.0_66. -1 unit 98m 11s hadoop-hdfs in the patch failed with JDK v1.8.0_66. -1 unit 9m 57s hadoop-common in the patch failed with JDK v1.7.0_85. -1 unit 78m 19s hadoop-hdfs in the patch failed with JDK v1.7.0_85. -1 asflicense 0m 28s Patch generated 56 ASF License warnings. 308m 25s Reason Tests JDK v1.8.0_66 Failed junit tests hadoop.ipc.TestDecayRpcScheduler   hadoop.fs.shell.find.TestName   hadoop.fs.shell.find.TestIname   hadoop.fs.shell.find.TestFind   hadoop.test.TestTimedOutTestsListener   hadoop.fs.shell.find.TestPrint   hadoop.ipc.TestRPCWaitForProxy   hadoop.tracing.TestTracing   hadoop.hdfs.server.namenode.ha.TestDFSUpgradeWithHA   hadoop.hdfs.server.namenode.ha.TestRequestHedgingProxyProvider   hadoop.hdfs.security.TestDelegationTokenForProxyUser   hadoop.hdfs.server.namenode.ha.TestSeveralNameNodes   hadoop.hdfs.server.datanode.TestDirectoryScanner   hadoop.hdfs.TestRecoverStripedFile   hadoop.hdfs.server.namenode.TestDecommissioningStatus   hadoop.hdfs.server.datanode.fsdataset.impl.TestLazyPersistReplicaRecovery   hadoop.hdfs.server.namenode.ha.TestEditLogTailer JDK v1.7.0_85 Failed junit tests hadoop.metrics2.impl.TestMetricsSystemImpl   hadoop.security.ssl.TestReloadingX509TrustManager   hadoop.test.TestTimedOutTestsListener   hadoop.hdfs.TestDFSStripedOutputStreamWithFailure160   hadoop.hdfs.qjournal.TestSecureNNWithQJM   hadoop.hdfs.server.datanode.TestDirectoryScanner   hadoop.hdfs.server.namenode.TestCheckpoint   hadoop.hdfs.TestDFSPermission   hadoop.hdfs.server.namenode.snapshot.TestRenameWithSnapshots   hadoop.hdfs.TestEncryptionZones Subsystem Report/Notes Docker Image:yetus/hadoop:0ca8df7 JIRA Patch URL https://issues.apache.org/jira/secure/attachment/12774153/HDFS-9451.004.patch JIRA Issue HDFS-9451 Optional Tests asflicense compile javac javadoc mvninstall mvnsite unit findbugs checkstyle uname Linux 3a1bc93afd56 3.13.0-36-lowlatency #63-Ubuntu SMP PREEMPT Wed Sep 3 21:56:12 UTC 2014 x86_64 x86_64 x86_64 GNU/Linux Build tool maven Personality /testptch/hadoop/patchprocess/precommit/personality/provided.sh git revision trunk / 977e0b3 findbugs v3.0.0 findbugs https://builds.apache.org/job/PreCommit-HDFS-Build/13645/artifact/patchprocess/branch-findbugs-hadoop-common-project_hadoop-common-warnings.html unit https://builds.apache.org/job/PreCommit-HDFS-Build/13645/artifact/patchprocess/patch-unit-hadoop-common-project_hadoop-common-jdk1.8.0_66.txt unit https://builds.apache.org/job/PreCommit-HDFS-Build/13645/artifact/patchprocess/patch-unit-hadoop-hdfs-project_hadoop-hdfs-jdk1.8.0_66.txt unit https://builds.apache.org/job/PreCommit-HDFS-Build/13645/artifact/patchprocess/patch-unit-hadoop-common-project_hadoop-common-jdk1.7.0_85.txt unit https://builds.apache.org/job/PreCommit-HDFS-Build/13645/artifact/patchprocess/patch-unit-hadoop-hdfs-project_hadoop-hdfs-jdk1.7.0_85.txt unit test logs https://builds.apache.org/job/PreCommit-HDFS-Build/13645/artifact/patchprocess/patch-unit-hadoop-common-project_hadoop-common-jdk1.8.0_66.txt https://builds.apache.org/job/PreCommit-HDFS-Build/13645/artifact/patchprocess/patch-unit-hadoop-hdfs-project_hadoop-hdfs-jdk1.8.0_66.txt https://builds.apache.org/job/PreCommit-HDFS-Build/13645/artifact/patchprocess/patch-unit-hadoop-common-project_hadoop-common-jdk1.7.0_85.txt https://builds.apache.org/job/PreCommit-HDFS-Build/13645/artifact/patchprocess/patch-unit-hadoop-hdfs-project_hadoop-hdfs-jdk1.7.0_85.txt JDK v1.7.0_85 Test Results https://builds.apache.org/job/PreCommit-HDFS-Build/13645/testReport/ asflicense https://builds.apache.org/job/PreCommit-HDFS-Build/13645/artifact/patchprocess/patch-asflicense-problems.txt modules C: hadoop-common-project/hadoop-common hadoop-hdfs-project/hadoop-hdfs U: . Max memory used 76MB Powered by Apache Yetus http://yetus.apache.org Console output https://builds.apache.org/job/PreCommit-HDFS-Build/13645/console This message was automatically generated.
          Hide
          jojochuang Wei-Chiu Chuang added a comment -

          Most failures are due to file permission issue:

          Error while running command to get file permissions : ExitCodeException exitCode=137:
          at org.apache.hadoop.util.Shell.runCommand(Shell.java:912)
          at org.apache.hadoop.util.Shell.run(Shell.java:823)
          at org.apache.hadoop.util.Shell$ShellCommandExecutor.execute(Shell.java:1102)
          at org.apache.hadoop.util.Shell.execCommand(Shell.java:1196)
          at org.apache.hadoop.util.Shell.execCommand(Shell.java:1178)
          at org.apache.hadoop.fs.FileUtil.execCommand(FileUtil.java:1081)

          Let me check if they are related to this patch.

          Show
          jojochuang Wei-Chiu Chuang added a comment - Most failures are due to file permission issue: Error while running command to get file permissions : ExitCodeException exitCode=137: at org.apache.hadoop.util.Shell.runCommand(Shell.java:912) at org.apache.hadoop.util.Shell.run(Shell.java:823) at org.apache.hadoop.util.Shell$ShellCommandExecutor.execute(Shell.java:1102) at org.apache.hadoop.util.Shell.execCommand(Shell.java:1196) at org.apache.hadoop.util.Shell.execCommand(Shell.java:1178) at org.apache.hadoop.fs.FileUtil.execCommand(FileUtil.java:1081) Let me check if they are related to this patch.
          Hide
          jojochuang Wei-Chiu Chuang added a comment -

          exit code 137 implies the processes are killed with SIGKILL. So maybe it's not related. Reattach the patch to trigger precommit build again.

          Show
          jojochuang Wei-Chiu Chuang added a comment - exit code 137 implies the processes are killed with SIGKILL. So maybe it's not related. Reattach the patch to trigger precommit build again.
          Hide
          jojochuang Wei-Chiu Chuang added a comment -

          I am not seeing these test failures locally, by the way.

          Show
          jojochuang Wei-Chiu Chuang added a comment - I am not seeing these test failures locally, by the way.
          Hide
          hadoopqa Hadoop QA added a comment -
          -1 overall



          Vote Subsystem Runtime Comment
          0 reexec 0m 0s Docker mode activated.
          +1 @author 0m 0s The patch does not contain any @author tags.
          +1 test4tests 0m 0s The patch appears to include 2 new or modified test files.
          +1 mvninstall 8m 9s trunk passed
          +1 compile 8m 53s trunk passed with JDK v1.8.0_66
          +1 compile 9m 18s trunk passed with JDK v1.7.0_85
          +1 checkstyle 1m 1s trunk passed
          +1 mvnsite 2m 3s trunk passed
          +1 mvneclipse 0m 29s trunk passed
          -1 findbugs 1m 55s hadoop-common-project/hadoop-common in trunk has 1 extant Findbugs warnings.
          +1 javadoc 2m 6s trunk passed with JDK v1.8.0_66
          +1 javadoc 2m 59s trunk passed with JDK v1.7.0_85
          +1 mvninstall 2m 32s the patch passed
          +1 compile 8m 45s the patch passed with JDK v1.8.0_66
          +1 javac 8m 45s the patch passed
          +1 compile 9m 18s the patch passed with JDK v1.7.0_85
          +1 javac 9m 18s the patch passed
          +1 checkstyle 1m 2s the patch passed
          +1 mvnsite 2m 0s the patch passed
          +1 mvneclipse 0m 29s the patch passed
          +1 whitespace 0m 0s Patch has no whitespace issues.
          +1 findbugs 4m 12s the patch passed
          +1 javadoc 2m 10s the patch passed with JDK v1.8.0_66
          +1 javadoc 2m 56s the patch passed with JDK v1.7.0_85
          +1 unit 7m 47s hadoop-common in the patch passed with JDK v1.8.0_66.
          -1 unit 64m 48s hadoop-hdfs in the patch failed with JDK v1.8.0_66.
          -1 unit 9m 8s hadoop-common in the patch failed with JDK v1.7.0_85.
          -1 unit 60m 21s hadoop-hdfs in the patch failed with JDK v1.7.0_85.
          -1 asflicense 0m 23s Patch generated 58 ASF License warnings.
          216m 14s



          Reason Tests
          JDK v1.8.0_66 Failed junit tests hadoop.hdfs.server.datanode.TestDataNodeMetrics
          JDK v1.7.0_85 Failed junit tests hadoop.metrics2.impl.TestMetricsSystemImpl
            hadoop.fs.TestSymlinkLocalFSFileContext
            hadoop.hdfs.server.namenode.TestCacheDirectives



          Subsystem Report/Notes
          Docker Image:yetus/hadoop:0ca8df7
          JIRA Patch URL https://issues.apache.org/jira/secure/attachment/12774376/HDFS-9451.004.patch
          JIRA Issue HDFS-9451
          Optional Tests asflicense compile javac javadoc mvninstall mvnsite unit findbugs checkstyle
          uname Linux e57d39a5c9d1 3.13.0-36-lowlatency #63-Ubuntu SMP PREEMPT Wed Sep 3 21:56:12 UTC 2014 x86_64 x86_64 x86_64 GNU/Linux
          Build tool maven
          Personality /testptch/hadoop/patchprocess/precommit/personality/provided.sh
          git revision trunk / bab03f3
          findbugs v3.0.0
          findbugs https://builds.apache.org/job/PreCommit-HDFS-Build/13663/artifact/patchprocess/branch-findbugs-hadoop-common-project_hadoop-common-warnings.html
          unit https://builds.apache.org/job/PreCommit-HDFS-Build/13663/artifact/patchprocess/patch-unit-hadoop-hdfs-project_hadoop-hdfs-jdk1.8.0_66.txt
          unit https://builds.apache.org/job/PreCommit-HDFS-Build/13663/artifact/patchprocess/patch-unit-hadoop-common-project_hadoop-common-jdk1.7.0_85.txt
          unit https://builds.apache.org/job/PreCommit-HDFS-Build/13663/artifact/patchprocess/patch-unit-hadoop-hdfs-project_hadoop-hdfs-jdk1.7.0_85.txt
          unit test logs https://builds.apache.org/job/PreCommit-HDFS-Build/13663/artifact/patchprocess/patch-unit-hadoop-hdfs-project_hadoop-hdfs-jdk1.8.0_66.txt https://builds.apache.org/job/PreCommit-HDFS-Build/13663/artifact/patchprocess/patch-unit-hadoop-common-project_hadoop-common-jdk1.7.0_85.txt https://builds.apache.org/job/PreCommit-HDFS-Build/13663/artifact/patchprocess/patch-unit-hadoop-hdfs-project_hadoop-hdfs-jdk1.7.0_85.txt
          JDK v1.7.0_85 Test Results https://builds.apache.org/job/PreCommit-HDFS-Build/13663/testReport/
          asflicense https://builds.apache.org/job/PreCommit-HDFS-Build/13663/artifact/patchprocess/patch-asflicense-problems.txt
          modules C: hadoop-common-project/hadoop-common hadoop-hdfs-project/hadoop-hdfs U: .
          Max memory used 75MB
          Powered by Apache Yetus http://yetus.apache.org
          Console output https://builds.apache.org/job/PreCommit-HDFS-Build/13663/console

          This message was automatically generated.

          Show
          hadoopqa Hadoop QA added a comment - -1 overall Vote Subsystem Runtime Comment 0 reexec 0m 0s Docker mode activated. +1 @author 0m 0s The patch does not contain any @author tags. +1 test4tests 0m 0s The patch appears to include 2 new or modified test files. +1 mvninstall 8m 9s trunk passed +1 compile 8m 53s trunk passed with JDK v1.8.0_66 +1 compile 9m 18s trunk passed with JDK v1.7.0_85 +1 checkstyle 1m 1s trunk passed +1 mvnsite 2m 3s trunk passed +1 mvneclipse 0m 29s trunk passed -1 findbugs 1m 55s hadoop-common-project/hadoop-common in trunk has 1 extant Findbugs warnings. +1 javadoc 2m 6s trunk passed with JDK v1.8.0_66 +1 javadoc 2m 59s trunk passed with JDK v1.7.0_85 +1 mvninstall 2m 32s the patch passed +1 compile 8m 45s the patch passed with JDK v1.8.0_66 +1 javac 8m 45s the patch passed +1 compile 9m 18s the patch passed with JDK v1.7.0_85 +1 javac 9m 18s the patch passed +1 checkstyle 1m 2s the patch passed +1 mvnsite 2m 0s the patch passed +1 mvneclipse 0m 29s the patch passed +1 whitespace 0m 0s Patch has no whitespace issues. +1 findbugs 4m 12s the patch passed +1 javadoc 2m 10s the patch passed with JDK v1.8.0_66 +1 javadoc 2m 56s the patch passed with JDK v1.7.0_85 +1 unit 7m 47s hadoop-common in the patch passed with JDK v1.8.0_66. -1 unit 64m 48s hadoop-hdfs in the patch failed with JDK v1.8.0_66. -1 unit 9m 8s hadoop-common in the patch failed with JDK v1.7.0_85. -1 unit 60m 21s hadoop-hdfs in the patch failed with JDK v1.7.0_85. -1 asflicense 0m 23s Patch generated 58 ASF License warnings. 216m 14s Reason Tests JDK v1.8.0_66 Failed junit tests hadoop.hdfs.server.datanode.TestDataNodeMetrics JDK v1.7.0_85 Failed junit tests hadoop.metrics2.impl.TestMetricsSystemImpl   hadoop.fs.TestSymlinkLocalFSFileContext   hadoop.hdfs.server.namenode.TestCacheDirectives Subsystem Report/Notes Docker Image:yetus/hadoop:0ca8df7 JIRA Patch URL https://issues.apache.org/jira/secure/attachment/12774376/HDFS-9451.004.patch JIRA Issue HDFS-9451 Optional Tests asflicense compile javac javadoc mvninstall mvnsite unit findbugs checkstyle uname Linux e57d39a5c9d1 3.13.0-36-lowlatency #63-Ubuntu SMP PREEMPT Wed Sep 3 21:56:12 UTC 2014 x86_64 x86_64 x86_64 GNU/Linux Build tool maven Personality /testptch/hadoop/patchprocess/precommit/personality/provided.sh git revision trunk / bab03f3 findbugs v3.0.0 findbugs https://builds.apache.org/job/PreCommit-HDFS-Build/13663/artifact/patchprocess/branch-findbugs-hadoop-common-project_hadoop-common-warnings.html unit https://builds.apache.org/job/PreCommit-HDFS-Build/13663/artifact/patchprocess/patch-unit-hadoop-hdfs-project_hadoop-hdfs-jdk1.8.0_66.txt unit https://builds.apache.org/job/PreCommit-HDFS-Build/13663/artifact/patchprocess/patch-unit-hadoop-common-project_hadoop-common-jdk1.7.0_85.txt unit https://builds.apache.org/job/PreCommit-HDFS-Build/13663/artifact/patchprocess/patch-unit-hadoop-hdfs-project_hadoop-hdfs-jdk1.7.0_85.txt unit test logs https://builds.apache.org/job/PreCommit-HDFS-Build/13663/artifact/patchprocess/patch-unit-hadoop-hdfs-project_hadoop-hdfs-jdk1.8.0_66.txt https://builds.apache.org/job/PreCommit-HDFS-Build/13663/artifact/patchprocess/patch-unit-hadoop-common-project_hadoop-common-jdk1.7.0_85.txt https://builds.apache.org/job/PreCommit-HDFS-Build/13663/artifact/patchprocess/patch-unit-hadoop-hdfs-project_hadoop-hdfs-jdk1.7.0_85.txt JDK v1.7.0_85 Test Results https://builds.apache.org/job/PreCommit-HDFS-Build/13663/testReport/ asflicense https://builds.apache.org/job/PreCommit-HDFS-Build/13663/artifact/patchprocess/patch-asflicense-problems.txt modules C: hadoop-common-project/hadoop-common hadoop-hdfs-project/hadoop-hdfs U: . Max memory used 75MB Powered by Apache Yetus http://yetus.apache.org Console output https://builds.apache.org/job/PreCommit-HDFS-Build/13663/console This message was automatically generated.
          Hide
          jojochuang Wei-Chiu Chuang added a comment -

          The findbugs warning is likely a bug in Yetus. The variable oldUmask was removed already and shouldn't cause the warning.

          testSetTimesSymlinkToDir had failed before so likely flaky.
          testQSize is also a flaky one that appear quite frequently.
          testExceedsCapacity is flaky too.

          Show
          jojochuang Wei-Chiu Chuang added a comment - The findbugs warning is likely a bug in Yetus. The variable oldUmask was removed already and shouldn't cause the warning. testSetTimesSymlinkToDir had failed before so likely flaky. testQSize is also a flaky one that appear quite frequently. testExceedsCapacity is flaky too.
          Hide
          wheat9 Haohui Mai added a comment -

          LGTM. +1. Committing.

          Show
          wheat9 Haohui Mai added a comment - LGTM. +1. Committing.
          Hide
          wheat9 Haohui Mai added a comment -

          I've committed the patch to trunk. Thanks Wei-Chiu Chuang for the contribution.

          Show
          wheat9 Haohui Mai added a comment - I've committed the patch to trunk. Thanks Wei-Chiu Chuang for the contribution.
          Hide
          jojochuang Wei-Chiu Chuang added a comment -
          Show
          jojochuang Wei-Chiu Chuang added a comment - Thanks Haohui Mai Chang Li Tsuyoshi Ozawa Chris Nauroth for the reviews!
          Hide
          hudson Hudson added a comment -

          FAILURE: Integrated in Hadoop-trunk-Commit #8892 (See https://builds.apache.org/job/Hadoop-trunk-Commit/8892/)
          HDFS-9451. Clean up depreated umasks and related unit tests. Contributed (wheat9: rev b21dffb1fec376784810af89cfc9cc05e5f781ce)

          • hadoop-hdfs-project/hadoop-hdfs/src/test/java/org/apache/hadoop/security/TestPermission.java
          • hadoop-common-project/hadoop-common/src/test/java/org/apache/hadoop/fs/permission/TestFsPermission.java
          • hadoop-common-project/hadoop-common/src/main/java/org/apache/hadoop/fs/permission/FsPermission.java
          • hadoop-hdfs-project/hadoop-hdfs/CHANGES.txt
          Show
          hudson Hudson added a comment - FAILURE: Integrated in Hadoop-trunk-Commit #8892 (See https://builds.apache.org/job/Hadoop-trunk-Commit/8892/ ) HDFS-9451 . Clean up depreated umasks and related unit tests. Contributed (wheat9: rev b21dffb1fec376784810af89cfc9cc05e5f781ce) hadoop-hdfs-project/hadoop-hdfs/src/test/java/org/apache/hadoop/security/TestPermission.java hadoop-common-project/hadoop-common/src/test/java/org/apache/hadoop/fs/permission/TestFsPermission.java hadoop-common-project/hadoop-common/src/main/java/org/apache/hadoop/fs/permission/FsPermission.java hadoop-hdfs-project/hadoop-hdfs/CHANGES.txt
          Hide
          hudson Hudson added a comment -

          FAILURE: Integrated in Hadoop-Yarn-trunk-Java8 #735 (See https://builds.apache.org/job/Hadoop-Yarn-trunk-Java8/735/)
          HDFS-9451. Clean up depreated umasks and related unit tests. Contributed (wheat9: rev b21dffb1fec376784810af89cfc9cc05e5f781ce)

          • hadoop-hdfs-project/hadoop-hdfs/src/test/java/org/apache/hadoop/security/TestPermission.java
          • hadoop-hdfs-project/hadoop-hdfs/CHANGES.txt
          • hadoop-common-project/hadoop-common/src/main/java/org/apache/hadoop/fs/permission/FsPermission.java
          • hadoop-common-project/hadoop-common/src/test/java/org/apache/hadoop/fs/permission/TestFsPermission.java
          Show
          hudson Hudson added a comment - FAILURE: Integrated in Hadoop-Yarn-trunk-Java8 #735 (See https://builds.apache.org/job/Hadoop-Yarn-trunk-Java8/735/ ) HDFS-9451 . Clean up depreated umasks and related unit tests. Contributed (wheat9: rev b21dffb1fec376784810af89cfc9cc05e5f781ce) hadoop-hdfs-project/hadoop-hdfs/src/test/java/org/apache/hadoop/security/TestPermission.java hadoop-hdfs-project/hadoop-hdfs/CHANGES.txt hadoop-common-project/hadoop-common/src/main/java/org/apache/hadoop/fs/permission/FsPermission.java hadoop-common-project/hadoop-common/src/test/java/org/apache/hadoop/fs/permission/TestFsPermission.java
          Hide
          hudson Hudson added a comment -

          FAILURE: Integrated in Hadoop-Mapreduce-trunk-Java8 #724 (See https://builds.apache.org/job/Hadoop-Mapreduce-trunk-Java8/724/)
          HDFS-9451. Clean up depreated umasks and related unit tests. Contributed (wheat9: rev b21dffb1fec376784810af89cfc9cc05e5f781ce)

          • hadoop-common-project/hadoop-common/src/test/java/org/apache/hadoop/fs/permission/TestFsPermission.java
          • hadoop-hdfs-project/hadoop-hdfs/src/test/java/org/apache/hadoop/security/TestPermission.java
          • hadoop-common-project/hadoop-common/src/main/java/org/apache/hadoop/fs/permission/FsPermission.java
          • hadoop-hdfs-project/hadoop-hdfs/CHANGES.txt
          Show
          hudson Hudson added a comment - FAILURE: Integrated in Hadoop-Mapreduce-trunk-Java8 #724 (See https://builds.apache.org/job/Hadoop-Mapreduce-trunk-Java8/724/ ) HDFS-9451 . Clean up depreated umasks and related unit tests. Contributed (wheat9: rev b21dffb1fec376784810af89cfc9cc05e5f781ce) hadoop-common-project/hadoop-common/src/test/java/org/apache/hadoop/fs/permission/TestFsPermission.java hadoop-hdfs-project/hadoop-hdfs/src/test/java/org/apache/hadoop/security/TestPermission.java hadoop-common-project/hadoop-common/src/main/java/org/apache/hadoop/fs/permission/FsPermission.java hadoop-hdfs-project/hadoop-hdfs/CHANGES.txt
          Hide
          hudson Hudson added a comment -

          SUCCESS: Integrated in Hadoop-Yarn-trunk #1456 (See https://builds.apache.org/job/Hadoop-Yarn-trunk/1456/)
          HDFS-9451. Clean up depreated umasks and related unit tests. Contributed (wheat9: rev b21dffb1fec376784810af89cfc9cc05e5f781ce)

          • hadoop-hdfs-project/hadoop-hdfs/CHANGES.txt
          • hadoop-common-project/hadoop-common/src/main/java/org/apache/hadoop/fs/permission/FsPermission.java
          • hadoop-hdfs-project/hadoop-hdfs/src/test/java/org/apache/hadoop/security/TestPermission.java
          • hadoop-common-project/hadoop-common/src/test/java/org/apache/hadoop/fs/permission/TestFsPermission.java
          Show
          hudson Hudson added a comment - SUCCESS: Integrated in Hadoop-Yarn-trunk #1456 (See https://builds.apache.org/job/Hadoop-Yarn-trunk/1456/ ) HDFS-9451 . Clean up depreated umasks and related unit tests. Contributed (wheat9: rev b21dffb1fec376784810af89cfc9cc05e5f781ce) hadoop-hdfs-project/hadoop-hdfs/CHANGES.txt hadoop-common-project/hadoop-common/src/main/java/org/apache/hadoop/fs/permission/FsPermission.java hadoop-hdfs-project/hadoop-hdfs/src/test/java/org/apache/hadoop/security/TestPermission.java hadoop-common-project/hadoop-common/src/test/java/org/apache/hadoop/fs/permission/TestFsPermission.java
          Hide
          hudson Hudson added a comment -

          FAILURE: Integrated in Hadoop-Mapreduce-trunk #2667 (See https://builds.apache.org/job/Hadoop-Mapreduce-trunk/2667/)
          HDFS-9451. Clean up depreated umasks and related unit tests. Contributed (wheat9: rev b21dffb1fec376784810af89cfc9cc05e5f781ce)

          • hadoop-hdfs-project/hadoop-hdfs/CHANGES.txt
          • hadoop-common-project/hadoop-common/src/test/java/org/apache/hadoop/fs/permission/TestFsPermission.java
          • hadoop-hdfs-project/hadoop-hdfs/src/test/java/org/apache/hadoop/security/TestPermission.java
          • hadoop-common-project/hadoop-common/src/main/java/org/apache/hadoop/fs/permission/FsPermission.java
          Show
          hudson Hudson added a comment - FAILURE: Integrated in Hadoop-Mapreduce-trunk #2667 (See https://builds.apache.org/job/Hadoop-Mapreduce-trunk/2667/ ) HDFS-9451 . Clean up depreated umasks and related unit tests. Contributed (wheat9: rev b21dffb1fec376784810af89cfc9cc05e5f781ce) hadoop-hdfs-project/hadoop-hdfs/CHANGES.txt hadoop-common-project/hadoop-common/src/test/java/org/apache/hadoop/fs/permission/TestFsPermission.java hadoop-hdfs-project/hadoop-hdfs/src/test/java/org/apache/hadoop/security/TestPermission.java hadoop-common-project/hadoop-common/src/main/java/org/apache/hadoop/fs/permission/FsPermission.java
          Hide
          hudson Hudson added a comment -

          FAILURE: Integrated in Hadoop-Hdfs-trunk-Java8 #644 (See https://builds.apache.org/job/Hadoop-Hdfs-trunk-Java8/644/)
          HDFS-9451. Clean up depreated umasks and related unit tests. Contributed (wheat9: rev b21dffb1fec376784810af89cfc9cc05e5f781ce)

          • hadoop-common-project/hadoop-common/src/test/java/org/apache/hadoop/fs/permission/TestFsPermission.java
          • hadoop-common-project/hadoop-common/src/main/java/org/apache/hadoop/fs/permission/FsPermission.java
          • hadoop-hdfs-project/hadoop-hdfs/CHANGES.txt
          • hadoop-hdfs-project/hadoop-hdfs/src/test/java/org/apache/hadoop/security/TestPermission.java
          Show
          hudson Hudson added a comment - FAILURE: Integrated in Hadoop-Hdfs-trunk-Java8 #644 (See https://builds.apache.org/job/Hadoop-Hdfs-trunk-Java8/644/ ) HDFS-9451 . Clean up depreated umasks and related unit tests. Contributed (wheat9: rev b21dffb1fec376784810af89cfc9cc05e5f781ce) hadoop-common-project/hadoop-common/src/test/java/org/apache/hadoop/fs/permission/TestFsPermission.java hadoop-common-project/hadoop-common/src/main/java/org/apache/hadoop/fs/permission/FsPermission.java hadoop-hdfs-project/hadoop-hdfs/CHANGES.txt hadoop-hdfs-project/hadoop-hdfs/src/test/java/org/apache/hadoop/security/TestPermission.java
          Hide
          hudson Hudson added a comment -

          FAILURE: Integrated in Hadoop-Hdfs-trunk #2581 (See https://builds.apache.org/job/Hadoop-Hdfs-trunk/2581/)
          HDFS-9451. Clean up depreated umasks and related unit tests. Contributed (wheat9: rev b21dffb1fec376784810af89cfc9cc05e5f781ce)

          • hadoop-common-project/hadoop-common/src/main/java/org/apache/hadoop/fs/permission/FsPermission.java
          • hadoop-hdfs-project/hadoop-hdfs/CHANGES.txt
          • hadoop-common-project/hadoop-common/src/test/java/org/apache/hadoop/fs/permission/TestFsPermission.java
          • hadoop-hdfs-project/hadoop-hdfs/src/test/java/org/apache/hadoop/security/TestPermission.java
          Show
          hudson Hudson added a comment - FAILURE: Integrated in Hadoop-Hdfs-trunk #2581 (See https://builds.apache.org/job/Hadoop-Hdfs-trunk/2581/ ) HDFS-9451 . Clean up depreated umasks and related unit tests. Contributed (wheat9: rev b21dffb1fec376784810af89cfc9cc05e5f781ce) hadoop-common-project/hadoop-common/src/main/java/org/apache/hadoop/fs/permission/FsPermission.java hadoop-hdfs-project/hadoop-hdfs/CHANGES.txt hadoop-common-project/hadoop-common/src/test/java/org/apache/hadoop/fs/permission/TestFsPermission.java hadoop-hdfs-project/hadoop-hdfs/src/test/java/org/apache/hadoop/security/TestPermission.java

            People

            • Assignee:
              jojochuang Wei-Chiu Chuang
              Reporter:
              jojochuang Wei-Chiu Chuang
            • Votes:
              0 Vote for this issue
              Watchers:
              8 Start watching this issue

              Dates

              • Created:
                Updated:
                Resolved:

                Development