Uploaded image for project: 'Hadoop HDFS'
  1. Hadoop HDFS
  2. HDFS-9423

Fix intermittent failure of TestEditLogTailer

    Details

    • Type: Bug
    • Status: Resolved
    • Priority: Minor
    • Resolution: Fixed
    • Affects Version/s: None
    • Fix Version/s: 3.0.0-alpha1
    • Component/s: test
    • Labels:
      None
    • Target Version/s:
    • Hadoop Flags:
      Reviewed

      Description

      TestEditLogTailer sometimes fails because EditLogTailer could exhausts retries before one of the NameNode become active. Maximum retries should be increased to use short tailing period for tests.

      1. HDFS-9423.001.patch
        1 kB
        Masatake Iwasaki

        Issue Links

          Activity

          Hide
          hudson Hudson added a comment -

          FAILURE: Integrated in Hadoop-Hdfs-trunk #2574 (See https://builds.apache.org/job/Hadoop-Hdfs-trunk/2574/)
          CHANGES.txt: move HDFS-9423 to trunk (waltersu4549: rev f80dc6f49989d9228c7043304ae5b2198219f375)

          • hadoop-hdfs-project/hadoop-hdfs/CHANGES.txt
          Show
          hudson Hudson added a comment - FAILURE: Integrated in Hadoop-Hdfs-trunk #2574 (See https://builds.apache.org/job/Hadoop-Hdfs-trunk/2574/ ) CHANGES.txt: move HDFS-9423 to trunk (waltersu4549: rev f80dc6f49989d9228c7043304ae5b2198219f375) hadoop-hdfs-project/hadoop-hdfs/CHANGES.txt
          Hide
          hudson Hudson added a comment -

          ABORTED: Integrated in Hadoop-Hdfs-trunk-Java8 #636 (See https://builds.apache.org/job/Hadoop-Hdfs-trunk-Java8/636/)
          CHANGES.txt: move HDFS-9423 to trunk (waltersu4549: rev f80dc6f49989d9228c7043304ae5b2198219f375)

          • hadoop-hdfs-project/hadoop-hdfs/CHANGES.txt
          Show
          hudson Hudson added a comment - ABORTED: Integrated in Hadoop-Hdfs-trunk-Java8 #636 (See https://builds.apache.org/job/Hadoop-Hdfs-trunk-Java8/636/ ) CHANGES.txt: move HDFS-9423 to trunk (waltersu4549: rev f80dc6f49989d9228c7043304ae5b2198219f375) hadoop-hdfs-project/hadoop-hdfs/CHANGES.txt
          Hide
          hudson Hudson added a comment -

          SUCCESS: Integrated in Hadoop-Yarn-trunk #1443 (See https://builds.apache.org/job/Hadoop-Yarn-trunk/1443/)
          CHANGES.txt: move HDFS-9423 to trunk (waltersu4549: rev f80dc6f49989d9228c7043304ae5b2198219f375)

          • hadoop-hdfs-project/hadoop-hdfs/CHANGES.txt
          Show
          hudson Hudson added a comment - SUCCESS: Integrated in Hadoop-Yarn-trunk #1443 (See https://builds.apache.org/job/Hadoop-Yarn-trunk/1443/ ) CHANGES.txt: move HDFS-9423 to trunk (waltersu4549: rev f80dc6f49989d9228c7043304ae5b2198219f375) hadoop-hdfs-project/hadoop-hdfs/CHANGES.txt
          Hide
          hudson Hudson added a comment -

          FAILURE: Integrated in Hadoop-Mapreduce-trunk #2652 (See https://builds.apache.org/job/Hadoop-Mapreduce-trunk/2652/)
          CHANGES.txt: move HDFS-9423 to trunk (waltersu4549: rev f80dc6f49989d9228c7043304ae5b2198219f375)

          • hadoop-hdfs-project/hadoop-hdfs/CHANGES.txt
          Show
          hudson Hudson added a comment - FAILURE: Integrated in Hadoop-Mapreduce-trunk #2652 (See https://builds.apache.org/job/Hadoop-Mapreduce-trunk/2652/ ) CHANGES.txt: move HDFS-9423 to trunk (waltersu4549: rev f80dc6f49989d9228c7043304ae5b2198219f375) hadoop-hdfs-project/hadoop-hdfs/CHANGES.txt
          Hide
          hudson Hudson added a comment -

          FAILURE: Integrated in Hadoop-Yarn-trunk-Java8 #721 (See https://builds.apache.org/job/Hadoop-Yarn-trunk-Java8/721/)
          CHANGES.txt: move HDFS-9423 to trunk (waltersu4549: rev f80dc6f49989d9228c7043304ae5b2198219f375)

          • hadoop-hdfs-project/hadoop-hdfs/CHANGES.txt
          Show
          hudson Hudson added a comment - FAILURE: Integrated in Hadoop-Yarn-trunk-Java8 #721 (See https://builds.apache.org/job/Hadoop-Yarn-trunk-Java8/721/ ) CHANGES.txt: move HDFS-9423 to trunk (waltersu4549: rev f80dc6f49989d9228c7043304ae5b2198219f375) hadoop-hdfs-project/hadoop-hdfs/CHANGES.txt
          Hide
          hudson Hudson added a comment -

          FAILURE: Integrated in Hadoop-Mapreduce-trunk-Java8 #710 (See https://builds.apache.org/job/Hadoop-Mapreduce-trunk-Java8/710/)
          CHANGES.txt: move HDFS-9423 to trunk (waltersu4549: rev f80dc6f49989d9228c7043304ae5b2198219f375)

          • hadoop-hdfs-project/hadoop-hdfs/CHANGES.txt
          Show
          hudson Hudson added a comment - FAILURE: Integrated in Hadoop-Mapreduce-trunk-Java8 #710 (See https://builds.apache.org/job/Hadoop-Mapreduce-trunk-Java8/710/ ) CHANGES.txt: move HDFS-9423 to trunk (waltersu4549: rev f80dc6f49989d9228c7043304ae5b2198219f375) hadoop-hdfs-project/hadoop-hdfs/CHANGES.txt
          Hide
          hudson Hudson added a comment -

          FAILURE: Integrated in Hadoop-trunk-Commit #8870 (See https://builds.apache.org/job/Hadoop-trunk-Commit/8870/)
          CHANGES.txt: move HDFS-9423 to trunk (waltersu4549: rev f80dc6f49989d9228c7043304ae5b2198219f375)

          • hadoop-hdfs-project/hadoop-hdfs/CHANGES.txt
          Show
          hudson Hudson added a comment - FAILURE: Integrated in Hadoop-trunk-Commit #8870 (See https://builds.apache.org/job/Hadoop-trunk-Commit/8870/ ) CHANGES.txt: move HDFS-9423 to trunk (waltersu4549: rev f80dc6f49989d9228c7043304ae5b2198219f375) hadoop-hdfs-project/hadoop-hdfs/CHANGES.txt
          Hide
          walter.k.su Walter Su added a comment -

          The relevant code added by HDFS-6440 is trunk only. I'm adding link in case of backporting it to branch-2 later.

          You are right, my mistake. And thanks Steve Loughran for taking care of this.

          Close again, target 3.0.0.

          Show
          walter.k.su Walter Su added a comment - The relevant code added by HDFS-6440 is trunk only. I'm adding link in case of backporting it to branch-2 later. You are right, my mistake. And thanks Steve Loughran for taking care of this. Close again, target 3.0.0.
          Hide
          hudson Hudson added a comment -

          FAILURE: Integrated in Hadoop-Hdfs-trunk #2570 (See https://builds.apache.org/job/Hadoop-Hdfs-trunk/2570/)
          HDFS-9423. Fix intermittent failure of TestEditLogTailer. Contributed by (waltersu4549: rev 201f14e2714895ad8262507f5b9deb3521770e91)

          • hadoop-hdfs-project/hadoop-hdfs/src/test/java/org/apache/hadoop/hdfs/server/namenode/ha/TestEditLogTailer.java
          • hadoop-hdfs-project/hadoop-hdfs/CHANGES.txt
          Show
          hudson Hudson added a comment - FAILURE: Integrated in Hadoop-Hdfs-trunk #2570 (See https://builds.apache.org/job/Hadoop-Hdfs-trunk/2570/ ) HDFS-9423 . Fix intermittent failure of TestEditLogTailer. Contributed by (waltersu4549: rev 201f14e2714895ad8262507f5b9deb3521770e91) hadoop-hdfs-project/hadoop-hdfs/src/test/java/org/apache/hadoop/hdfs/server/namenode/ha/TestEditLogTailer.java hadoop-hdfs-project/hadoop-hdfs/CHANGES.txt
          Hide
          hudson Hudson added a comment -

          FAILURE: Integrated in Hadoop-Hdfs-trunk-Java8 #631 (See https://builds.apache.org/job/Hadoop-Hdfs-trunk-Java8/631/)
          HDFS-9423. Fix intermittent failure of TestEditLogTailer. Contributed by (waltersu4549: rev 201f14e2714895ad8262507f5b9deb3521770e91)

          • hadoop-hdfs-project/hadoop-hdfs/CHANGES.txt
          • hadoop-hdfs-project/hadoop-hdfs/src/test/java/org/apache/hadoop/hdfs/server/namenode/ha/TestEditLogTailer.java
          Show
          hudson Hudson added a comment - FAILURE: Integrated in Hadoop-Hdfs-trunk-Java8 #631 (See https://builds.apache.org/job/Hadoop-Hdfs-trunk-Java8/631/ ) HDFS-9423 . Fix intermittent failure of TestEditLogTailer. Contributed by (waltersu4549: rev 201f14e2714895ad8262507f5b9deb3521770e91) hadoop-hdfs-project/hadoop-hdfs/CHANGES.txt hadoop-hdfs-project/hadoop-hdfs/src/test/java/org/apache/hadoop/hdfs/server/namenode/ha/TestEditLogTailer.java
          Hide
          stevel@apache.org Steve Loughran added a comment -

          Let''s close this one again

          Show
          stevel@apache.org Steve Loughran added a comment - Let''s close this one again
          Hide
          iwasakims Masatake Iwasaki added a comment -

          Thanks Walter Su and Steve Loughran.

          The relevant code added by HDFS-6440 is trunk only. I'm adding link in case of backporting it to branch-2 later.

          Show
          iwasakims Masatake Iwasaki added a comment - Thanks Walter Su and Steve Loughran . The relevant code added by HDFS-6440 is trunk only. I'm adding link in case of backporting it to branch-2 later.
          Hide
          hudson Hudson added a comment -

          SUCCESS: Integrated in Hadoop-Yarn-trunk #1437 (See https://builds.apache.org/job/Hadoop-Yarn-trunk/1437/)
          HDFS-9423. Fix intermittent failure of TestEditLogTailer. Contributed by (waltersu4549: rev 201f14e2714895ad8262507f5b9deb3521770e91)

          • hadoop-hdfs-project/hadoop-hdfs/src/test/java/org/apache/hadoop/hdfs/server/namenode/ha/TestEditLogTailer.java
          • hadoop-hdfs-project/hadoop-hdfs/CHANGES.txt
          Show
          hudson Hudson added a comment - SUCCESS: Integrated in Hadoop-Yarn-trunk #1437 (See https://builds.apache.org/job/Hadoop-Yarn-trunk/1437/ ) HDFS-9423 . Fix intermittent failure of TestEditLogTailer. Contributed by (waltersu4549: rev 201f14e2714895ad8262507f5b9deb3521770e91) hadoop-hdfs-project/hadoop-hdfs/src/test/java/org/apache/hadoop/hdfs/server/namenode/ha/TestEditLogTailer.java hadoop-hdfs-project/hadoop-hdfs/CHANGES.txt
          Hide
          hudson Hudson added a comment -

          FAILURE: Integrated in Hadoop-Yarn-trunk-Java8 #714 (See https://builds.apache.org/job/Hadoop-Yarn-trunk-Java8/714/)
          HDFS-9423. Fix intermittent failure of TestEditLogTailer. Contributed by (waltersu4549: rev 201f14e2714895ad8262507f5b9deb3521770e91)

          • hadoop-hdfs-project/hadoop-hdfs/CHANGES.txt
          • hadoop-hdfs-project/hadoop-hdfs/src/test/java/org/apache/hadoop/hdfs/server/namenode/ha/TestEditLogTailer.java
          Show
          hudson Hudson added a comment - FAILURE: Integrated in Hadoop-Yarn-trunk-Java8 #714 (See https://builds.apache.org/job/Hadoop-Yarn-trunk-Java8/714/ ) HDFS-9423 . Fix intermittent failure of TestEditLogTailer. Contributed by (waltersu4549: rev 201f14e2714895ad8262507f5b9deb3521770e91) hadoop-hdfs-project/hadoop-hdfs/CHANGES.txt hadoop-hdfs-project/hadoop-hdfs/src/test/java/org/apache/hadoop/hdfs/server/namenode/ha/TestEditLogTailer.java
          Hide
          stevel@apache.org Steve Loughran added a comment -

          Backport to branch 2 breaks the build.

          [INFO] ------------------------------------------------------------------------
          [INFO] BUILD FAILURE
          [INFO] ------------------------------------------------------------------------
          [INFO] Total time: 54.827 s
          [INFO] Finished at: 2015-11-23T12:19:41+00:00
          [INFO] Final Memory: 111M/899M
          [INFO] ------------------------------------------------------------------------
          [ERROR] Failed to execute goal org.apache.maven.plugins:maven-compiler-plugin:3.1:testCompile (default-testCompile) on project hadoop-hdfs: Compilation failure: Compilation failure:
          [ERROR] /Users/stevel/Projects/Hortonworks/Projects/hadoop-trunk/hadoop-hdfs-project/hadoop-hdfs/src/test/java/org/apache/hadoop/hdfs/server/namenode/ha/TestEditLogTailer.java:[63,30] cannot find symbol
          [ERROR] symbol:   variable DFS_HA_TAILEDITS_ALL_NAMESNODES_RETRY_KEY
          [ERROR] location: class org.apache.hadoop.hdfs.DFSConfigKeys
          [ERROR] /Users/stevel/Projects/Hortonworks/Projects/hadoop-trunk/hadoop-hdfs-project/hadoop-hdfs/src/test/java/org/apache/hadoop/hdfs/server/namenode/ha/TestEditLogTailer.java:[124,30] cannot find symbol
          [ERROR] symbol:   variable DFS_HA_TAILEDITS_ALL_NAMESNODES_RETRY_KEY
          [ERROR] location: class org.apache.hadoop.hdfs.DFSConfigKeys
          [ERROR] -> [Help 1]
          

          reverting the patch in branch-2; if we need it in there it'll need an expanded patch.

          ps: now that yetus can test branch-2 patches too, we shouldn't be having this problem

          Show
          stevel@apache.org Steve Loughran added a comment - Backport to branch 2 breaks the build. [INFO] ------------------------------------------------------------------------ [INFO] BUILD FAILURE [INFO] ------------------------------------------------------------------------ [INFO] Total time: 54.827 s [INFO] Finished at: 2015-11-23T12:19:41+00:00 [INFO] Final Memory: 111M/899M [INFO] ------------------------------------------------------------------------ [ERROR] Failed to execute goal org.apache.maven.plugins:maven-compiler-plugin:3.1:testCompile ( default -testCompile) on project hadoop-hdfs: Compilation failure: Compilation failure: [ERROR] /Users/stevel/Projects/Hortonworks/Projects/hadoop-trunk/hadoop-hdfs-project/hadoop-hdfs/src/test/java/org/apache/hadoop/hdfs/server/namenode/ha/TestEditLogTailer.java:[63,30] cannot find symbol [ERROR] symbol: variable DFS_HA_TAILEDITS_ALL_NAMESNODES_RETRY_KEY [ERROR] location: class org.apache.hadoop.hdfs.DFSConfigKeys [ERROR] /Users/stevel/Projects/Hortonworks/Projects/hadoop-trunk/hadoop-hdfs-project/hadoop-hdfs/src/test/java/org/apache/hadoop/hdfs/server/namenode/ha/TestEditLogTailer.java:[124,30] cannot find symbol [ERROR] symbol: variable DFS_HA_TAILEDITS_ALL_NAMESNODES_RETRY_KEY [ERROR] location: class org.apache.hadoop.hdfs.DFSConfigKeys [ERROR] -> [Help 1] reverting the patch in branch-2; if we need it in there it'll need an expanded patch. ps: now that yetus can test branch-2 patches too, we shouldn't be having this problem
          Hide
          hudson Hudson added a comment -

          FAILURE: Integrated in Hadoop-Mapreduce-trunk #2644 (See https://builds.apache.org/job/Hadoop-Mapreduce-trunk/2644/)
          HDFS-9423. Fix intermittent failure of TestEditLogTailer. Contributed by (waltersu4549: rev 201f14e2714895ad8262507f5b9deb3521770e91)

          • hadoop-hdfs-project/hadoop-hdfs/src/test/java/org/apache/hadoop/hdfs/server/namenode/ha/TestEditLogTailer.java
          • hadoop-hdfs-project/hadoop-hdfs/CHANGES.txt
          Show
          hudson Hudson added a comment - FAILURE: Integrated in Hadoop-Mapreduce-trunk #2644 (See https://builds.apache.org/job/Hadoop-Mapreduce-trunk/2644/ ) HDFS-9423 . Fix intermittent failure of TestEditLogTailer. Contributed by (waltersu4549: rev 201f14e2714895ad8262507f5b9deb3521770e91) hadoop-hdfs-project/hadoop-hdfs/src/test/java/org/apache/hadoop/hdfs/server/namenode/ha/TestEditLogTailer.java hadoop-hdfs-project/hadoop-hdfs/CHANGES.txt
          Hide
          hudson Hudson added a comment -

          FAILURE: Integrated in Hadoop-Mapreduce-trunk-Java8 #703 (See https://builds.apache.org/job/Hadoop-Mapreduce-trunk-Java8/703/)
          HDFS-9423. Fix intermittent failure of TestEditLogTailer. Contributed by (waltersu4549: rev 201f14e2714895ad8262507f5b9deb3521770e91)

          • hadoop-hdfs-project/hadoop-hdfs/src/test/java/org/apache/hadoop/hdfs/server/namenode/ha/TestEditLogTailer.java
          • hadoop-hdfs-project/hadoop-hdfs/CHANGES.txt
          Show
          hudson Hudson added a comment - FAILURE: Integrated in Hadoop-Mapreduce-trunk-Java8 #703 (See https://builds.apache.org/job/Hadoop-Mapreduce-trunk-Java8/703/ ) HDFS-9423 . Fix intermittent failure of TestEditLogTailer. Contributed by (waltersu4549: rev 201f14e2714895ad8262507f5b9deb3521770e91) hadoop-hdfs-project/hadoop-hdfs/src/test/java/org/apache/hadoop/hdfs/server/namenode/ha/TestEditLogTailer.java hadoop-hdfs-project/hadoop-hdfs/CHANGES.txt
          Hide
          hudson Hudson added a comment -

          FAILURE: Integrated in Hadoop-trunk-Commit #8861 (See https://builds.apache.org/job/Hadoop-trunk-Commit/8861/)
          HDFS-9423. Fix intermittent failure of TestEditLogTailer. Contributed by (waltersu4549: rev 201f14e2714895ad8262507f5b9deb3521770e91)

          • hadoop-hdfs-project/hadoop-hdfs/CHANGES.txt
          • hadoop-hdfs-project/hadoop-hdfs/src/test/java/org/apache/hadoop/hdfs/server/namenode/ha/TestEditLogTailer.java
          Show
          hudson Hudson added a comment - FAILURE: Integrated in Hadoop-trunk-Commit #8861 (See https://builds.apache.org/job/Hadoop-trunk-Commit/8861/ ) HDFS-9423 . Fix intermittent failure of TestEditLogTailer. Contributed by (waltersu4549: rev 201f14e2714895ad8262507f5b9deb3521770e91) hadoop-hdfs-project/hadoop-hdfs/CHANGES.txt hadoop-hdfs-project/hadoop-hdfs/src/test/java/org/apache/hadoop/hdfs/server/namenode/ha/TestEditLogTailer.java
          Hide
          walter.k.su Walter Su added a comment -

          I've committed the patch to trunk and branch-2. Thanks Masatake Iwasaki for the contribution.

          Show
          walter.k.su Walter Su added a comment - I've committed the patch to trunk and branch-2. Thanks Masatake Iwasaki for the contribution.
          Hide
          walter.k.su Walter Su added a comment -

          +1.

          Link the testReport

          Show
          walter.k.su Walter Su added a comment - +1. Link the testReport
          Hide
          hadoopqa Hadoop QA added a comment -
          -1 overall



          Vote Subsystem Runtime Comment
          0 reexec 0m 8s docker + precommit patch detected.
          +1 @author 0m 0s The patch does not contain any @author tags.
          +1 test4tests 0m 0s The patch appears to include 1 new or modified test files.
          +1 mvninstall 3m 18s trunk passed
          +1 compile 0m 40s trunk passed with JDK v1.8.0_66
          +1 compile 0m 37s trunk passed with JDK v1.7.0_79
          +1 checkstyle 0m 18s trunk passed
          +1 mvnsite 0m 54s trunk passed
          +1 mvneclipse 0m 21s trunk passed
          +1 findbugs 2m 17s trunk passed
          +1 javadoc 1m 42s trunk passed with JDK v1.8.0_66
          +1 javadoc 2m 49s trunk passed with JDK v1.7.0_79
          +1 mvninstall 1m 1s the patch passed
          +1 compile 0m 45s the patch passed with JDK v1.8.0_66
          +1 javac 0m 45s the patch passed
          +1 compile 0m 39s the patch passed with JDK v1.7.0_79
          +1 javac 0m 39s the patch passed
          +1 checkstyle 0m 19s the patch passed
          +1 mvnsite 1m 1s the patch passed
          +1 mvneclipse 0m 15s the patch passed
          +1 whitespace 0m 0s Patch has no whitespace issues.
          +1 findbugs 2m 51s the patch passed
          +1 javadoc 2m 2s the patch passed with JDK v1.8.0_66
          +1 javadoc 2m 19s the patch passed with JDK v1.7.0_79
          -1 unit 90m 8s hadoop-hdfs in the patch failed with JDK v1.8.0_66.
          -1 unit 78m 19s hadoop-hdfs in the patch failed with JDK v1.7.0_79.
          -1 asflicense 0m 26s Patch generated 56 ASF License warnings.
          196m 48s



          Reason Tests
          JDK v1.8.0_66 Failed junit tests hadoop.hdfs.TestReplaceDatanodeOnFailure
            hadoop.hdfs.TestQuota
            hadoop.hdfs.TestCrcCorruption
            hadoop.hdfs.server.blockmanagement.TestBlockTokenWithDFSStriped
            hadoop.hdfs.server.datanode.TestDataNodeVolumeFailure
            hadoop.hdfs.server.datanode.TestBlockReplacement
            hadoop.hdfs.TestDFSStripedOutputStreamWithFailure070
            hadoop.hdfs.TestEncryptionZones
            hadoop.hdfs.server.datanode.fsdataset.impl.TestLazyPersistReplicaRecovery
            hadoop.hdfs.server.datanode.TestDirectoryScanner
          JDK v1.7.0_79 Failed junit tests hadoop.hdfs.TestDFSStripedOutputStreamWithFailure
            hadoop.hdfs.server.namenode.ha.TestDNFencing
            hadoop.hdfs.TestGetBlocks
            hadoop.hdfs.TestSafeMode
            hadoop.hdfs.TestWriteReadStripedFile
            hadoop.hdfs.server.namenode.TestFileTruncate
            hadoop.hdfs.server.datanode.TestDirectoryScanner



          Subsystem Report/Notes
          Docker Client=1.7.0 Server=1.7.0 Image:test-patch-base-hadoop-date2015-11-13
          JIRA Patch URL https://issues.apache.org/jira/secure/attachment/12772156/HDFS-9423.001.patch
          JIRA Issue HDFS-9423
          Optional Tests asflicense compile javac javadoc mvninstall mvnsite unit findbugs checkstyle
          uname Linux 6f0e8b240e75 3.13.0-36-lowlatency #63-Ubuntu SMP PREEMPT Wed Sep 3 21:56:12 UTC 2014 x86_64 x86_64 x86_64 GNU/Linux
          Build tool maven
          Personality /home/jenkins/jenkins-slave/workspace/PreCommit-HDFS-Build/patchprocess/apache-yetus-fa12328/precommit/personality/hadoop.sh
          git revision trunk / cccf884
          findbugs v3.0.0
          unit https://builds.apache.org/job/PreCommit-HDFS-Build/13501/artifact/patchprocess/patch-unit-hadoop-hdfs-project_hadoop-hdfs-jdk1.8.0_66.txt
          unit https://builds.apache.org/job/PreCommit-HDFS-Build/13501/artifact/patchprocess/patch-unit-hadoop-hdfs-project_hadoop-hdfs-jdk1.7.0_79.txt
          unit test logs https://builds.apache.org/job/PreCommit-HDFS-Build/13501/artifact/patchprocess/patch-unit-hadoop-hdfs-project_hadoop-hdfs-jdk1.8.0_66.txt https://builds.apache.org/job/PreCommit-HDFS-Build/13501/artifact/patchprocess/patch-unit-hadoop-hdfs-project_hadoop-hdfs-jdk1.7.0_79.txt
          JDK v1.7.0_79 Test Results https://builds.apache.org/job/PreCommit-HDFS-Build/13501/testReport/
          asflicense https://builds.apache.org/job/PreCommit-HDFS-Build/13501/artifact/patchprocess/patch-asflicense-problems.txt
          modules C: hadoop-hdfs-project/hadoop-hdfs U: hadoop-hdfs-project/hadoop-hdfs
          Max memory used 227MB
          Powered by Apache Yetus http://yetus.apache.org
          Console output https://builds.apache.org/job/PreCommit-HDFS-Build/13501/console

          This message was automatically generated.

          Show
          hadoopqa Hadoop QA added a comment - -1 overall Vote Subsystem Runtime Comment 0 reexec 0m 8s docker + precommit patch detected. +1 @author 0m 0s The patch does not contain any @author tags. +1 test4tests 0m 0s The patch appears to include 1 new or modified test files. +1 mvninstall 3m 18s trunk passed +1 compile 0m 40s trunk passed with JDK v1.8.0_66 +1 compile 0m 37s trunk passed with JDK v1.7.0_79 +1 checkstyle 0m 18s trunk passed +1 mvnsite 0m 54s trunk passed +1 mvneclipse 0m 21s trunk passed +1 findbugs 2m 17s trunk passed +1 javadoc 1m 42s trunk passed with JDK v1.8.0_66 +1 javadoc 2m 49s trunk passed with JDK v1.7.0_79 +1 mvninstall 1m 1s the patch passed +1 compile 0m 45s the patch passed with JDK v1.8.0_66 +1 javac 0m 45s the patch passed +1 compile 0m 39s the patch passed with JDK v1.7.0_79 +1 javac 0m 39s the patch passed +1 checkstyle 0m 19s the patch passed +1 mvnsite 1m 1s the patch passed +1 mvneclipse 0m 15s the patch passed +1 whitespace 0m 0s Patch has no whitespace issues. +1 findbugs 2m 51s the patch passed +1 javadoc 2m 2s the patch passed with JDK v1.8.0_66 +1 javadoc 2m 19s the patch passed with JDK v1.7.0_79 -1 unit 90m 8s hadoop-hdfs in the patch failed with JDK v1.8.0_66. -1 unit 78m 19s hadoop-hdfs in the patch failed with JDK v1.7.0_79. -1 asflicense 0m 26s Patch generated 56 ASF License warnings. 196m 48s Reason Tests JDK v1.8.0_66 Failed junit tests hadoop.hdfs.TestReplaceDatanodeOnFailure   hadoop.hdfs.TestQuota   hadoop.hdfs.TestCrcCorruption   hadoop.hdfs.server.blockmanagement.TestBlockTokenWithDFSStriped   hadoop.hdfs.server.datanode.TestDataNodeVolumeFailure   hadoop.hdfs.server.datanode.TestBlockReplacement   hadoop.hdfs.TestDFSStripedOutputStreamWithFailure070   hadoop.hdfs.TestEncryptionZones   hadoop.hdfs.server.datanode.fsdataset.impl.TestLazyPersistReplicaRecovery   hadoop.hdfs.server.datanode.TestDirectoryScanner JDK v1.7.0_79 Failed junit tests hadoop.hdfs.TestDFSStripedOutputStreamWithFailure   hadoop.hdfs.server.namenode.ha.TestDNFencing   hadoop.hdfs.TestGetBlocks   hadoop.hdfs.TestSafeMode   hadoop.hdfs.TestWriteReadStripedFile   hadoop.hdfs.server.namenode.TestFileTruncate   hadoop.hdfs.server.datanode.TestDirectoryScanner Subsystem Report/Notes Docker Client=1.7.0 Server=1.7.0 Image:test-patch-base-hadoop-date2015-11-13 JIRA Patch URL https://issues.apache.org/jira/secure/attachment/12772156/HDFS-9423.001.patch JIRA Issue HDFS-9423 Optional Tests asflicense compile javac javadoc mvninstall mvnsite unit findbugs checkstyle uname Linux 6f0e8b240e75 3.13.0-36-lowlatency #63-Ubuntu SMP PREEMPT Wed Sep 3 21:56:12 UTC 2014 x86_64 x86_64 x86_64 GNU/Linux Build tool maven Personality /home/jenkins/jenkins-slave/workspace/PreCommit-HDFS-Build/patchprocess/apache-yetus-fa12328/precommit/personality/hadoop.sh git revision trunk / cccf884 findbugs v3.0.0 unit https://builds.apache.org/job/PreCommit-HDFS-Build/13501/artifact/patchprocess/patch-unit-hadoop-hdfs-project_hadoop-hdfs-jdk1.8.0_66.txt unit https://builds.apache.org/job/PreCommit-HDFS-Build/13501/artifact/patchprocess/patch-unit-hadoop-hdfs-project_hadoop-hdfs-jdk1.7.0_79.txt unit test logs https://builds.apache.org/job/PreCommit-HDFS-Build/13501/artifact/patchprocess/patch-unit-hadoop-hdfs-project_hadoop-hdfs-jdk1.8.0_66.txt https://builds.apache.org/job/PreCommit-HDFS-Build/13501/artifact/patchprocess/patch-unit-hadoop-hdfs-project_hadoop-hdfs-jdk1.7.0_79.txt JDK v1.7.0_79 Test Results https://builds.apache.org/job/PreCommit-HDFS-Build/13501/testReport/ asflicense https://builds.apache.org/job/PreCommit-HDFS-Build/13501/artifact/patchprocess/patch-asflicense-problems.txt modules C: hadoop-hdfs-project/hadoop-hdfs U: hadoop-hdfs-project/hadoop-hdfs Max memory used 227MB Powered by Apache Yetus http://yetus.apache.org Console output https://builds.apache.org/job/PreCommit-HDFS-Build/13501/console This message was automatically generated.

            People

            • Assignee:
              iwasakims Masatake Iwasaki
              Reporter:
              iwasakims Masatake Iwasaki
            • Votes:
              0 Vote for this issue
              Watchers:
              7 Start watching this issue

              Dates

              • Created:
                Updated:
                Resolved:

                Development