Uploaded image for project: 'Hadoop HDFS'
  1. Hadoop HDFS
  2. HDFS-9410

Some tests should always reset sysout and syserr

    Details

    • Type: Test
    • Status: Resolved
    • Priority: Minor
    • Resolution: Fixed
    • Affects Version/s: None
    • Fix Version/s: 2.8.0, 3.0.0-alpha1
    • Component/s: test
    • Labels:
      None
    • Target Version/s:

      Description

      Originally found in TestDFSAdminWithHA#tearDown where System.out.flush() throws an NPE.
      The cause is that if for any reason setUpHaCluster fails before storing System.out and System.err as member variables originOut and originErr, then in tearDown System.out and System.err are set to null. This could cause all following tests to fail when calling flush.

      This jira tries to fix all similar occurrences of this issue

      1. HDFS-9410.001.patch
        0.9 kB
        Xiao Chen
      2. HDFS-9410.002.patch
        2 kB
        Xiao Chen
      3. HDFS-9410.003.patch
        20 kB
        Xiao Chen

        Activity

        Hide
        xiaochen Xiao Chen added a comment -

        Attached patch 001 for the fix.

        Show
        xiaochen Xiao Chen added a comment - Attached patch 001 for the fix.
        Hide
        hadoopqa Hadoop QA added a comment -
        -1 overall



        Vote Subsystem Runtime Comment
        0 reexec 0m 5s docker + precommit patch detected.
        +1 @author 0m 0s The patch does not contain any @author tags.
        +1 test4tests 0m 0s The patch appears to include 1 new or modified test files.
        +1 mvninstall 3m 0s trunk passed
        +1 compile 0m 32s trunk passed with JDK v1.8.0_60
        +1 compile 0m 33s trunk passed with JDK v1.7.0_79
        +1 checkstyle 0m 17s trunk passed
        +1 mvneclipse 0m 14s trunk passed
        +1 findbugs 1m 58s trunk passed
        +1 javadoc 1m 8s trunk passed with JDK v1.8.0_60
        +1 javadoc 1m 46s trunk passed with JDK v1.7.0_79
        +1 mvninstall 0m 39s the patch passed
        +1 compile 0m 33s the patch passed with JDK v1.8.0_60
        +1 javac 0m 33s the patch passed
        +1 compile 0m 33s the patch passed with JDK v1.7.0_79
        +1 javac 0m 33s the patch passed
        +1 checkstyle 0m 16s the patch passed
        +1 mvneclipse 0m 13s the patch passed
        +1 whitespace 0m 0s Patch has no whitespace issues.
        +1 findbugs 2m 8s the patch passed
        +1 javadoc 1m 7s the patch passed with JDK v1.8.0_60
        +1 javadoc 1m 47s the patch passed with JDK v1.7.0_79
        -1 unit 52m 4s hadoop-hdfs in the patch failed with JDK v1.8.0_60.
        -1 unit 50m 4s hadoop-hdfs in the patch failed with JDK v1.7.0_79.
        -1 asflicense 0m 19s Patch generated 58 ASF License warnings.
        121m 47s



        Reason Tests
        JDK v1.8.0_60 Failed junit tests hadoop.hdfs.shortcircuit.TestShortCircuitCache
          hadoop.hdfs.server.namenode.ha.TestSeveralNameNodes
        JDK v1.7.0_79 Failed junit tests hadoop.hdfs.server.blockmanagement.TestNodeCount
          hadoop.hdfs.server.namenode.ha.TestHASafeMode



        Subsystem Report/Notes
        Docker Client=1.7.1 Server=1.7.1 Image:test-patch-base-hadoop-date2015-11-11
        JIRA Patch URL https://issues.apache.org/jira/secure/attachment/12771682/HDFS-9410.001.patch
        JIRA Issue HDFS-9410
        Optional Tests asflicense javac javadoc mvninstall unit findbugs checkstyle compile
        uname Linux 5edbc3dbcc8f 3.13.0-36-lowlatency #63-Ubuntu SMP PREEMPT Wed Sep 3 21:56:12 UTC 2014 x86_64 x86_64 x86_64 GNU/Linux
        Build tool maven
        Personality /home/jenkins/jenkins-slave/workspace/PreCommit-HDFS-Build@2/patchprocess/apache-yetus-ee5baeb/precommit/personality/hadoop.sh
        git revision trunk / 6e4562b
        Default Java 1.7.0_79
        Multi-JDK versions /usr/lib/jvm/java-8-oracle:1.8.0_60 /usr/lib/jvm/java-7-openjdk-amd64:1.7.0_79
        findbugs v3.0.0
        unit https://builds.apache.org/job/PreCommit-HDFS-Build/13470/artifact/patchprocess/patch-unit-hadoop-hdfs-project_hadoop-hdfs-jdk1.8.0_60.txt
        unit https://builds.apache.org/job/PreCommit-HDFS-Build/13470/artifact/patchprocess/patch-unit-hadoop-hdfs-project_hadoop-hdfs-jdk1.7.0_79.txt
        unit test logs https://builds.apache.org/job/PreCommit-HDFS-Build/13470/artifact/patchprocess/patch-unit-hadoop-hdfs-project_hadoop-hdfs-jdk1.8.0_60.txt https://builds.apache.org/job/PreCommit-HDFS-Build/13470/artifact/patchprocess/patch-unit-hadoop-hdfs-project_hadoop-hdfs-jdk1.7.0_79.txt
        JDK v1.7.0_79 Test Results https://builds.apache.org/job/PreCommit-HDFS-Build/13470/testReport/
        asflicense https://builds.apache.org/job/PreCommit-HDFS-Build/13470/artifact/patchprocess/patch-asflicense-problems.txt
        modules C: hadoop-hdfs-project/hadoop-hdfs U: hadoop-hdfs-project/hadoop-hdfs
        Max memory used 226MB
        Powered by Apache Yetus http://yetus.apache.org
        Console output https://builds.apache.org/job/PreCommit-HDFS-Build/13470/console

        This message was automatically generated.

        Show
        hadoopqa Hadoop QA added a comment - -1 overall Vote Subsystem Runtime Comment 0 reexec 0m 5s docker + precommit patch detected. +1 @author 0m 0s The patch does not contain any @author tags. +1 test4tests 0m 0s The patch appears to include 1 new or modified test files. +1 mvninstall 3m 0s trunk passed +1 compile 0m 32s trunk passed with JDK v1.8.0_60 +1 compile 0m 33s trunk passed with JDK v1.7.0_79 +1 checkstyle 0m 17s trunk passed +1 mvneclipse 0m 14s trunk passed +1 findbugs 1m 58s trunk passed +1 javadoc 1m 8s trunk passed with JDK v1.8.0_60 +1 javadoc 1m 46s trunk passed with JDK v1.7.0_79 +1 mvninstall 0m 39s the patch passed +1 compile 0m 33s the patch passed with JDK v1.8.0_60 +1 javac 0m 33s the patch passed +1 compile 0m 33s the patch passed with JDK v1.7.0_79 +1 javac 0m 33s the patch passed +1 checkstyle 0m 16s the patch passed +1 mvneclipse 0m 13s the patch passed +1 whitespace 0m 0s Patch has no whitespace issues. +1 findbugs 2m 8s the patch passed +1 javadoc 1m 7s the patch passed with JDK v1.8.0_60 +1 javadoc 1m 47s the patch passed with JDK v1.7.0_79 -1 unit 52m 4s hadoop-hdfs in the patch failed with JDK v1.8.0_60. -1 unit 50m 4s hadoop-hdfs in the patch failed with JDK v1.7.0_79. -1 asflicense 0m 19s Patch generated 58 ASF License warnings. 121m 47s Reason Tests JDK v1.8.0_60 Failed junit tests hadoop.hdfs.shortcircuit.TestShortCircuitCache   hadoop.hdfs.server.namenode.ha.TestSeveralNameNodes JDK v1.7.0_79 Failed junit tests hadoop.hdfs.server.blockmanagement.TestNodeCount   hadoop.hdfs.server.namenode.ha.TestHASafeMode Subsystem Report/Notes Docker Client=1.7.1 Server=1.7.1 Image:test-patch-base-hadoop-date2015-11-11 JIRA Patch URL https://issues.apache.org/jira/secure/attachment/12771682/HDFS-9410.001.patch JIRA Issue HDFS-9410 Optional Tests asflicense javac javadoc mvninstall unit findbugs checkstyle compile uname Linux 5edbc3dbcc8f 3.13.0-36-lowlatency #63-Ubuntu SMP PREEMPT Wed Sep 3 21:56:12 UTC 2014 x86_64 x86_64 x86_64 GNU/Linux Build tool maven Personality /home/jenkins/jenkins-slave/workspace/PreCommit-HDFS-Build@2/patchprocess/apache-yetus-ee5baeb/precommit/personality/hadoop.sh git revision trunk / 6e4562b Default Java 1.7.0_79 Multi-JDK versions /usr/lib/jvm/java-8-oracle:1.8.0_60 /usr/lib/jvm/java-7-openjdk-amd64:1.7.0_79 findbugs v3.0.0 unit https://builds.apache.org/job/PreCommit-HDFS-Build/13470/artifact/patchprocess/patch-unit-hadoop-hdfs-project_hadoop-hdfs-jdk1.8.0_60.txt unit https://builds.apache.org/job/PreCommit-HDFS-Build/13470/artifact/patchprocess/patch-unit-hadoop-hdfs-project_hadoop-hdfs-jdk1.7.0_79.txt unit test logs https://builds.apache.org/job/PreCommit-HDFS-Build/13470/artifact/patchprocess/patch-unit-hadoop-hdfs-project_hadoop-hdfs-jdk1.8.0_60.txt https://builds.apache.org/job/PreCommit-HDFS-Build/13470/artifact/patchprocess/patch-unit-hadoop-hdfs-project_hadoop-hdfs-jdk1.7.0_79.txt JDK v1.7.0_79 Test Results https://builds.apache.org/job/PreCommit-HDFS-Build/13470/testReport/ asflicense https://builds.apache.org/job/PreCommit-HDFS-Build/13470/artifact/patchprocess/patch-asflicense-problems.txt modules C: hadoop-hdfs-project/hadoop-hdfs U: hadoop-hdfs-project/hadoop-hdfs Max memory used 226MB Powered by Apache Yetus http://yetus.apache.org Console output https://builds.apache.org/job/PreCommit-HDFS-Build/13470/console This message was automatically generated.
        Hide
        walter.k.su Walter Su added a comment -

        Fortunately we fork a JVM for each test class. I think we still need to fix this to avoid System.out pollution in other test cases in same class.
        It's just I think can we backup originOut at class level?

          private static final PrintStream originOut = System.out;
          private static final PrintStream originErr = System.err;
        

        And I really don't trust System.err.flush(); won't throw any unexpected runtime exception. So I think can we put the restore code in a "finally{ //here }"?

        Just some thought, if you don't agree. Anyway, the patch looks good to me.

        Show
        walter.k.su Walter Su added a comment - Fortunately we fork a JVM for each test class. I think we still need to fix this to avoid System.out pollution in other test cases in same class. It's just I think can we backup originOut at class level? private static final PrintStream originOut = System .out; private static final PrintStream originErr = System .err; And I really don't trust System.err.flush(); won't throw any unexpected runtime exception. So I think can we put the restore code in a "finally{ //here }"? Just some thought, if you don't agree. Anyway, the patch looks good to me.
        Hide
        xiaochen Xiao Chen added a comment -

        Thanks very much Walter for looking into this! Your comments makes sense, patch 002 attached reflexes them.
        I think this fixes it for the TestDFSAdminWithHA class, and if we see similar issue in other test classes we can file separate JIRAs to fix.

        Show
        xiaochen Xiao Chen added a comment - Thanks very much Walter for looking into this! Your comments makes sense, patch 002 attached reflexes them. I think this fixes it for the TestDFSAdminWithHA class, and if we see similar issue in other test classes we can file separate JIRAs to fix.
        Hide
        hadoopqa Hadoop QA added a comment -
        -1 overall



        Vote Subsystem Runtime Comment
        0 reexec 0m 8s docker + precommit patch detected.
        +1 @author 0m 0s The patch does not contain any @author tags.
        +1 test4tests 0m 0s The patch appears to include 1 new or modified test files.
        +1 mvninstall 3m 23s trunk passed
        +1 compile 0m 44s trunk passed with JDK v1.8.0_66
        +1 compile 0m 38s trunk passed with JDK v1.7.0_79
        +1 checkstyle 0m 18s trunk passed
        +1 mvneclipse 0m 16s trunk passed
        +1 findbugs 2m 18s trunk passed
        +1 javadoc 1m 22s trunk passed with JDK v1.8.0_66
        +1 javadoc 2m 13s trunk passed with JDK v1.7.0_79
        +1 mvninstall 0m 46s the patch passed
        +1 compile 0m 42s the patch passed with JDK v1.8.0_66
        +1 javac 0m 42s the patch passed
        +1 compile 0m 38s the patch passed with JDK v1.7.0_79
        +1 javac 0m 38s the patch passed
        +1 checkstyle 0m 19s the patch passed
        +1 mvneclipse 0m 15s the patch passed
        +1 whitespace 0m 0s Patch has no whitespace issues.
        +1 findbugs 2m 30s the patch passed
        +1 javadoc 1m 24s the patch passed with JDK v1.8.0_66
        +1 javadoc 2m 21s the patch passed with JDK v1.7.0_79
        -1 unit 77m 31s hadoop-hdfs in the patch failed with JDK v1.8.0_66.
        -1 unit 77m 26s hadoop-hdfs in the patch failed with JDK v1.7.0_79.
        -1 asflicense 0m 22s Patch generated 56 ASF License warnings.
        178m 38s



        Reason Tests
        JDK v1.8.0_66 Failed junit tests hadoop.hdfs.server.namenode.ha.TestEditLogTailer
          hadoop.hdfs.security.TestDelegationTokenForProxyUser
          hadoop.hdfs.server.datanode.TestDataNodeVolumeFailure
          hadoop.hdfs.server.datanode.TestBlockReplacement
          hadoop.hdfs.server.namenode.TestNamenodeCapacityReport
        JDK v1.7.0_79 Failed junit tests hadoop.hdfs.security.TestDelegationTokenForProxyUser
          hadoop.hdfs.TestDFSStripedOutputStreamWithFailure160
          hadoop.hdfs.server.datanode.TestDataNodeHotSwapVolumes
          hadoop.hdfs.qjournal.client.TestQuorumJournalManager
          hadoop.hdfs.server.datanode.TestDirectoryScanner



        Subsystem Report/Notes
        Docker Client=1.7.0 Server=1.7.0 Image:test-patch-base-hadoop-date2015-11-11
        JIRA Patch URL https://issues.apache.org/jira/secure/attachment/12771794/HDFS-9410.002.patch
        JIRA Issue HDFS-9410
        Optional Tests asflicense javac javadoc mvninstall unit findbugs checkstyle compile
        uname Linux 5281d47b886e 3.13.0-36-lowlatency #63-Ubuntu SMP PREEMPT Wed Sep 3 21:56:12 UTC 2014 x86_64 x86_64 x86_64 GNU/Linux
        Build tool maven
        Personality /home/jenkins/jenkins-slave/workspace/PreCommit-HDFS-Build/patchprocess/apache-yetus-ee5baeb/precommit/personality/hadoop.sh
        git revision trunk / d907697
        Default Java 1.7.0_79
        Multi-JDK versions /usr/lib/jvm/java-8-oracle:1.8.0_66 /usr/lib/jvm/java-7-openjdk-amd64:1.7.0_79
        findbugs v3.0.0
        unit https://builds.apache.org/job/PreCommit-HDFS-Build/13477/artifact/patchprocess/patch-unit-hadoop-hdfs-project_hadoop-hdfs-jdk1.8.0_66.txt
        unit https://builds.apache.org/job/PreCommit-HDFS-Build/13477/artifact/patchprocess/patch-unit-hadoop-hdfs-project_hadoop-hdfs-jdk1.7.0_79.txt
        unit test logs https://builds.apache.org/job/PreCommit-HDFS-Build/13477/artifact/patchprocess/patch-unit-hadoop-hdfs-project_hadoop-hdfs-jdk1.8.0_66.txt https://builds.apache.org/job/PreCommit-HDFS-Build/13477/artifact/patchprocess/patch-unit-hadoop-hdfs-project_hadoop-hdfs-jdk1.7.0_79.txt
        JDK v1.7.0_79 Test Results https://builds.apache.org/job/PreCommit-HDFS-Build/13477/testReport/
        asflicense https://builds.apache.org/job/PreCommit-HDFS-Build/13477/artifact/patchprocess/patch-asflicense-problems.txt
        modules C: hadoop-hdfs-project/hadoop-hdfs U: hadoop-hdfs-project/hadoop-hdfs
        Max memory used 227MB
        Powered by Apache Yetus http://yetus.apache.org
        Console output https://builds.apache.org/job/PreCommit-HDFS-Build/13477/console

        This message was automatically generated.

        Show
        hadoopqa Hadoop QA added a comment - -1 overall Vote Subsystem Runtime Comment 0 reexec 0m 8s docker + precommit patch detected. +1 @author 0m 0s The patch does not contain any @author tags. +1 test4tests 0m 0s The patch appears to include 1 new or modified test files. +1 mvninstall 3m 23s trunk passed +1 compile 0m 44s trunk passed with JDK v1.8.0_66 +1 compile 0m 38s trunk passed with JDK v1.7.0_79 +1 checkstyle 0m 18s trunk passed +1 mvneclipse 0m 16s trunk passed +1 findbugs 2m 18s trunk passed +1 javadoc 1m 22s trunk passed with JDK v1.8.0_66 +1 javadoc 2m 13s trunk passed with JDK v1.7.0_79 +1 mvninstall 0m 46s the patch passed +1 compile 0m 42s the patch passed with JDK v1.8.0_66 +1 javac 0m 42s the patch passed +1 compile 0m 38s the patch passed with JDK v1.7.0_79 +1 javac 0m 38s the patch passed +1 checkstyle 0m 19s the patch passed +1 mvneclipse 0m 15s the patch passed +1 whitespace 0m 0s Patch has no whitespace issues. +1 findbugs 2m 30s the patch passed +1 javadoc 1m 24s the patch passed with JDK v1.8.0_66 +1 javadoc 2m 21s the patch passed with JDK v1.7.0_79 -1 unit 77m 31s hadoop-hdfs in the patch failed with JDK v1.8.0_66. -1 unit 77m 26s hadoop-hdfs in the patch failed with JDK v1.7.0_79. -1 asflicense 0m 22s Patch generated 56 ASF License warnings. 178m 38s Reason Tests JDK v1.8.0_66 Failed junit tests hadoop.hdfs.server.namenode.ha.TestEditLogTailer   hadoop.hdfs.security.TestDelegationTokenForProxyUser   hadoop.hdfs.server.datanode.TestDataNodeVolumeFailure   hadoop.hdfs.server.datanode.TestBlockReplacement   hadoop.hdfs.server.namenode.TestNamenodeCapacityReport JDK v1.7.0_79 Failed junit tests hadoop.hdfs.security.TestDelegationTokenForProxyUser   hadoop.hdfs.TestDFSStripedOutputStreamWithFailure160   hadoop.hdfs.server.datanode.TestDataNodeHotSwapVolumes   hadoop.hdfs.qjournal.client.TestQuorumJournalManager   hadoop.hdfs.server.datanode.TestDirectoryScanner Subsystem Report/Notes Docker Client=1.7.0 Server=1.7.0 Image:test-patch-base-hadoop-date2015-11-11 JIRA Patch URL https://issues.apache.org/jira/secure/attachment/12771794/HDFS-9410.002.patch JIRA Issue HDFS-9410 Optional Tests asflicense javac javadoc mvninstall unit findbugs checkstyle compile uname Linux 5281d47b886e 3.13.0-36-lowlatency #63-Ubuntu SMP PREEMPT Wed Sep 3 21:56:12 UTC 2014 x86_64 x86_64 x86_64 GNU/Linux Build tool maven Personality /home/jenkins/jenkins-slave/workspace/PreCommit-HDFS-Build/patchprocess/apache-yetus-ee5baeb/precommit/personality/hadoop.sh git revision trunk / d907697 Default Java 1.7.0_79 Multi-JDK versions /usr/lib/jvm/java-8-oracle:1.8.0_66 /usr/lib/jvm/java-7-openjdk-amd64:1.7.0_79 findbugs v3.0.0 unit https://builds.apache.org/job/PreCommit-HDFS-Build/13477/artifact/patchprocess/patch-unit-hadoop-hdfs-project_hadoop-hdfs-jdk1.8.0_66.txt unit https://builds.apache.org/job/PreCommit-HDFS-Build/13477/artifact/patchprocess/patch-unit-hadoop-hdfs-project_hadoop-hdfs-jdk1.7.0_79.txt unit test logs https://builds.apache.org/job/PreCommit-HDFS-Build/13477/artifact/patchprocess/patch-unit-hadoop-hdfs-project_hadoop-hdfs-jdk1.8.0_66.txt https://builds.apache.org/job/PreCommit-HDFS-Build/13477/artifact/patchprocess/patch-unit-hadoop-hdfs-project_hadoop-hdfs-jdk1.7.0_79.txt JDK v1.7.0_79 Test Results https://builds.apache.org/job/PreCommit-HDFS-Build/13477/testReport/ asflicense https://builds.apache.org/job/PreCommit-HDFS-Build/13477/artifact/patchprocess/patch-asflicense-problems.txt modules C: hadoop-hdfs-project/hadoop-hdfs U: hadoop-hdfs-project/hadoop-hdfs Max memory used 227MB Powered by Apache Yetus http://yetus.apache.org Console output https://builds.apache.org/job/PreCommit-HDFS-Build/13477/console This message was automatically generated.
        Hide
        walter.k.su Walter Su added a comment -

        I found 4 more places

        TestFsShellPermission.java:100:    System.setOut(out); // need try-finally
        TestMetadataVersionOutput.java:75:    System.setOut(stdOut);// need try-finally
        TestSnapshotRename.java:240:    System.setOut(psOut);  //need restore
        TestSnapshotDeletion.java:1047:    System.setOut(psOut);  //need restore
        
        Show
        walter.k.su Walter Su added a comment - I found 4 more places TestFsShellPermission.java:100: System.setOut(out); // need try-finally TestMetadataVersionOutput.java:75: System.setOut(stdOut);// need try-finally TestSnapshotRename.java:240: System.setOut(psOut); //need restore TestSnapshotDeletion.java:1047: System.setOut(psOut); //need restore
        Hide
        walter.k.su Walter Su added a comment -

        I didn't see TestDFSAdminWithHA failed these days. So this jira is for precaution, to fix error-prone code, do you mind fix all these places(maybe more than those listed above) together?

        Show
        walter.k.su Walter Su added a comment - I didn't see TestDFSAdminWithHA failed these days. So this jira is for precaution, to fix error-prone code, do you mind fix all these places(maybe more than those listed above) together?
        Hide
        xiaochen Xiao Chen added a comment -

        Hi Walter Su, here comes patch 003 which fixes all similar errors, including the 4 you mentioned above.
        I found this because TestDFSAdminWithHA failed for me, but your suggestion of fixing them altogether makes sense. Safer tests are favorable after all.
        I also updated the title and description of this JIRA.

        Show
        xiaochen Xiao Chen added a comment - Hi Walter Su , here comes patch 003 which fixes all similar errors, including the 4 you mentioned above. I found this because TestDFSAdminWithHA failed for me, but your suggestion of fixing them altogether makes sense. Safer tests are favorable after all. I also updated the title and description of this JIRA.
        Hide
        walter.k.su Walter Su added a comment -

        +1 pending jenkins.

        Show
        walter.k.su Walter Su added a comment - +1 pending jenkins.
        Hide
        xiaochen Xiao Chen added a comment -

        Seems jenkins run into some docker problems. Reattaching to trigger a new run...

        Show
        xiaochen Xiao Chen added a comment - Seems jenkins run into some docker problems . Reattaching to trigger a new run...
        Hide
        hadoopqa Hadoop QA added a comment -
        -1 overall



        Vote Subsystem Runtime Comment
        0 reexec 0m 9s docker + precommit patch detected.
        +1 @author 0m 0s The patch does not contain any @author tags.
        +1 test4tests 0m 0s The patch appears to include 11 new or modified test files.
        +1 mvninstall 3m 19s trunk passed
        +1 compile 0m 42s trunk passed with JDK v1.8.0_66
        +1 compile 0m 37s trunk passed with JDK v1.7.0_79
        +1 checkstyle 0m 18s trunk passed
        +1 mvnsite 0m 54s trunk passed
        +1 mvneclipse 0m 18s trunk passed
        +1 findbugs 2m 17s trunk passed
        +1 javadoc 1m 31s trunk passed with JDK v1.8.0_66
        +1 javadoc 2m 14s trunk passed with JDK v1.7.0_79
        +1 mvninstall 0m 48s the patch passed
        +1 compile 0m 43s the patch passed with JDK v1.8.0_66
        +1 javac 0m 43s the patch passed
        +1 compile 0m 49s the patch passed with JDK v1.7.0_79
        +1 javac 0m 49s the patch passed
        +1 checkstyle 0m 19s the patch passed
        +1 mvnsite 0m 54s the patch passed
        +1 mvneclipse 0m 16s the patch passed
        +1 whitespace 0m 0s Patch has no whitespace issues.
        +1 findbugs 2m 37s the patch passed
        +1 javadoc 1m 44s the patch passed with JDK v1.8.0_66
        +1 javadoc 2m 8s the patch passed with JDK v1.7.0_79
        -1 unit 82m 28s hadoop-hdfs in the patch failed with JDK v1.8.0_66.
        -1 unit 79m 29s hadoop-hdfs in the patch failed with JDK v1.7.0_79.
        -1 asflicense 0m 28s Patch generated 56 ASF License warnings.
        188m 26s



        Reason Tests
        JDK v1.8.0_66 Failed junit tests hadoop.hdfs.server.datanode.TestBlockScanner
          hadoop.hdfs.server.namenode.ha.TestEditLogTailer
          hadoop.hdfs.TestSetrepIncreasing
          hadoop.hdfs.security.TestDelegationTokenForProxyUser
          hadoop.hdfs.server.datanode.TestBlockReplacement
          hadoop.hdfs.server.namenode.ha.TestSeveralNameNodes
          hadoop.fs.TestSymlinkHdfsFileContext
          hadoop.hdfs.TestDFSStripedOutputStreamWithFailure000
        JDK v1.7.0_79 Failed junit tests hadoop.hdfs.server.namenode.ha.TestEditLogTailer
          hadoop.hdfs.security.TestDelegationTokenForProxyUser
          hadoop.hdfs.qjournal.TestSecureNNWithQJM
          hadoop.hdfs.server.datanode.fsdataset.impl.TestLazyPersistReplicaRecovery



        Subsystem Report/Notes
        Docker Client=1.7.0 Server=1.7.0 Image:test-patch-base-hadoop-date2015-11-13
        JIRA Patch URL https://issues.apache.org/jira/secure/attachment/12772092/HDFS-9410.003.patch
        JIRA Issue HDFS-9410
        Optional Tests asflicense compile javac javadoc mvninstall mvnsite unit findbugs checkstyle
        uname Linux c364485c671f 3.13.0-36-lowlatency #63-Ubuntu SMP PREEMPT Wed Sep 3 21:56:12 UTC 2014 x86_64 x86_64 x86_64 GNU/Linux
        Build tool maven
        Personality /home/jenkins/jenkins-slave/workspace/PreCommit-HDFS-Build/patchprocess/apache-yetus-fa12328/precommit/personality/hadoop.sh
        git revision trunk / 7ff280f
        findbugs v3.0.0
        unit https://builds.apache.org/job/PreCommit-HDFS-Build/13497/artifact/patchprocess/patch-unit-hadoop-hdfs-project_hadoop-hdfs-jdk1.8.0_66.txt
        unit https://builds.apache.org/job/PreCommit-HDFS-Build/13497/artifact/patchprocess/patch-unit-hadoop-hdfs-project_hadoop-hdfs-jdk1.7.0_79.txt
        unit test logs https://builds.apache.org/job/PreCommit-HDFS-Build/13497/artifact/patchprocess/patch-unit-hadoop-hdfs-project_hadoop-hdfs-jdk1.8.0_66.txt https://builds.apache.org/job/PreCommit-HDFS-Build/13497/artifact/patchprocess/patch-unit-hadoop-hdfs-project_hadoop-hdfs-jdk1.7.0_79.txt
        JDK v1.7.0_79 Test Results https://builds.apache.org/job/PreCommit-HDFS-Build/13497/testReport/
        asflicense https://builds.apache.org/job/PreCommit-HDFS-Build/13497/artifact/patchprocess/patch-asflicense-problems.txt
        modules C: hadoop-hdfs-project/hadoop-hdfs U: hadoop-hdfs-project/hadoop-hdfs
        Max memory used 227MB
        Powered by Apache Yetus http://yetus.apache.org
        Console output https://builds.apache.org/job/PreCommit-HDFS-Build/13497/console

        This message was automatically generated.

        Show
        hadoopqa Hadoop QA added a comment - -1 overall Vote Subsystem Runtime Comment 0 reexec 0m 9s docker + precommit patch detected. +1 @author 0m 0s The patch does not contain any @author tags. +1 test4tests 0m 0s The patch appears to include 11 new or modified test files. +1 mvninstall 3m 19s trunk passed +1 compile 0m 42s trunk passed with JDK v1.8.0_66 +1 compile 0m 37s trunk passed with JDK v1.7.0_79 +1 checkstyle 0m 18s trunk passed +1 mvnsite 0m 54s trunk passed +1 mvneclipse 0m 18s trunk passed +1 findbugs 2m 17s trunk passed +1 javadoc 1m 31s trunk passed with JDK v1.8.0_66 +1 javadoc 2m 14s trunk passed with JDK v1.7.0_79 +1 mvninstall 0m 48s the patch passed +1 compile 0m 43s the patch passed with JDK v1.8.0_66 +1 javac 0m 43s the patch passed +1 compile 0m 49s the patch passed with JDK v1.7.0_79 +1 javac 0m 49s the patch passed +1 checkstyle 0m 19s the patch passed +1 mvnsite 0m 54s the patch passed +1 mvneclipse 0m 16s the patch passed +1 whitespace 0m 0s Patch has no whitespace issues. +1 findbugs 2m 37s the patch passed +1 javadoc 1m 44s the patch passed with JDK v1.8.0_66 +1 javadoc 2m 8s the patch passed with JDK v1.7.0_79 -1 unit 82m 28s hadoop-hdfs in the patch failed with JDK v1.8.0_66. -1 unit 79m 29s hadoop-hdfs in the patch failed with JDK v1.7.0_79. -1 asflicense 0m 28s Patch generated 56 ASF License warnings. 188m 26s Reason Tests JDK v1.8.0_66 Failed junit tests hadoop.hdfs.server.datanode.TestBlockScanner   hadoop.hdfs.server.namenode.ha.TestEditLogTailer   hadoop.hdfs.TestSetrepIncreasing   hadoop.hdfs.security.TestDelegationTokenForProxyUser   hadoop.hdfs.server.datanode.TestBlockReplacement   hadoop.hdfs.server.namenode.ha.TestSeveralNameNodes   hadoop.fs.TestSymlinkHdfsFileContext   hadoop.hdfs.TestDFSStripedOutputStreamWithFailure000 JDK v1.7.0_79 Failed junit tests hadoop.hdfs.server.namenode.ha.TestEditLogTailer   hadoop.hdfs.security.TestDelegationTokenForProxyUser   hadoop.hdfs.qjournal.TestSecureNNWithQJM   hadoop.hdfs.server.datanode.fsdataset.impl.TestLazyPersistReplicaRecovery Subsystem Report/Notes Docker Client=1.7.0 Server=1.7.0 Image:test-patch-base-hadoop-date2015-11-13 JIRA Patch URL https://issues.apache.org/jira/secure/attachment/12772092/HDFS-9410.003.patch JIRA Issue HDFS-9410 Optional Tests asflicense compile javac javadoc mvninstall mvnsite unit findbugs checkstyle uname Linux c364485c671f 3.13.0-36-lowlatency #63-Ubuntu SMP PREEMPT Wed Sep 3 21:56:12 UTC 2014 x86_64 x86_64 x86_64 GNU/Linux Build tool maven Personality /home/jenkins/jenkins-slave/workspace/PreCommit-HDFS-Build/patchprocess/apache-yetus-fa12328/precommit/personality/hadoop.sh git revision trunk / 7ff280f findbugs v3.0.0 unit https://builds.apache.org/job/PreCommit-HDFS-Build/13497/artifact/patchprocess/patch-unit-hadoop-hdfs-project_hadoop-hdfs-jdk1.8.0_66.txt unit https://builds.apache.org/job/PreCommit-HDFS-Build/13497/artifact/patchprocess/patch-unit-hadoop-hdfs-project_hadoop-hdfs-jdk1.7.0_79.txt unit test logs https://builds.apache.org/job/PreCommit-HDFS-Build/13497/artifact/patchprocess/patch-unit-hadoop-hdfs-project_hadoop-hdfs-jdk1.8.0_66.txt https://builds.apache.org/job/PreCommit-HDFS-Build/13497/artifact/patchprocess/patch-unit-hadoop-hdfs-project_hadoop-hdfs-jdk1.7.0_79.txt JDK v1.7.0_79 Test Results https://builds.apache.org/job/PreCommit-HDFS-Build/13497/testReport/ asflicense https://builds.apache.org/job/PreCommit-HDFS-Build/13497/artifact/patchprocess/patch-asflicense-problems.txt modules C: hadoop-hdfs-project/hadoop-hdfs U: hadoop-hdfs-project/hadoop-hdfs Max memory used 227MB Powered by Apache Yetus http://yetus.apache.org Console output https://builds.apache.org/job/PreCommit-HDFS-Build/13497/console This message was automatically generated.
        Hide
        hudson Hudson added a comment -

        FAILURE: Integrated in Hadoop-trunk-Commit #8801 (See https://builds.apache.org/job/Hadoop-trunk-Commit/8801/)
        HDFS-9410. Some tests should always reset sysout and syserr. Contributed (waltersu4549: rev cccf88480b0df71f15fb36e9693d492c9e16c685)

        • hadoop-hdfs-project/hadoop-hdfs/src/test/java/org/apache/hadoop/hdfs/tools/TestDFSAdminWithHA.java
        • hadoop-hdfs-project/hadoop-hdfs/src/test/java/org/apache/hadoop/hdfs/server/namenode/TestMetadataVersionOutput.java
        • hadoop-hdfs-project/hadoop-hdfs/src/test/java/org/apache/hadoop/tools/TestTools.java
        • hadoop-hdfs-project/hadoop-hdfs/src/test/java/org/apache/hadoop/hdfs/server/namenode/snapshot/TestSnapshotRename.java
        • hadoop-hdfs-project/hadoop-hdfs/src/test/java/org/apache/hadoop/hdfs/server/namenode/TestClusterId.java
        • hadoop-hdfs-project/hadoop-hdfs/src/test/java/org/apache/hadoop/hdfs/TestDFSShell.java
        • hadoop-hdfs-project/hadoop-hdfs/src/test/java/org/apache/hadoop/hdfs/server/namenode/snapshot/TestSnapshotDeletion.java
        • hadoop-hdfs-project/hadoop-hdfs/CHANGES.txt
        • hadoop-hdfs-project/hadoop-hdfs/src/test/java/org/apache/hadoop/tracing/TestTraceAdmin.java
        • hadoop-hdfs-project/hadoop-hdfs/src/test/java/org/apache/hadoop/tools/TestJMXGet.java
        • hadoop-hdfs-project/hadoop-hdfs/src/test/java/org/apache/hadoop/hdfs/TestFsShellPermission.java
        • hadoop-hdfs-project/hadoop-hdfs/src/test/java/org/apache/hadoop/hdfs/TestQuota.java
        Show
        hudson Hudson added a comment - FAILURE: Integrated in Hadoop-trunk-Commit #8801 (See https://builds.apache.org/job/Hadoop-trunk-Commit/8801/ ) HDFS-9410 . Some tests should always reset sysout and syserr. Contributed (waltersu4549: rev cccf88480b0df71f15fb36e9693d492c9e16c685) hadoop-hdfs-project/hadoop-hdfs/src/test/java/org/apache/hadoop/hdfs/tools/TestDFSAdminWithHA.java hadoop-hdfs-project/hadoop-hdfs/src/test/java/org/apache/hadoop/hdfs/server/namenode/TestMetadataVersionOutput.java hadoop-hdfs-project/hadoop-hdfs/src/test/java/org/apache/hadoop/tools/TestTools.java hadoop-hdfs-project/hadoop-hdfs/src/test/java/org/apache/hadoop/hdfs/server/namenode/snapshot/TestSnapshotRename.java hadoop-hdfs-project/hadoop-hdfs/src/test/java/org/apache/hadoop/hdfs/server/namenode/TestClusterId.java hadoop-hdfs-project/hadoop-hdfs/src/test/java/org/apache/hadoop/hdfs/TestDFSShell.java hadoop-hdfs-project/hadoop-hdfs/src/test/java/org/apache/hadoop/hdfs/server/namenode/snapshot/TestSnapshotDeletion.java hadoop-hdfs-project/hadoop-hdfs/CHANGES.txt hadoop-hdfs-project/hadoop-hdfs/src/test/java/org/apache/hadoop/tracing/TestTraceAdmin.java hadoop-hdfs-project/hadoop-hdfs/src/test/java/org/apache/hadoop/tools/TestJMXGet.java hadoop-hdfs-project/hadoop-hdfs/src/test/java/org/apache/hadoop/hdfs/TestFsShellPermission.java hadoop-hdfs-project/hadoop-hdfs/src/test/java/org/apache/hadoop/hdfs/TestQuota.java
        Hide
        walter.k.su Walter Su added a comment -

        Committed to trunk and branch-2. Thanks Xiao Chen for contribution.

        Show
        walter.k.su Walter Su added a comment - Committed to trunk and branch-2. Thanks Xiao Chen for contribution.
        Hide
        xiaochen Xiao Chen added a comment -

        Thanks Walter for the review and commit.

        Show
        xiaochen Xiao Chen added a comment - Thanks Walter for the review and commit.
        Hide
        hudson Hudson added a comment -

        FAILURE: Integrated in Hadoop-Yarn-trunk #1400 (See https://builds.apache.org/job/Hadoop-Yarn-trunk/1400/)
        HDFS-9410. Some tests should always reset sysout and syserr. Contributed (waltersu4549: rev cccf88480b0df71f15fb36e9693d492c9e16c685)

        • hadoop-hdfs-project/hadoop-hdfs/CHANGES.txt
        • hadoop-hdfs-project/hadoop-hdfs/src/test/java/org/apache/hadoop/hdfs/TestDFSShell.java
        • hadoop-hdfs-project/hadoop-hdfs/src/test/java/org/apache/hadoop/tools/TestJMXGet.java
        • hadoop-hdfs-project/hadoop-hdfs/src/test/java/org/apache/hadoop/hdfs/tools/TestDFSAdminWithHA.java
        • hadoop-hdfs-project/hadoop-hdfs/src/test/java/org/apache/hadoop/hdfs/TestFsShellPermission.java
        • hadoop-hdfs-project/hadoop-hdfs/src/test/java/org/apache/hadoop/hdfs/server/namenode/TestClusterId.java
        • hadoop-hdfs-project/hadoop-hdfs/src/test/java/org/apache/hadoop/tracing/TestTraceAdmin.java
        • hadoop-hdfs-project/hadoop-hdfs/src/test/java/org/apache/hadoop/hdfs/server/namenode/TestMetadataVersionOutput.java
        • hadoop-hdfs-project/hadoop-hdfs/src/test/java/org/apache/hadoop/hdfs/TestQuota.java
        • hadoop-hdfs-project/hadoop-hdfs/src/test/java/org/apache/hadoop/hdfs/server/namenode/snapshot/TestSnapshotRename.java
        • hadoop-hdfs-project/hadoop-hdfs/src/test/java/org/apache/hadoop/tools/TestTools.java
        • hadoop-hdfs-project/hadoop-hdfs/src/test/java/org/apache/hadoop/hdfs/server/namenode/snapshot/TestSnapshotDeletion.java
        Show
        hudson Hudson added a comment - FAILURE: Integrated in Hadoop-Yarn-trunk #1400 (See https://builds.apache.org/job/Hadoop-Yarn-trunk/1400/ ) HDFS-9410 . Some tests should always reset sysout and syserr. Contributed (waltersu4549: rev cccf88480b0df71f15fb36e9693d492c9e16c685) hadoop-hdfs-project/hadoop-hdfs/CHANGES.txt hadoop-hdfs-project/hadoop-hdfs/src/test/java/org/apache/hadoop/hdfs/TestDFSShell.java hadoop-hdfs-project/hadoop-hdfs/src/test/java/org/apache/hadoop/tools/TestJMXGet.java hadoop-hdfs-project/hadoop-hdfs/src/test/java/org/apache/hadoop/hdfs/tools/TestDFSAdminWithHA.java hadoop-hdfs-project/hadoop-hdfs/src/test/java/org/apache/hadoop/hdfs/TestFsShellPermission.java hadoop-hdfs-project/hadoop-hdfs/src/test/java/org/apache/hadoop/hdfs/server/namenode/TestClusterId.java hadoop-hdfs-project/hadoop-hdfs/src/test/java/org/apache/hadoop/tracing/TestTraceAdmin.java hadoop-hdfs-project/hadoop-hdfs/src/test/java/org/apache/hadoop/hdfs/server/namenode/TestMetadataVersionOutput.java hadoop-hdfs-project/hadoop-hdfs/src/test/java/org/apache/hadoop/hdfs/TestQuota.java hadoop-hdfs-project/hadoop-hdfs/src/test/java/org/apache/hadoop/hdfs/server/namenode/snapshot/TestSnapshotRename.java hadoop-hdfs-project/hadoop-hdfs/src/test/java/org/apache/hadoop/tools/TestTools.java hadoop-hdfs-project/hadoop-hdfs/src/test/java/org/apache/hadoop/hdfs/server/namenode/snapshot/TestSnapshotDeletion.java
        Hide
        hudson Hudson added a comment -

        FAILURE: Integrated in Hadoop-Mapreduce-trunk-Java8 #664 (See https://builds.apache.org/job/Hadoop-Mapreduce-trunk-Java8/664/)
        HDFS-9410. Some tests should always reset sysout and syserr. Contributed (waltersu4549: rev cccf88480b0df71f15fb36e9693d492c9e16c685)

        • hadoop-hdfs-project/hadoop-hdfs/src/test/java/org/apache/hadoop/hdfs/TestDFSShell.java
        • hadoop-hdfs-project/hadoop-hdfs/CHANGES.txt
        • hadoop-hdfs-project/hadoop-hdfs/src/test/java/org/apache/hadoop/hdfs/server/namenode/TestClusterId.java
        • hadoop-hdfs-project/hadoop-hdfs/src/test/java/org/apache/hadoop/tools/TestTools.java
        • hadoop-hdfs-project/hadoop-hdfs/src/test/java/org/apache/hadoop/tools/TestJMXGet.java
        • hadoop-hdfs-project/hadoop-hdfs/src/test/java/org/apache/hadoop/hdfs/tools/TestDFSAdminWithHA.java
        • hadoop-hdfs-project/hadoop-hdfs/src/test/java/org/apache/hadoop/hdfs/server/namenode/snapshot/TestSnapshotRename.java
        • hadoop-hdfs-project/hadoop-hdfs/src/test/java/org/apache/hadoop/tracing/TestTraceAdmin.java
        • hadoop-hdfs-project/hadoop-hdfs/src/test/java/org/apache/hadoop/hdfs/TestQuota.java
        • hadoop-hdfs-project/hadoop-hdfs/src/test/java/org/apache/hadoop/hdfs/server/namenode/snapshot/TestSnapshotDeletion.java
        • hadoop-hdfs-project/hadoop-hdfs/src/test/java/org/apache/hadoop/hdfs/server/namenode/TestMetadataVersionOutput.java
        • hadoop-hdfs-project/hadoop-hdfs/src/test/java/org/apache/hadoop/hdfs/TestFsShellPermission.java
        Show
        hudson Hudson added a comment - FAILURE: Integrated in Hadoop-Mapreduce-trunk-Java8 #664 (See https://builds.apache.org/job/Hadoop-Mapreduce-trunk-Java8/664/ ) HDFS-9410 . Some tests should always reset sysout and syserr. Contributed (waltersu4549: rev cccf88480b0df71f15fb36e9693d492c9e16c685) hadoop-hdfs-project/hadoop-hdfs/src/test/java/org/apache/hadoop/hdfs/TestDFSShell.java hadoop-hdfs-project/hadoop-hdfs/CHANGES.txt hadoop-hdfs-project/hadoop-hdfs/src/test/java/org/apache/hadoop/hdfs/server/namenode/TestClusterId.java hadoop-hdfs-project/hadoop-hdfs/src/test/java/org/apache/hadoop/tools/TestTools.java hadoop-hdfs-project/hadoop-hdfs/src/test/java/org/apache/hadoop/tools/TestJMXGet.java hadoop-hdfs-project/hadoop-hdfs/src/test/java/org/apache/hadoop/hdfs/tools/TestDFSAdminWithHA.java hadoop-hdfs-project/hadoop-hdfs/src/test/java/org/apache/hadoop/hdfs/server/namenode/snapshot/TestSnapshotRename.java hadoop-hdfs-project/hadoop-hdfs/src/test/java/org/apache/hadoop/tracing/TestTraceAdmin.java hadoop-hdfs-project/hadoop-hdfs/src/test/java/org/apache/hadoop/hdfs/TestQuota.java hadoop-hdfs-project/hadoop-hdfs/src/test/java/org/apache/hadoop/hdfs/server/namenode/snapshot/TestSnapshotDeletion.java hadoop-hdfs-project/hadoop-hdfs/src/test/java/org/apache/hadoop/hdfs/server/namenode/TestMetadataVersionOutput.java hadoop-hdfs-project/hadoop-hdfs/src/test/java/org/apache/hadoop/hdfs/TestFsShellPermission.java
        Hide
        hudson Hudson added a comment -

        FAILURE: Integrated in Hadoop-Yarn-trunk-Java8 #676 (See https://builds.apache.org/job/Hadoop-Yarn-trunk-Java8/676/)
        HDFS-9410. Some tests should always reset sysout and syserr. Contributed (waltersu4549: rev cccf88480b0df71f15fb36e9693d492c9e16c685)

        • hadoop-hdfs-project/hadoop-hdfs/src/test/java/org/apache/hadoop/hdfs/server/namenode/TestMetadataVersionOutput.java
        • hadoop-hdfs-project/hadoop-hdfs/src/test/java/org/apache/hadoop/hdfs/server/namenode/snapshot/TestSnapshotDeletion.java
        • hadoop-hdfs-project/hadoop-hdfs/src/test/java/org/apache/hadoop/hdfs/server/namenode/TestClusterId.java
        • hadoop-hdfs-project/hadoop-hdfs/src/test/java/org/apache/hadoop/hdfs/TestFsShellPermission.java
        • hadoop-hdfs-project/hadoop-hdfs/src/test/java/org/apache/hadoop/tracing/TestTraceAdmin.java
        • hadoop-hdfs-project/hadoop-hdfs/src/test/java/org/apache/hadoop/tools/TestTools.java
        • hadoop-hdfs-project/hadoop-hdfs/src/test/java/org/apache/hadoop/hdfs/TestDFSShell.java
        • hadoop-hdfs-project/hadoop-hdfs/src/test/java/org/apache/hadoop/hdfs/server/namenode/snapshot/TestSnapshotRename.java
        • hadoop-hdfs-project/hadoop-hdfs/src/test/java/org/apache/hadoop/tools/TestJMXGet.java
        • hadoop-hdfs-project/hadoop-hdfs/CHANGES.txt
        • hadoop-hdfs-project/hadoop-hdfs/src/test/java/org/apache/hadoop/hdfs/tools/TestDFSAdminWithHA.java
        • hadoop-hdfs-project/hadoop-hdfs/src/test/java/org/apache/hadoop/hdfs/TestQuota.java
        Show
        hudson Hudson added a comment - FAILURE: Integrated in Hadoop-Yarn-trunk-Java8 #676 (See https://builds.apache.org/job/Hadoop-Yarn-trunk-Java8/676/ ) HDFS-9410 . Some tests should always reset sysout and syserr. Contributed (waltersu4549: rev cccf88480b0df71f15fb36e9693d492c9e16c685) hadoop-hdfs-project/hadoop-hdfs/src/test/java/org/apache/hadoop/hdfs/server/namenode/TestMetadataVersionOutput.java hadoop-hdfs-project/hadoop-hdfs/src/test/java/org/apache/hadoop/hdfs/server/namenode/snapshot/TestSnapshotDeletion.java hadoop-hdfs-project/hadoop-hdfs/src/test/java/org/apache/hadoop/hdfs/server/namenode/TestClusterId.java hadoop-hdfs-project/hadoop-hdfs/src/test/java/org/apache/hadoop/hdfs/TestFsShellPermission.java hadoop-hdfs-project/hadoop-hdfs/src/test/java/org/apache/hadoop/tracing/TestTraceAdmin.java hadoop-hdfs-project/hadoop-hdfs/src/test/java/org/apache/hadoop/tools/TestTools.java hadoop-hdfs-project/hadoop-hdfs/src/test/java/org/apache/hadoop/hdfs/TestDFSShell.java hadoop-hdfs-project/hadoop-hdfs/src/test/java/org/apache/hadoop/hdfs/server/namenode/snapshot/TestSnapshotRename.java hadoop-hdfs-project/hadoop-hdfs/src/test/java/org/apache/hadoop/tools/TestJMXGet.java hadoop-hdfs-project/hadoop-hdfs/CHANGES.txt hadoop-hdfs-project/hadoop-hdfs/src/test/java/org/apache/hadoop/hdfs/tools/TestDFSAdminWithHA.java hadoop-hdfs-project/hadoop-hdfs/src/test/java/org/apache/hadoop/hdfs/TestQuota.java
        Hide
        hudson Hudson added a comment -

        FAILURE: Integrated in Hadoop-Mapreduce-trunk #2605 (See https://builds.apache.org/job/Hadoop-Mapreduce-trunk/2605/)
        HDFS-9410. Some tests should always reset sysout and syserr. Contributed (waltersu4549: rev cccf88480b0df71f15fb36e9693d492c9e16c685)

        • hadoop-hdfs-project/hadoop-hdfs/src/test/java/org/apache/hadoop/hdfs/tools/TestDFSAdminWithHA.java
        • hadoop-hdfs-project/hadoop-hdfs/src/test/java/org/apache/hadoop/hdfs/TestDFSShell.java
        • hadoop-hdfs-project/hadoop-hdfs/src/test/java/org/apache/hadoop/tools/TestJMXGet.java
        • hadoop-hdfs-project/hadoop-hdfs/src/test/java/org/apache/hadoop/tools/TestTools.java
        • hadoop-hdfs-project/hadoop-hdfs/src/test/java/org/apache/hadoop/hdfs/server/namenode/snapshot/TestSnapshotDeletion.java
        • hadoop-hdfs-project/hadoop-hdfs/src/test/java/org/apache/hadoop/hdfs/TestQuota.java
        • hadoop-hdfs-project/hadoop-hdfs/src/test/java/org/apache/hadoop/hdfs/server/namenode/snapshot/TestSnapshotRename.java
        • hadoop-hdfs-project/hadoop-hdfs/src/test/java/org/apache/hadoop/hdfs/server/namenode/TestClusterId.java
        • hadoop-hdfs-project/hadoop-hdfs/src/test/java/org/apache/hadoop/tracing/TestTraceAdmin.java
        • hadoop-hdfs-project/hadoop-hdfs/src/test/java/org/apache/hadoop/hdfs/server/namenode/TestMetadataVersionOutput.java
        • hadoop-hdfs-project/hadoop-hdfs/CHANGES.txt
        • hadoop-hdfs-project/hadoop-hdfs/src/test/java/org/apache/hadoop/hdfs/TestFsShellPermission.java
        Show
        hudson Hudson added a comment - FAILURE: Integrated in Hadoop-Mapreduce-trunk #2605 (See https://builds.apache.org/job/Hadoop-Mapreduce-trunk/2605/ ) HDFS-9410 . Some tests should always reset sysout and syserr. Contributed (waltersu4549: rev cccf88480b0df71f15fb36e9693d492c9e16c685) hadoop-hdfs-project/hadoop-hdfs/src/test/java/org/apache/hadoop/hdfs/tools/TestDFSAdminWithHA.java hadoop-hdfs-project/hadoop-hdfs/src/test/java/org/apache/hadoop/hdfs/TestDFSShell.java hadoop-hdfs-project/hadoop-hdfs/src/test/java/org/apache/hadoop/tools/TestJMXGet.java hadoop-hdfs-project/hadoop-hdfs/src/test/java/org/apache/hadoop/tools/TestTools.java hadoop-hdfs-project/hadoop-hdfs/src/test/java/org/apache/hadoop/hdfs/server/namenode/snapshot/TestSnapshotDeletion.java hadoop-hdfs-project/hadoop-hdfs/src/test/java/org/apache/hadoop/hdfs/TestQuota.java hadoop-hdfs-project/hadoop-hdfs/src/test/java/org/apache/hadoop/hdfs/server/namenode/snapshot/TestSnapshotRename.java hadoop-hdfs-project/hadoop-hdfs/src/test/java/org/apache/hadoop/hdfs/server/namenode/TestClusterId.java hadoop-hdfs-project/hadoop-hdfs/src/test/java/org/apache/hadoop/tracing/TestTraceAdmin.java hadoop-hdfs-project/hadoop-hdfs/src/test/java/org/apache/hadoop/hdfs/server/namenode/TestMetadataVersionOutput.java hadoop-hdfs-project/hadoop-hdfs/CHANGES.txt hadoop-hdfs-project/hadoop-hdfs/src/test/java/org/apache/hadoop/hdfs/TestFsShellPermission.java
        Hide
        hudson Hudson added a comment -

        FAILURE: Integrated in Hadoop-Hdfs-trunk-Java8 #603 (See https://builds.apache.org/job/Hadoop-Hdfs-trunk-Java8/603/)
        HDFS-9410. Some tests should always reset sysout and syserr. Contributed (waltersu4549: rev cccf88480b0df71f15fb36e9693d492c9e16c685)

        • hadoop-hdfs-project/hadoop-hdfs/src/test/java/org/apache/hadoop/hdfs/server/namenode/TestMetadataVersionOutput.java
        • hadoop-hdfs-project/hadoop-hdfs/src/test/java/org/apache/hadoop/hdfs/tools/TestDFSAdminWithHA.java
        • hadoop-hdfs-project/hadoop-hdfs/src/test/java/org/apache/hadoop/tools/TestJMXGet.java
        • hadoop-hdfs-project/hadoop-hdfs/src/test/java/org/apache/hadoop/hdfs/TestQuota.java
        • hadoop-hdfs-project/hadoop-hdfs/src/test/java/org/apache/hadoop/hdfs/server/namenode/TestClusterId.java
        • hadoop-hdfs-project/hadoop-hdfs/src/test/java/org/apache/hadoop/tools/TestTools.java
        • hadoop-hdfs-project/hadoop-hdfs/src/test/java/org/apache/hadoop/hdfs/server/namenode/snapshot/TestSnapshotRename.java
        • hadoop-hdfs-project/hadoop-hdfs/src/test/java/org/apache/hadoop/hdfs/server/namenode/snapshot/TestSnapshotDeletion.java
        • hadoop-hdfs-project/hadoop-hdfs/CHANGES.txt
        • hadoop-hdfs-project/hadoop-hdfs/src/test/java/org/apache/hadoop/hdfs/TestDFSShell.java
        • hadoop-hdfs-project/hadoop-hdfs/src/test/java/org/apache/hadoop/tracing/TestTraceAdmin.java
        • hadoop-hdfs-project/hadoop-hdfs/src/test/java/org/apache/hadoop/hdfs/TestFsShellPermission.java
        Show
        hudson Hudson added a comment - FAILURE: Integrated in Hadoop-Hdfs-trunk-Java8 #603 (See https://builds.apache.org/job/Hadoop-Hdfs-trunk-Java8/603/ ) HDFS-9410 . Some tests should always reset sysout and syserr. Contributed (waltersu4549: rev cccf88480b0df71f15fb36e9693d492c9e16c685) hadoop-hdfs-project/hadoop-hdfs/src/test/java/org/apache/hadoop/hdfs/server/namenode/TestMetadataVersionOutput.java hadoop-hdfs-project/hadoop-hdfs/src/test/java/org/apache/hadoop/hdfs/tools/TestDFSAdminWithHA.java hadoop-hdfs-project/hadoop-hdfs/src/test/java/org/apache/hadoop/tools/TestJMXGet.java hadoop-hdfs-project/hadoop-hdfs/src/test/java/org/apache/hadoop/hdfs/TestQuota.java hadoop-hdfs-project/hadoop-hdfs/src/test/java/org/apache/hadoop/hdfs/server/namenode/TestClusterId.java hadoop-hdfs-project/hadoop-hdfs/src/test/java/org/apache/hadoop/tools/TestTools.java hadoop-hdfs-project/hadoop-hdfs/src/test/java/org/apache/hadoop/hdfs/server/namenode/snapshot/TestSnapshotRename.java hadoop-hdfs-project/hadoop-hdfs/src/test/java/org/apache/hadoop/hdfs/server/namenode/snapshot/TestSnapshotDeletion.java hadoop-hdfs-project/hadoop-hdfs/CHANGES.txt hadoop-hdfs-project/hadoop-hdfs/src/test/java/org/apache/hadoop/hdfs/TestDFSShell.java hadoop-hdfs-project/hadoop-hdfs/src/test/java/org/apache/hadoop/tracing/TestTraceAdmin.java hadoop-hdfs-project/hadoop-hdfs/src/test/java/org/apache/hadoop/hdfs/TestFsShellPermission.java
        Hide
        hudson Hudson added a comment -

        FAILURE: Integrated in Hadoop-Hdfs-trunk #2540 (See https://builds.apache.org/job/Hadoop-Hdfs-trunk/2540/)
        HDFS-9410. Some tests should always reset sysout and syserr. Contributed (waltersu4549: rev cccf88480b0df71f15fb36e9693d492c9e16c685)

        • hadoop-hdfs-project/hadoop-hdfs/src/test/java/org/apache/hadoop/tools/TestTools.java
        • hadoop-hdfs-project/hadoop-hdfs/src/test/java/org/apache/hadoop/hdfs/TestFsShellPermission.java
        • hadoop-hdfs-project/hadoop-hdfs/src/test/java/org/apache/hadoop/hdfs/server/namenode/TestMetadataVersionOutput.java
        • hadoop-hdfs-project/hadoop-hdfs/CHANGES.txt
        • hadoop-hdfs-project/hadoop-hdfs/src/test/java/org/apache/hadoop/hdfs/server/namenode/TestClusterId.java
        • hadoop-hdfs-project/hadoop-hdfs/src/test/java/org/apache/hadoop/hdfs/TestQuota.java
        • hadoop-hdfs-project/hadoop-hdfs/src/test/java/org/apache/hadoop/tracing/TestTraceAdmin.java
        • hadoop-hdfs-project/hadoop-hdfs/src/test/java/org/apache/hadoop/hdfs/TestDFSShell.java
        • hadoop-hdfs-project/hadoop-hdfs/src/test/java/org/apache/hadoop/hdfs/server/namenode/snapshot/TestSnapshotRename.java
        • hadoop-hdfs-project/hadoop-hdfs/src/test/java/org/apache/hadoop/hdfs/server/namenode/snapshot/TestSnapshotDeletion.java
        • hadoop-hdfs-project/hadoop-hdfs/src/test/java/org/apache/hadoop/tools/TestJMXGet.java
        • hadoop-hdfs-project/hadoop-hdfs/src/test/java/org/apache/hadoop/hdfs/tools/TestDFSAdminWithHA.java
        Show
        hudson Hudson added a comment - FAILURE: Integrated in Hadoop-Hdfs-trunk #2540 (See https://builds.apache.org/job/Hadoop-Hdfs-trunk/2540/ ) HDFS-9410 . Some tests should always reset sysout and syserr. Contributed (waltersu4549: rev cccf88480b0df71f15fb36e9693d492c9e16c685) hadoop-hdfs-project/hadoop-hdfs/src/test/java/org/apache/hadoop/tools/TestTools.java hadoop-hdfs-project/hadoop-hdfs/src/test/java/org/apache/hadoop/hdfs/TestFsShellPermission.java hadoop-hdfs-project/hadoop-hdfs/src/test/java/org/apache/hadoop/hdfs/server/namenode/TestMetadataVersionOutput.java hadoop-hdfs-project/hadoop-hdfs/CHANGES.txt hadoop-hdfs-project/hadoop-hdfs/src/test/java/org/apache/hadoop/hdfs/server/namenode/TestClusterId.java hadoop-hdfs-project/hadoop-hdfs/src/test/java/org/apache/hadoop/hdfs/TestQuota.java hadoop-hdfs-project/hadoop-hdfs/src/test/java/org/apache/hadoop/tracing/TestTraceAdmin.java hadoop-hdfs-project/hadoop-hdfs/src/test/java/org/apache/hadoop/hdfs/TestDFSShell.java hadoop-hdfs-project/hadoop-hdfs/src/test/java/org/apache/hadoop/hdfs/server/namenode/snapshot/TestSnapshotRename.java hadoop-hdfs-project/hadoop-hdfs/src/test/java/org/apache/hadoop/hdfs/server/namenode/snapshot/TestSnapshotDeletion.java hadoop-hdfs-project/hadoop-hdfs/src/test/java/org/apache/hadoop/tools/TestJMXGet.java hadoop-hdfs-project/hadoop-hdfs/src/test/java/org/apache/hadoop/hdfs/tools/TestDFSAdminWithHA.java

          People

          • Assignee:
            xiaochen Xiao Chen
            Reporter:
            xiaochen Xiao Chen
          • Votes:
            0 Vote for this issue
            Watchers:
            5 Start watching this issue

            Dates

            • Created:
              Updated:
              Resolved:

              Development