Uploaded image for project: 'Hadoop HDFS'
  1. Hadoop HDFS
  2. HDFS-9312

Fix TestReplication to be FsDataset-agnostic.

    Details

    • Type: Improvement
    • Status: Resolved
    • Priority: Minor
    • Resolution: Fixed
    • Affects Version/s: 2.7.1
    • Fix Version/s: 2.8.0, 3.0.0-alpha1
    • Component/s: None
    • Labels:
      None
    • Target Version/s:

      Description

      TestReplication uses raw file system access to inject dummy replica files. It makes TestReplication not compatible to non-fs dataset implementation.

      We can fix it by using existing FsDatasetTestUtils.

      1. HDFS-9312.00.patch
        10 kB
        Lei (Eddy) Xu
      2. HDFS-9312.01.patch
        10 kB
        Lei (Eddy) Xu

        Activity

        Hide
        eddyxu Lei (Eddy) Xu added a comment -

        This patch:

        • Adds TestFsDatasetTestUtils#injectReplica.
        • Fix TestReplicaion to use injectReplica
        Show
        eddyxu Lei (Eddy) Xu added a comment - This patch: Adds TestFsDatasetTestUtils#injectReplica . Fix TestReplicaion to use injectReplica
        Hide
        zhz Zhe Zhang added a comment -

        Thanks for the work Eddy. The patch LGTM overall.

        The only issue I see is that we should have a better name for injectReplicas: 1) it only injects 1 replica; 2) it took me a while to realize it injects a corrupt replica. Maybe something like injectCorruptReplica?

        +1 pending Jenkins and after addressing the above.

        Show
        zhz Zhe Zhang added a comment - Thanks for the work Eddy. The patch LGTM overall. The only issue I see is that we should have a better name for injectReplicas : 1) it only injects 1 replica; 2) it took me a while to realize it injects a corrupt replica. Maybe something like injectCorruptReplica ? +1 pending Jenkins and after addressing the above.
        Hide
        hadoopqa Hadoop QA added a comment -



        -1 overall



        Vote Subsystem Runtime Comment
        -1 pre-patch 9m 12s Pre-patch trunk has 1 extant Findbugs (version 3.0.0) warnings.
        +1 @author 0m 0s The patch does not contain any @author tags.
        +1 tests included 0m 0s The patch appears to include 3 new or modified test files.
        +1 javac 9m 15s There were no new javac warning messages.
        +1 release audit 0m 24s The applied patch does not increase the total number of release audit warnings.
        +1 checkstyle 1m 41s There were no new checkstyle issues.
        +1 whitespace 0m 0s The patch has no lines that end in whitespace.
        +1 install 1m 42s mvn install still works.
        +1 eclipse:eclipse 0m 38s The patch built with eclipse:eclipse.
        +1 findbugs 2m 50s The patch does not introduce any new Findbugs (version 3.0.0) warnings.
        +1 native 1m 11s Pre-build of native portion
        -1 hdfs tests 56m 36s Tests failed in hadoop-hdfs.
            83m 33s  



        Reason Tests
        Failed unit tests hadoop.hdfs.server.blockmanagement.TestNodeCount
          hadoop.hdfs.TestAppendSnapshotTruncate
          hadoop.hdfs.server.namenode.TestFileTruncate
          hadoop.hdfs.server.namenode.ha.TestStandbyCheckpoints
          hadoop.hdfs.server.namenode.ha.TestXAttrsWithHA



        Subsystem Report/Notes
        Patch URL http://issues.apache.org/jira/secure/attachment/12768867/HDFS-9312.00.patch
        Optional Tests javac unit findbugs checkstyle
        git revision trunk / 68ce93c
        Pre-patch Findbugs warnings https://builds.apache.org/job/PreCommit-HDFS-Build/13232/artifact/patchprocess/trunkFindbugsWarningshadoop-hdfs.html
        hadoop-hdfs test log https://builds.apache.org/job/PreCommit-HDFS-Build/13232/artifact/patchprocess/testrun_hadoop-hdfs.txt
        Test Results https://builds.apache.org/job/PreCommit-HDFS-Build/13232/testReport/
        Java 1.7.0_55
        uname Linux asf900.gq1.ygridcore.net 3.13.0-36-lowlatency #63-Ubuntu SMP PREEMPT Wed Sep 3 21:56:12 UTC 2014 x86_64 x86_64 x86_64 GNU/Linux
        Console output https://builds.apache.org/job/PreCommit-HDFS-Build/13232/console

        This message was automatically generated.

        Show
        hadoopqa Hadoop QA added a comment - -1 overall Vote Subsystem Runtime Comment -1 pre-patch 9m 12s Pre-patch trunk has 1 extant Findbugs (version 3.0.0) warnings. +1 @author 0m 0s The patch does not contain any @author tags. +1 tests included 0m 0s The patch appears to include 3 new or modified test files. +1 javac 9m 15s There were no new javac warning messages. +1 release audit 0m 24s The applied patch does not increase the total number of release audit warnings. +1 checkstyle 1m 41s There were no new checkstyle issues. +1 whitespace 0m 0s The patch has no lines that end in whitespace. +1 install 1m 42s mvn install still works. +1 eclipse:eclipse 0m 38s The patch built with eclipse:eclipse. +1 findbugs 2m 50s The patch does not introduce any new Findbugs (version 3.0.0) warnings. +1 native 1m 11s Pre-build of native portion -1 hdfs tests 56m 36s Tests failed in hadoop-hdfs.     83m 33s   Reason Tests Failed unit tests hadoop.hdfs.server.blockmanagement.TestNodeCount   hadoop.hdfs.TestAppendSnapshotTruncate   hadoop.hdfs.server.namenode.TestFileTruncate   hadoop.hdfs.server.namenode.ha.TestStandbyCheckpoints   hadoop.hdfs.server.namenode.ha.TestXAttrsWithHA Subsystem Report/Notes Patch URL http://issues.apache.org/jira/secure/attachment/12768867/HDFS-9312.00.patch Optional Tests javac unit findbugs checkstyle git revision trunk / 68ce93c Pre-patch Findbugs warnings https://builds.apache.org/job/PreCommit-HDFS-Build/13232/artifact/patchprocess/trunkFindbugsWarningshadoop-hdfs.html hadoop-hdfs test log https://builds.apache.org/job/PreCommit-HDFS-Build/13232/artifact/patchprocess/testrun_hadoop-hdfs.txt Test Results https://builds.apache.org/job/PreCommit-HDFS-Build/13232/testReport/ Java 1.7.0_55 uname Linux asf900.gq1.ygridcore.net 3.13.0-36-lowlatency #63-Ubuntu SMP PREEMPT Wed Sep 3 21:56:12 UTC 2014 x86_64 x86_64 x86_64 GNU/Linux Console output https://builds.apache.org/job/PreCommit-HDFS-Build/13232/console This message was automatically generated.
        Hide
        eddyxu Lei (Eddy) Xu added a comment -

        Thanks a lot for the reviews Zhe Zhang. Updated the patch to address your reviews. Will commit once jenkins finishes

        Show
        eddyxu Lei (Eddy) Xu added a comment - Thanks a lot for the reviews Zhe Zhang . Updated the patch to address your reviews. Will commit once jenkins finishes
        Hide
        hadoopqa Hadoop QA added a comment -
        -1 overall



        Vote Subsystem Runtime Comment
        0 reexec 0m 8s docker + precommit patch detected.
        +1 @author 0m 0s The patch does not contain any @author tags.
        +1 test4tests 0m 0s The patch appears to include 3 new or modified test files.
        +1 mvninstall 2m 59s trunk passed
        +1 compile 0m 34s trunk passed with JDK v1.8.0_60
        +1 compile 0m 32s trunk passed with JDK v1.7.0_79
        +1 checkstyle 0m 16s trunk passed
        +1 mvneclipse 0m 14s trunk passed
        -1 findbugs 1m 56s hadoop-hdfs-project/hadoop-hdfs in trunk cannot run convertXmlToText from findbugs
        +1 javadoc 1m 10s trunk passed with JDK v1.8.0_60
        +1 javadoc 1m 52s trunk passed with JDK v1.7.0_79
        +1 mvninstall 0m 39s the patch passed
        +1 compile 0m 32s the patch passed with JDK v1.8.0_60
        +1 javac 0m 32s the patch passed
        +1 compile 0m 32s the patch passed with JDK v1.7.0_79
        +1 javac 0m 32s the patch passed
        +1 checkstyle 0m 16s the patch passed
        +1 mvneclipse 0m 13s the patch passed
        +1 whitespace 0m 0s Patch has no whitespace issues.
        +1 findbugs 2m 14s the patch passed
        +1 javadoc 1m 6s the patch passed with JDK v1.8.0_60
        +1 javadoc 1m 58s the patch passed with JDK v1.7.0_79
        -1 unit 56m 6s hadoop-hdfs in the patch failed with JDK v1.8.0_60.
        -1 unit 52m 25s hadoop-hdfs in the patch failed with JDK v1.7.0_79.
        -1 asflicense 0m 19s Patch generated 56 ASF License warnings.
        128m 38s



        Reason Tests
        JDK v1.8.0_60 Failed junit tests hadoop.hdfs.server.datanode.TestDataNodeHotSwapVolumes
          hadoop.hdfs.server.datanode.TestBlockScanner
          hadoop.hdfs.server.blockmanagement.TestBlockTokenWithDFSStriped
        JDK v1.7.0_79 Failed junit tests hadoop.hdfs.TestDFSClientRetries
          hadoop.hdfs.server.namenode.ha.TestDNFencing



        Subsystem Report/Notes
        Docker Client=1.7.1 Server=1.7.1 Image:test-patch-base-hadoop-date2015-11-02
        JIRA Patch URL https://issues.apache.org/jira/secure/attachment/12770150/HDFS-9312.01.patch
        JIRA Issue HDFS-9312
        Optional Tests asflicense javac javadoc mvninstall unit findbugs checkstyle compile
        uname Linux f16f44e30488 3.13.0-36-lowlatency #63-Ubuntu SMP PREEMPT Wed Sep 3 21:56:12 UTC 2014 x86_64 x86_64 x86_64 GNU/Linux
        Build tool maven
        Personality /home/jenkins/jenkins-slave/workspace/PreCommit-HDFS-Build/patchprocess/apache-yetus-b17912e/precommit/personality/hadoop.sh
        git revision trunk / 9e7dcab
        Default Java 1.7.0_79
        Multi-JDK versions /usr/lib/jvm/java-8-oracle:1.8.0_60 /usr/lib/jvm/java-7-openjdk-amd64:1.7.0_79
        findbugs v3.0.0
        findbugs https://builds.apache.org/job/PreCommit-HDFS-Build/13339/artifact/patchprocess/branch-findbugs-hadoop-hdfs-project_hadoop-hdfs.html
        unit https://builds.apache.org/job/PreCommit-HDFS-Build/13339/artifact/patchprocess/patch-unit-hadoop-hdfs-project_hadoop-hdfs-jdk1.8.0_60.txt
        unit https://builds.apache.org/job/PreCommit-HDFS-Build/13339/artifact/patchprocess/patch-unit-hadoop-hdfs-project_hadoop-hdfs-jdk1.7.0_79.txt
        unit test logs https://builds.apache.org/job/PreCommit-HDFS-Build/13339/artifact/patchprocess/patch-unit-hadoop-hdfs-project_hadoop-hdfs-jdk1.8.0_60.txt https://builds.apache.org/job/PreCommit-HDFS-Build/13339/artifact/patchprocess/patch-unit-hadoop-hdfs-project_hadoop-hdfs-jdk1.7.0_79.txt
        JDK v1.7.0_79 Test Results https://builds.apache.org/job/PreCommit-HDFS-Build/13339/testReport/
        asflicense https://builds.apache.org/job/PreCommit-HDFS-Build/13339/artifact/patchprocess/patch-asflicense-problems.txt
        modules C: hadoop-hdfs-project/hadoop-hdfs U: hadoop-hdfs-project/hadoop-hdfs
        Max memory used 224MB
        Powered by Apache Yetus http://yetus.apache.org
        Console output https://builds.apache.org/job/PreCommit-HDFS-Build/13339/console

        This message was automatically generated.

        Show
        hadoopqa Hadoop QA added a comment - -1 overall Vote Subsystem Runtime Comment 0 reexec 0m 8s docker + precommit patch detected. +1 @author 0m 0s The patch does not contain any @author tags. +1 test4tests 0m 0s The patch appears to include 3 new or modified test files. +1 mvninstall 2m 59s trunk passed +1 compile 0m 34s trunk passed with JDK v1.8.0_60 +1 compile 0m 32s trunk passed with JDK v1.7.0_79 +1 checkstyle 0m 16s trunk passed +1 mvneclipse 0m 14s trunk passed -1 findbugs 1m 56s hadoop-hdfs-project/hadoop-hdfs in trunk cannot run convertXmlToText from findbugs +1 javadoc 1m 10s trunk passed with JDK v1.8.0_60 +1 javadoc 1m 52s trunk passed with JDK v1.7.0_79 +1 mvninstall 0m 39s the patch passed +1 compile 0m 32s the patch passed with JDK v1.8.0_60 +1 javac 0m 32s the patch passed +1 compile 0m 32s the patch passed with JDK v1.7.0_79 +1 javac 0m 32s the patch passed +1 checkstyle 0m 16s the patch passed +1 mvneclipse 0m 13s the patch passed +1 whitespace 0m 0s Patch has no whitespace issues. +1 findbugs 2m 14s the patch passed +1 javadoc 1m 6s the patch passed with JDK v1.8.0_60 +1 javadoc 1m 58s the patch passed with JDK v1.7.0_79 -1 unit 56m 6s hadoop-hdfs in the patch failed with JDK v1.8.0_60. -1 unit 52m 25s hadoop-hdfs in the patch failed with JDK v1.7.0_79. -1 asflicense 0m 19s Patch generated 56 ASF License warnings. 128m 38s Reason Tests JDK v1.8.0_60 Failed junit tests hadoop.hdfs.server.datanode.TestDataNodeHotSwapVolumes   hadoop.hdfs.server.datanode.TestBlockScanner   hadoop.hdfs.server.blockmanagement.TestBlockTokenWithDFSStriped JDK v1.7.0_79 Failed junit tests hadoop.hdfs.TestDFSClientRetries   hadoop.hdfs.server.namenode.ha.TestDNFencing Subsystem Report/Notes Docker Client=1.7.1 Server=1.7.1 Image:test-patch-base-hadoop-date2015-11-02 JIRA Patch URL https://issues.apache.org/jira/secure/attachment/12770150/HDFS-9312.01.patch JIRA Issue HDFS-9312 Optional Tests asflicense javac javadoc mvninstall unit findbugs checkstyle compile uname Linux f16f44e30488 3.13.0-36-lowlatency #63-Ubuntu SMP PREEMPT Wed Sep 3 21:56:12 UTC 2014 x86_64 x86_64 x86_64 GNU/Linux Build tool maven Personality /home/jenkins/jenkins-slave/workspace/PreCommit-HDFS-Build/patchprocess/apache-yetus-b17912e/precommit/personality/hadoop.sh git revision trunk / 9e7dcab Default Java 1.7.0_79 Multi-JDK versions /usr/lib/jvm/java-8-oracle:1.8.0_60 /usr/lib/jvm/java-7-openjdk-amd64:1.7.0_79 findbugs v3.0.0 findbugs https://builds.apache.org/job/PreCommit-HDFS-Build/13339/artifact/patchprocess/branch-findbugs-hadoop-hdfs-project_hadoop-hdfs.html unit https://builds.apache.org/job/PreCommit-HDFS-Build/13339/artifact/patchprocess/patch-unit-hadoop-hdfs-project_hadoop-hdfs-jdk1.8.0_60.txt unit https://builds.apache.org/job/PreCommit-HDFS-Build/13339/artifact/patchprocess/patch-unit-hadoop-hdfs-project_hadoop-hdfs-jdk1.7.0_79.txt unit test logs https://builds.apache.org/job/PreCommit-HDFS-Build/13339/artifact/patchprocess/patch-unit-hadoop-hdfs-project_hadoop-hdfs-jdk1.8.0_60.txt https://builds.apache.org/job/PreCommit-HDFS-Build/13339/artifact/patchprocess/patch-unit-hadoop-hdfs-project_hadoop-hdfs-jdk1.7.0_79.txt JDK v1.7.0_79 Test Results https://builds.apache.org/job/PreCommit-HDFS-Build/13339/testReport/ asflicense https://builds.apache.org/job/PreCommit-HDFS-Build/13339/artifact/patchprocess/patch-asflicense-problems.txt modules C: hadoop-hdfs-project/hadoop-hdfs U: hadoop-hdfs-project/hadoop-hdfs Max memory used 224MB Powered by Apache Yetus http://yetus.apache.org Console output https://builds.apache.org/job/PreCommit-HDFS-Build/13339/console This message was automatically generated.
        Hide
        eddyxu Lei (Eddy) Xu added a comment -

        Thanks a lot for the reviews, Zhe Zhang.

        The test failures are not relevant. Committed it to trunk and branch-2.

        Show
        eddyxu Lei (Eddy) Xu added a comment - Thanks a lot for the reviews, Zhe Zhang . The test failures are not relevant. Committed it to trunk and branch-2.
        Hide
        hudson Hudson added a comment -

        FAILURE: Integrated in Hadoop-trunk-Commit #8745 (See https://builds.apache.org/job/Hadoop-trunk-Commit/8745/)
        HDFS-9312. Fix TestReplication to be FsDataset-agnostic. (lei) (lei: rev 7632409482aaf06ecc6fe370a9f519afb969ad30)

        • hadoop-hdfs-project/hadoop-hdfs/src/test/java/org/apache/hadoop/hdfs/TestReplication.java
        • hadoop-hdfs-project/hadoop-hdfs/src/test/java/org/apache/hadoop/hdfs/server/datanode/FsDatasetTestUtils.java
        • hadoop-hdfs-project/hadoop-hdfs/CHANGES.txt
        • hadoop-hdfs-project/hadoop-hdfs/src/test/java/org/apache/hadoop/hdfs/server/datanode/fsdataset/impl/FsDatasetImplTestUtils.java
        Show
        hudson Hudson added a comment - FAILURE: Integrated in Hadoop-trunk-Commit #8745 (See https://builds.apache.org/job/Hadoop-trunk-Commit/8745/ ) HDFS-9312 . Fix TestReplication to be FsDataset-agnostic. (lei) (lei: rev 7632409482aaf06ecc6fe370a9f519afb969ad30) hadoop-hdfs-project/hadoop-hdfs/src/test/java/org/apache/hadoop/hdfs/TestReplication.java hadoop-hdfs-project/hadoop-hdfs/src/test/java/org/apache/hadoop/hdfs/server/datanode/FsDatasetTestUtils.java hadoop-hdfs-project/hadoop-hdfs/CHANGES.txt hadoop-hdfs-project/hadoop-hdfs/src/test/java/org/apache/hadoop/hdfs/server/datanode/fsdataset/impl/FsDatasetImplTestUtils.java
        Hide
        hudson Hudson added a comment -

        FAILURE: Integrated in Hadoop-Mapreduce-trunk-Java8 #619 (See https://builds.apache.org/job/Hadoop-Mapreduce-trunk-Java8/619/)
        HDFS-9312. Fix TestReplication to be FsDataset-agnostic. (lei) (lei: rev 7632409482aaf06ecc6fe370a9f519afb969ad30)

        • hadoop-hdfs-project/hadoop-hdfs/src/test/java/org/apache/hadoop/hdfs/server/datanode/FsDatasetTestUtils.java
        • hadoop-hdfs-project/hadoop-hdfs/src/test/java/org/apache/hadoop/hdfs/server/datanode/fsdataset/impl/FsDatasetImplTestUtils.java
        • hadoop-hdfs-project/hadoop-hdfs/CHANGES.txt
        • hadoop-hdfs-project/hadoop-hdfs/src/test/java/org/apache/hadoop/hdfs/TestReplication.java
        Show
        hudson Hudson added a comment - FAILURE: Integrated in Hadoop-Mapreduce-trunk-Java8 #619 (See https://builds.apache.org/job/Hadoop-Mapreduce-trunk-Java8/619/ ) HDFS-9312 . Fix TestReplication to be FsDataset-agnostic. (lei) (lei: rev 7632409482aaf06ecc6fe370a9f519afb969ad30) hadoop-hdfs-project/hadoop-hdfs/src/test/java/org/apache/hadoop/hdfs/server/datanode/FsDatasetTestUtils.java hadoop-hdfs-project/hadoop-hdfs/src/test/java/org/apache/hadoop/hdfs/server/datanode/fsdataset/impl/FsDatasetImplTestUtils.java hadoop-hdfs-project/hadoop-hdfs/CHANGES.txt hadoop-hdfs-project/hadoop-hdfs/src/test/java/org/apache/hadoop/hdfs/TestReplication.java
        Hide
        hudson Hudson added a comment -

        FAILURE: Integrated in Hadoop-Yarn-trunk #1353 (See https://builds.apache.org/job/Hadoop-Yarn-trunk/1353/)
        HDFS-9312. Fix TestReplication to be FsDataset-agnostic. (lei) (lei: rev 7632409482aaf06ecc6fe370a9f519afb969ad30)

        • hadoop-hdfs-project/hadoop-hdfs/src/test/java/org/apache/hadoop/hdfs/server/datanode/fsdataset/impl/FsDatasetImplTestUtils.java
        • hadoop-hdfs-project/hadoop-hdfs/CHANGES.txt
        • hadoop-hdfs-project/hadoop-hdfs/src/test/java/org/apache/hadoop/hdfs/server/datanode/FsDatasetTestUtils.java
        • hadoop-hdfs-project/hadoop-hdfs/src/test/java/org/apache/hadoop/hdfs/TestReplication.java
        Show
        hudson Hudson added a comment - FAILURE: Integrated in Hadoop-Yarn-trunk #1353 (See https://builds.apache.org/job/Hadoop-Yarn-trunk/1353/ ) HDFS-9312 . Fix TestReplication to be FsDataset-agnostic. (lei) (lei: rev 7632409482aaf06ecc6fe370a9f519afb969ad30) hadoop-hdfs-project/hadoop-hdfs/src/test/java/org/apache/hadoop/hdfs/server/datanode/fsdataset/impl/FsDatasetImplTestUtils.java hadoop-hdfs-project/hadoop-hdfs/CHANGES.txt hadoop-hdfs-project/hadoop-hdfs/src/test/java/org/apache/hadoop/hdfs/server/datanode/FsDatasetTestUtils.java hadoop-hdfs-project/hadoop-hdfs/src/test/java/org/apache/hadoop/hdfs/TestReplication.java
        Hide
        hudson Hudson added a comment -

        FAILURE: Integrated in Hadoop-Yarn-trunk-Java8 #630 (See https://builds.apache.org/job/Hadoop-Yarn-trunk-Java8/630/)
        HDFS-9312. Fix TestReplication to be FsDataset-agnostic. (lei) (lei: rev 7632409482aaf06ecc6fe370a9f519afb969ad30)

        • hadoop-hdfs-project/hadoop-hdfs/src/test/java/org/apache/hadoop/hdfs/TestReplication.java
        • hadoop-hdfs-project/hadoop-hdfs/src/test/java/org/apache/hadoop/hdfs/server/datanode/fsdataset/impl/FsDatasetImplTestUtils.java
        • hadoop-hdfs-project/hadoop-hdfs/CHANGES.txt
        • hadoop-hdfs-project/hadoop-hdfs/src/test/java/org/apache/hadoop/hdfs/server/datanode/FsDatasetTestUtils.java
        Show
        hudson Hudson added a comment - FAILURE: Integrated in Hadoop-Yarn-trunk-Java8 #630 (See https://builds.apache.org/job/Hadoop-Yarn-trunk-Java8/630/ ) HDFS-9312 . Fix TestReplication to be FsDataset-agnostic. (lei) (lei: rev 7632409482aaf06ecc6fe370a9f519afb969ad30) hadoop-hdfs-project/hadoop-hdfs/src/test/java/org/apache/hadoop/hdfs/TestReplication.java hadoop-hdfs-project/hadoop-hdfs/src/test/java/org/apache/hadoop/hdfs/server/datanode/fsdataset/impl/FsDatasetImplTestUtils.java hadoop-hdfs-project/hadoop-hdfs/CHANGES.txt hadoop-hdfs-project/hadoop-hdfs/src/test/java/org/apache/hadoop/hdfs/server/datanode/FsDatasetTestUtils.java
        Hide
        hudson Hudson added a comment -

        FAILURE: Integrated in Hadoop-Hdfs-trunk-Java8 #565 (See https://builds.apache.org/job/Hadoop-Hdfs-trunk-Java8/565/)
        HDFS-9312. Fix TestReplication to be FsDataset-agnostic. (lei) (lei: rev 7632409482aaf06ecc6fe370a9f519afb969ad30)

        • hadoop-hdfs-project/hadoop-hdfs/src/test/java/org/apache/hadoop/hdfs/TestReplication.java
        • hadoop-hdfs-project/hadoop-hdfs/src/test/java/org/apache/hadoop/hdfs/server/datanode/fsdataset/impl/FsDatasetImplTestUtils.java
        • hadoop-hdfs-project/hadoop-hdfs/CHANGES.txt
        • hadoop-hdfs-project/hadoop-hdfs/src/test/java/org/apache/hadoop/hdfs/server/datanode/FsDatasetTestUtils.java
        Show
        hudson Hudson added a comment - FAILURE: Integrated in Hadoop-Hdfs-trunk-Java8 #565 (See https://builds.apache.org/job/Hadoop-Hdfs-trunk-Java8/565/ ) HDFS-9312 . Fix TestReplication to be FsDataset-agnostic. (lei) (lei: rev 7632409482aaf06ecc6fe370a9f519afb969ad30) hadoop-hdfs-project/hadoop-hdfs/src/test/java/org/apache/hadoop/hdfs/TestReplication.java hadoop-hdfs-project/hadoop-hdfs/src/test/java/org/apache/hadoop/hdfs/server/datanode/fsdataset/impl/FsDatasetImplTestUtils.java hadoop-hdfs-project/hadoop-hdfs/CHANGES.txt hadoop-hdfs-project/hadoop-hdfs/src/test/java/org/apache/hadoop/hdfs/server/datanode/FsDatasetTestUtils.java
        Hide
        hudson Hudson added a comment -

        FAILURE: Integrated in Hadoop-Mapreduce-trunk #2561 (See https://builds.apache.org/job/Hadoop-Mapreduce-trunk/2561/)
        HDFS-9312. Fix TestReplication to be FsDataset-agnostic. (lei) (lei: rev 7632409482aaf06ecc6fe370a9f519afb969ad30)

        • hadoop-hdfs-project/hadoop-hdfs/src/test/java/org/apache/hadoop/hdfs/TestReplication.java
        • hadoop-hdfs-project/hadoop-hdfs/src/test/java/org/apache/hadoop/hdfs/server/datanode/FsDatasetTestUtils.java
        • hadoop-hdfs-project/hadoop-hdfs/CHANGES.txt
        • hadoop-hdfs-project/hadoop-hdfs/src/test/java/org/apache/hadoop/hdfs/server/datanode/fsdataset/impl/FsDatasetImplTestUtils.java
        Show
        hudson Hudson added a comment - FAILURE: Integrated in Hadoop-Mapreduce-trunk #2561 (See https://builds.apache.org/job/Hadoop-Mapreduce-trunk/2561/ ) HDFS-9312 . Fix TestReplication to be FsDataset-agnostic. (lei) (lei: rev 7632409482aaf06ecc6fe370a9f519afb969ad30) hadoop-hdfs-project/hadoop-hdfs/src/test/java/org/apache/hadoop/hdfs/TestReplication.java hadoop-hdfs-project/hadoop-hdfs/src/test/java/org/apache/hadoop/hdfs/server/datanode/FsDatasetTestUtils.java hadoop-hdfs-project/hadoop-hdfs/CHANGES.txt hadoop-hdfs-project/hadoop-hdfs/src/test/java/org/apache/hadoop/hdfs/server/datanode/fsdataset/impl/FsDatasetImplTestUtils.java
        Hide
        hudson Hudson added a comment -

        FAILURE: Integrated in Hadoop-Hdfs-trunk #2502 (See https://builds.apache.org/job/Hadoop-Hdfs-trunk/2502/)
        HDFS-9312. Fix TestReplication to be FsDataset-agnostic. (lei) (lei: rev 7632409482aaf06ecc6fe370a9f519afb969ad30)

        • hadoop-hdfs-project/hadoop-hdfs/CHANGES.txt
        • hadoop-hdfs-project/hadoop-hdfs/src/test/java/org/apache/hadoop/hdfs/server/datanode/FsDatasetTestUtils.java
        • hadoop-hdfs-project/hadoop-hdfs/src/test/java/org/apache/hadoop/hdfs/TestReplication.java
        • hadoop-hdfs-project/hadoop-hdfs/src/test/java/org/apache/hadoop/hdfs/server/datanode/fsdataset/impl/FsDatasetImplTestUtils.java
        Show
        hudson Hudson added a comment - FAILURE: Integrated in Hadoop-Hdfs-trunk #2502 (See https://builds.apache.org/job/Hadoop-Hdfs-trunk/2502/ ) HDFS-9312 . Fix TestReplication to be FsDataset-agnostic. (lei) (lei: rev 7632409482aaf06ecc6fe370a9f519afb969ad30) hadoop-hdfs-project/hadoop-hdfs/CHANGES.txt hadoop-hdfs-project/hadoop-hdfs/src/test/java/org/apache/hadoop/hdfs/server/datanode/FsDatasetTestUtils.java hadoop-hdfs-project/hadoop-hdfs/src/test/java/org/apache/hadoop/hdfs/TestReplication.java hadoop-hdfs-project/hadoop-hdfs/src/test/java/org/apache/hadoop/hdfs/server/datanode/fsdataset/impl/FsDatasetImplTestUtils.java

          People

          • Assignee:
            eddyxu Lei (Eddy) Xu
            Reporter:
            eddyxu Lei (Eddy) Xu
          • Votes:
            0 Vote for this issue
            Watchers:
            6 Start watching this issue

            Dates

            • Created:
              Updated:
              Resolved:

              Development