Uploaded image for project: 'Hadoop HDFS'
  1. Hadoop HDFS
  2. HDFS-8362

Java Compilation Error in TestHdfsConfigFields.java

    Details

    • Type: Bug
    • Status: Resolved
    • Priority: Major
    • Resolution: Fixed
    • Affects Version/s: None
    • Fix Version/s: 2.8.0, 3.0.0-alpha1
    • Component/s: None
    • Labels:
      None
    • Target Version/s:
    • Hadoop Flags:
      Reviewed

      Description

      in TestHdfsConfigFields.java failure is because of wrong package name.
      in TestMapreduceConfigFields.java failure i s becuase of:
      i) wrong package name
      ii) missing imports

      1. HDFS-8362-1.patch
        2 kB
        Mohammad Arshad
      2. HDFS-8362-2.patch
        0.7 kB
        Mohammad Arshad

        Issue Links

          Activity

          Hide
          arshad.mohammad Mohammad Arshad added a comment -

          Compilations error is in both trunk and branch-2. So the patch should be pushed in both trunk and branch-2

          Show
          arshad.mohammad Mohammad Arshad added a comment - Compilations error is in both trunk and branch-2. So the patch should be pushed in both trunk and branch-2
          Hide
          hadoopqa Hadoop QA added a comment -



          -1 overall



          Vote Subsystem Runtime Comment
          0 pre-patch 5m 11s Pre-patch trunk compilation is healthy.
          +1 @author 0m 0s The patch does not contain any @author tags.
          +1 tests included 0m 0s The patch appears to include 2 new or modified test files.
          +1 javac 7m 28s There were no new javac warning messages.
          +1 release audit 0m 20s The applied patch does not increase the total number of release audit warnings.
          -1 checkstyle 2m 31s The applied patch generated 75 new checkstyle issues (total was 1679, now 1681).
          +1 whitespace 0m 7s The patch has no lines that end in whitespace.
          +1 install 1m 34s mvn install still works.
          +1 eclipse:eclipse 0m 31s The patch built with eclipse:eclipse.
          +1 findbugs 3m 55s The patch does not introduce any new Findbugs (version 2.0.3) warnings.
          +1 native 1m 19s Pre-build of native portion
          +1 mapreduce tests 9m 16s Tests passed in hadoop-mapreduce-client-app.
          -1 hdfs tests 163m 55s Tests failed in hadoop-hdfs.
              196m 27s  



          Reason Tests
          Failed unit tests hadoop.tools.TestHdfsConfigFields
            hadoop.tracing.TestTraceAdmin
            hadoop.hdfs.TestDatanodeDeath



          Subsystem Report/Notes
          Patch URL http://issues.apache.org/jira/secure/attachment/12731708/HDFS-8362-1.patch
          Optional Tests javac unit findbugs checkstyle
          git revision trunk / 02a4a22
          checkstyle https://builds.apache.org/job/PreCommit-HDFS-Build/10902/artifact/patchprocess/diffcheckstylehadoop-hdfs.txt
          hadoop-mapreduce-client-app test log https://builds.apache.org/job/PreCommit-HDFS-Build/10902/artifact/patchprocess/testrun_hadoop-mapreduce-client-app.txt
          hadoop-hdfs test log https://builds.apache.org/job/PreCommit-HDFS-Build/10902/artifact/patchprocess/testrun_hadoop-hdfs.txt
          Test Results https://builds.apache.org/job/PreCommit-HDFS-Build/10902/testReport/
          Java 1.7.0_55
          uname Linux asf904.gq1.ygridcore.net 3.13.0-36-lowlatency #63-Ubuntu SMP PREEMPT Wed Sep 3 21:56:12 UTC 2014 x86_64 x86_64 x86_64 GNU/Linux
          Console output https://builds.apache.org/job/PreCommit-HDFS-Build/10902/console

          This message was automatically generated.

          Show
          hadoopqa Hadoop QA added a comment - -1 overall Vote Subsystem Runtime Comment 0 pre-patch 5m 11s Pre-patch trunk compilation is healthy. +1 @author 0m 0s The patch does not contain any @author tags. +1 tests included 0m 0s The patch appears to include 2 new or modified test files. +1 javac 7m 28s There were no new javac warning messages. +1 release audit 0m 20s The applied patch does not increase the total number of release audit warnings. -1 checkstyle 2m 31s The applied patch generated 75 new checkstyle issues (total was 1679, now 1681). +1 whitespace 0m 7s The patch has no lines that end in whitespace. +1 install 1m 34s mvn install still works. +1 eclipse:eclipse 0m 31s The patch built with eclipse:eclipse. +1 findbugs 3m 55s The patch does not introduce any new Findbugs (version 2.0.3) warnings. +1 native 1m 19s Pre-build of native portion +1 mapreduce tests 9m 16s Tests passed in hadoop-mapreduce-client-app. -1 hdfs tests 163m 55s Tests failed in hadoop-hdfs.     196m 27s   Reason Tests Failed unit tests hadoop.tools.TestHdfsConfigFields   hadoop.tracing.TestTraceAdmin   hadoop.hdfs.TestDatanodeDeath Subsystem Report/Notes Patch URL http://issues.apache.org/jira/secure/attachment/12731708/HDFS-8362-1.patch Optional Tests javac unit findbugs checkstyle git revision trunk / 02a4a22 checkstyle https://builds.apache.org/job/PreCommit-HDFS-Build/10902/artifact/patchprocess/diffcheckstylehadoop-hdfs.txt hadoop-mapreduce-client-app test log https://builds.apache.org/job/PreCommit-HDFS-Build/10902/artifact/patchprocess/testrun_hadoop-mapreduce-client-app.txt hadoop-hdfs test log https://builds.apache.org/job/PreCommit-HDFS-Build/10902/artifact/patchprocess/testrun_hadoop-hdfs.txt Test Results https://builds.apache.org/job/PreCommit-HDFS-Build/10902/testReport/ Java 1.7.0_55 uname Linux asf904.gq1.ygridcore.net 3.13.0-36-lowlatency #63-Ubuntu SMP PREEMPT Wed Sep 3 21:56:12 UTC 2014 x86_64 x86_64 x86_64 GNU/Linux Console output https://builds.apache.org/job/PreCommit-HDFS-Build/10902/console This message was automatically generated.
          Hide
          iwasakims Masatake Iwasaki added a comment -

          Thanks for reporting this, Mohammad Tariq Iqbal. Maven seems to work fine even if sources are placed in the directory mismatching to the package. IDEs such as Eclipse may complain about this.

          Though moving files to relevant directory has smaller effect, I think it is OK to change the package names because they are not imported from anywhere in hadoop and compatibility guide states that tests are strictly for internal use.

          I'm +1(non-binding) for this.

          Show
          iwasakims Masatake Iwasaki added a comment - Thanks for reporting this, Mohammad Tariq Iqbal . Maven seems to work fine even if sources are placed in the directory mismatching to the package. IDEs such as Eclipse may complain about this. Though moving files to relevant directory has smaller effect, I think it is OK to change the package names because they are not imported from anywhere in hadoop and compatibility guide states that tests are strictly for internal use. I'm +1(non-binding) for this.
          Hide
          arshad.mohammad Mohammad Arshad added a comment -

          -1 checkstyle 2m 31s The applied patch generated 75 new checkstyle issues (total was 1679, now 1681).

          As patch is modifying test cases, checkstyle is not applicable here

          -1 hdfs tests 163m 55s Tests failed in hadoop-hdfs.

          These test case failures are not because of this patch.
          hadoop.tools.TestHdfsConfigFields is failing because properties "dfs.htrace.spanreceiver.classes" and "dfs.client.htrace.spanreceiver.classes" are not added in org.apache.hadoop.hdfs.DFSConfigKeys.
          hadoop.tracing.TestTraceAdmin is failing because of recent changed in TraceAdmin file.
          similarly hadoop.hdfs.TestDatanodeDeath has other reason for failure.

          I think it would be more appropriate to commit this patch and let the test case failures be handled as part of other jira or the jira which caused these failures.

          Show
          arshad.mohammad Mohammad Arshad added a comment - -1 checkstyle 2m 31s The applied patch generated 75 new checkstyle issues (total was 1679, now 1681). As patch is modifying test cases, checkstyle is not applicable here -1 hdfs tests 163m 55s Tests failed in hadoop-hdfs. These test case failures are not because of this patch. hadoop.tools.TestHdfsConfigFields is failing because properties "dfs.htrace.spanreceiver.classes" and "dfs.client.htrace.spanreceiver.classes" are not added in org.apache.hadoop.hdfs.DFSConfigKeys. hadoop.tracing.TestTraceAdmin is failing because of recent changed in TraceAdmin file. similarly hadoop.hdfs.TestDatanodeDeath has other reason for failure. I think it would be more appropriate to commit this patch and let the test case failures be handled as part of other jira or the jira which caused these failures.
          Hide
          vinayrpet Vinayakumar B added a comment -

          Hi Mohammad Arshad,
          can you separate the patch for HDFS and Mapreduce ?
          For HDFS changes you can use this Jira, and MapReduce changes can you re-open MAPREDUCE-6360 and submit patch there?

          Show
          vinayrpet Vinayakumar B added a comment - Hi Mohammad Arshad , can you separate the patch for HDFS and Mapreduce ? For HDFS changes you can use this Jira, and MapReduce changes can you re-open MAPREDUCE-6360 and submit patch there?
          Hide
          arshad.mohammad Mohammad Arshad added a comment -

          Thanks Vinayakumar B
          Separated HDFS and Mapreduce portions and submited HDFS-8362-2.patch for this issue

          Show
          arshad.mohammad Mohammad Arshad added a comment - Thanks Vinayakumar B Separated HDFS and Mapreduce portions and submited HDFS-8362 -2.patch for this issue
          Hide
          hadoopqa Hadoop QA added a comment -



          -1 overall



          Vote Subsystem Runtime Comment
          0 pre-patch 5m 12s Pre-patch trunk compilation is healthy.
          +1 @author 0m 0s The patch does not contain any @author tags.
          +1 tests included 0m 0s The patch appears to include 1 new or modified test files.
          +1 javac 7m 31s There were no new javac warning messages.
          +1 release audit 0m 20s The applied patch does not increase the total number of release audit warnings.
          +1 checkstyle 2m 14s There were no new checkstyle issues.
          +1 whitespace 0m 0s The patch has no lines that end in whitespace.
          +1 install 1m 35s mvn install still works.
          +1 eclipse:eclipse 0m 32s The patch built with eclipse:eclipse.
          +1 findbugs 3m 9s The patch does not introduce any new Findbugs (version 2.0.3) warnings.
          +1 native 1m 22s Pre-build of native portion
          -1 hdfs tests 155m 48s Tests failed in hadoop-hdfs.
              177m 46s  



          Reason Tests
          Timed out tests org.apache.hadoop.hdfs.server.namenode.ha.TestDFSUpgradeWithHA



          Subsystem Report/Notes
          Patch URL http://issues.apache.org/jira/secure/attachment/12731921/HDFS-8362-2.patch
          Optional Tests javac unit findbugs checkstyle
          git revision trunk / 7e543c2
          hadoop-hdfs test log https://builds.apache.org/job/PreCommit-HDFS-Build/10914/artifact/patchprocess/testrun_hadoop-hdfs.txt
          Test Results https://builds.apache.org/job/PreCommit-HDFS-Build/10914/testReport/
          Java 1.7.0_55
          uname Linux asf904.gq1.ygridcore.net 3.13.0-36-lowlatency #63-Ubuntu SMP PREEMPT Wed Sep 3 21:56:12 UTC 2014 x86_64 x86_64 x86_64 GNU/Linux
          Console output https://builds.apache.org/job/PreCommit-HDFS-Build/10914/console

          This message was automatically generated.

          Show
          hadoopqa Hadoop QA added a comment - -1 overall Vote Subsystem Runtime Comment 0 pre-patch 5m 12s Pre-patch trunk compilation is healthy. +1 @author 0m 0s The patch does not contain any @author tags. +1 tests included 0m 0s The patch appears to include 1 new or modified test files. +1 javac 7m 31s There were no new javac warning messages. +1 release audit 0m 20s The applied patch does not increase the total number of release audit warnings. +1 checkstyle 2m 14s There were no new checkstyle issues. +1 whitespace 0m 0s The patch has no lines that end in whitespace. +1 install 1m 35s mvn install still works. +1 eclipse:eclipse 0m 32s The patch built with eclipse:eclipse. +1 findbugs 3m 9s The patch does not introduce any new Findbugs (version 2.0.3) warnings. +1 native 1m 22s Pre-build of native portion -1 hdfs tests 155m 48s Tests failed in hadoop-hdfs.     177m 46s   Reason Tests Timed out tests org.apache.hadoop.hdfs.server.namenode.ha.TestDFSUpgradeWithHA Subsystem Report/Notes Patch URL http://issues.apache.org/jira/secure/attachment/12731921/HDFS-8362-2.patch Optional Tests javac unit findbugs checkstyle git revision trunk / 7e543c2 hadoop-hdfs test log https://builds.apache.org/job/PreCommit-HDFS-Build/10914/artifact/patchprocess/testrun_hadoop-hdfs.txt Test Results https://builds.apache.org/job/PreCommit-HDFS-Build/10914/testReport/ Java 1.7.0_55 uname Linux asf904.gq1.ygridcore.net 3.13.0-36-lowlatency #63-Ubuntu SMP PREEMPT Wed Sep 3 21:56:12 UTC 2014 x86_64 x86_64 x86_64 GNU/Linux Console output https://builds.apache.org/job/PreCommit-HDFS-Build/10914/console This message was automatically generated.
          Hide
          rchiang Ray Chiang added a comment -

          Thanks for finding this error. Two comments:

          1) I'm fine with moving the file to the right location or changing the package. Either will give the correct test run.

          2) I've created HDFS-8371 for the new .xml properties.

          Show
          rchiang Ray Chiang added a comment - Thanks for finding this error. Two comments: 1) I'm fine with moving the file to the right location or changing the package. Either will give the correct test run. 2) I've created HDFS-8371 for the new .xml properties.
          Hide
          rchiang Ray Chiang added a comment -

          I'm fine with integrating HDFS-8371 into this patch and marking it as a duplicate, or getting the other JIRA submitted separately.

          Show
          rchiang Ray Chiang added a comment - I'm fine with integrating HDFS-8371 into this patch and marking it as a duplicate, or getting the other JIRA submitted separately.
          Hide
          vinayrpet Vinayakumar B added a comment -

          HDFS-8371 is the result of the test. (which is why test was added), so better to be in separate jira.
          Let this jira target only compilation error fix.

          Show
          vinayrpet Vinayakumar B added a comment - HDFS-8371 is the result of the test. (which is why test was added), so better to be in separate jira. Let this jira target only compilation error fix.
          Hide
          vinayrpet Vinayakumar B added a comment -

          +1 on latest patch to just to rename the package in file.

          Show
          vinayrpet Vinayakumar B added a comment - +1 on latest patch to just to rename the package in file.
          Hide
          vinayrpet Vinayakumar B added a comment -

          Committed to trunk and branch-2.
          Thanks Mohammad Arshad for the contribution.
          Thanks Ray Chiang for review.

          Show
          vinayrpet Vinayakumar B added a comment - Committed to trunk and branch-2. Thanks Mohammad Arshad for the contribution. Thanks Ray Chiang for review.
          Hide
          hudson Hudson added a comment -

          FAILURE: Integrated in Hadoop-trunk-Commit #7802 (See https://builds.apache.org/job/Hadoop-trunk-Commit/7802/)
          HDFS-8362. Java Compilation Error in TestHdfsConfigFields.java (Contributed by Arshad Mohammad) (vinayakumarb: rev 987abc99b0309a07f0a342746b2a5048d5c36ce0)

          • hadoop-hdfs-project/hadoop-hdfs/CHANGES.txt
          • hadoop-hdfs-project/hadoop-hdfs/src/test/java/org/apache/hadoop/tools/TestHdfsConfigFields.java
          Show
          hudson Hudson added a comment - FAILURE: Integrated in Hadoop-trunk-Commit #7802 (See https://builds.apache.org/job/Hadoop-trunk-Commit/7802/ ) HDFS-8362 . Java Compilation Error in TestHdfsConfigFields.java (Contributed by Arshad Mohammad) (vinayakumarb: rev 987abc99b0309a07f0a342746b2a5048d5c36ce0) hadoop-hdfs-project/hadoop-hdfs/CHANGES.txt hadoop-hdfs-project/hadoop-hdfs/src/test/java/org/apache/hadoop/tools/TestHdfsConfigFields.java
          Hide
          arshad.mohammad Mohammad Arshad added a comment -

          From CI link, not getting reason why Compilation failed. I compiled locally it is passing. can anybody suggest me actions i shall take to correct the compilation error?

          Show
          arshad.mohammad Mohammad Arshad added a comment - From CI link, not getting reason why Compilation failed. I compiled locally it is passing. can anybody suggest me actions i shall take to correct the compilation error?
          Hide
          vinayrpet Vinayakumar B added a comment -

          Thats not compilation failure. Thats some enforcement check failure. Dont worry

          Show
          vinayrpet Vinayakumar B added a comment - Thats not compilation failure. Thats some enforcement check failure. Dont worry
          Hide
          hudson Hudson added a comment -

          SUCCESS: Integrated in Hadoop-Yarn-trunk #925 (See https://builds.apache.org/job/Hadoop-Yarn-trunk/925/)
          HDFS-8362. Java Compilation Error in TestHdfsConfigFields.java (Contributed by Arshad Mohammad) (vinayakumarb: rev 987abc99b0309a07f0a342746b2a5048d5c36ce0)

          • hadoop-hdfs-project/hadoop-hdfs/src/test/java/org/apache/hadoop/tools/TestHdfsConfigFields.java
          • hadoop-hdfs-project/hadoop-hdfs/CHANGES.txt
          Show
          hudson Hudson added a comment - SUCCESS: Integrated in Hadoop-Yarn-trunk #925 (See https://builds.apache.org/job/Hadoop-Yarn-trunk/925/ ) HDFS-8362 . Java Compilation Error in TestHdfsConfigFields.java (Contributed by Arshad Mohammad) (vinayakumarb: rev 987abc99b0309a07f0a342746b2a5048d5c36ce0) hadoop-hdfs-project/hadoop-hdfs/src/test/java/org/apache/hadoop/tools/TestHdfsConfigFields.java hadoop-hdfs-project/hadoop-hdfs/CHANGES.txt
          Hide
          hudson Hudson added a comment -

          FAILURE: Integrated in Hadoop-Yarn-trunk-Java8 #194 (See https://builds.apache.org/job/Hadoop-Yarn-trunk-Java8/194/)
          HDFS-8362. Java Compilation Error in TestHdfsConfigFields.java (Contributed by Arshad Mohammad) (vinayakumarb: rev 987abc99b0309a07f0a342746b2a5048d5c36ce0)

          • hadoop-hdfs-project/hadoop-hdfs/CHANGES.txt
          • hadoop-hdfs-project/hadoop-hdfs/src/test/java/org/apache/hadoop/tools/TestHdfsConfigFields.java
          Show
          hudson Hudson added a comment - FAILURE: Integrated in Hadoop-Yarn-trunk-Java8 #194 (See https://builds.apache.org/job/Hadoop-Yarn-trunk-Java8/194/ ) HDFS-8362 . Java Compilation Error in TestHdfsConfigFields.java (Contributed by Arshad Mohammad) (vinayakumarb: rev 987abc99b0309a07f0a342746b2a5048d5c36ce0) hadoop-hdfs-project/hadoop-hdfs/CHANGES.txt hadoop-hdfs-project/hadoop-hdfs/src/test/java/org/apache/hadoop/tools/TestHdfsConfigFields.java
          Hide
          hudson Hudson added a comment -

          FAILURE: Integrated in Hadoop-Mapreduce-trunk #2141 (See https://builds.apache.org/job/Hadoop-Mapreduce-trunk/2141/)
          HDFS-8362. Java Compilation Error in TestHdfsConfigFields.java (Contributed by Arshad Mohammad) (vinayakumarb: rev 987abc99b0309a07f0a342746b2a5048d5c36ce0)

          • hadoop-hdfs-project/hadoop-hdfs/CHANGES.txt
          • hadoop-hdfs-project/hadoop-hdfs/src/test/java/org/apache/hadoop/tools/TestHdfsConfigFields.java
          Show
          hudson Hudson added a comment - FAILURE: Integrated in Hadoop-Mapreduce-trunk #2141 (See https://builds.apache.org/job/Hadoop-Mapreduce-trunk/2141/ ) HDFS-8362 . Java Compilation Error in TestHdfsConfigFields.java (Contributed by Arshad Mohammad) (vinayakumarb: rev 987abc99b0309a07f0a342746b2a5048d5c36ce0) hadoop-hdfs-project/hadoop-hdfs/CHANGES.txt hadoop-hdfs-project/hadoop-hdfs/src/test/java/org/apache/hadoop/tools/TestHdfsConfigFields.java
          Hide
          hudson Hudson added a comment -

          FAILURE: Integrated in Hadoop-Hdfs-trunk #2123 (See https://builds.apache.org/job/Hadoop-Hdfs-trunk/2123/)
          HDFS-8362. Java Compilation Error in TestHdfsConfigFields.java (Contributed by Arshad Mohammad) (vinayakumarb: rev 987abc99b0309a07f0a342746b2a5048d5c36ce0)

          • hadoop-hdfs-project/hadoop-hdfs/src/test/java/org/apache/hadoop/tools/TestHdfsConfigFields.java
          • hadoop-hdfs-project/hadoop-hdfs/CHANGES.txt
          Show
          hudson Hudson added a comment - FAILURE: Integrated in Hadoop-Hdfs-trunk #2123 (See https://builds.apache.org/job/Hadoop-Hdfs-trunk/2123/ ) HDFS-8362 . Java Compilation Error in TestHdfsConfigFields.java (Contributed by Arshad Mohammad) (vinayakumarb: rev 987abc99b0309a07f0a342746b2a5048d5c36ce0) hadoop-hdfs-project/hadoop-hdfs/src/test/java/org/apache/hadoop/tools/TestHdfsConfigFields.java hadoop-hdfs-project/hadoop-hdfs/CHANGES.txt
          Hide
          hudson Hudson added a comment -

          FAILURE: Integrated in Hadoop-Hdfs-trunk-Java8 #183 (See https://builds.apache.org/job/Hadoop-Hdfs-trunk-Java8/183/)
          HDFS-8362. Java Compilation Error in TestHdfsConfigFields.java (Contributed by Arshad Mohammad) (vinayakumarb: rev 987abc99b0309a07f0a342746b2a5048d5c36ce0)

          • hadoop-hdfs-project/hadoop-hdfs/CHANGES.txt
          • hadoop-hdfs-project/hadoop-hdfs/src/test/java/org/apache/hadoop/tools/TestHdfsConfigFields.java
          Show
          hudson Hudson added a comment - FAILURE: Integrated in Hadoop-Hdfs-trunk-Java8 #183 (See https://builds.apache.org/job/Hadoop-Hdfs-trunk-Java8/183/ ) HDFS-8362 . Java Compilation Error in TestHdfsConfigFields.java (Contributed by Arshad Mohammad) (vinayakumarb: rev 987abc99b0309a07f0a342746b2a5048d5c36ce0) hadoop-hdfs-project/hadoop-hdfs/CHANGES.txt hadoop-hdfs-project/hadoop-hdfs/src/test/java/org/apache/hadoop/tools/TestHdfsConfigFields.java
          Hide
          hudson Hudson added a comment -

          SUCCESS: Integrated in Hadoop-Mapreduce-trunk-Java8 #193 (See https://builds.apache.org/job/Hadoop-Mapreduce-trunk-Java8/193/)
          HDFS-8362. Java Compilation Error in TestHdfsConfigFields.java (Contributed by Arshad Mohammad) (vinayakumarb: rev 987abc99b0309a07f0a342746b2a5048d5c36ce0)

          • hadoop-hdfs-project/hadoop-hdfs/CHANGES.txt
          • hadoop-hdfs-project/hadoop-hdfs/src/test/java/org/apache/hadoop/tools/TestHdfsConfigFields.java
          Show
          hudson Hudson added a comment - SUCCESS: Integrated in Hadoop-Mapreduce-trunk-Java8 #193 (See https://builds.apache.org/job/Hadoop-Mapreduce-trunk-Java8/193/ ) HDFS-8362 . Java Compilation Error in TestHdfsConfigFields.java (Contributed by Arshad Mohammad) (vinayakumarb: rev 987abc99b0309a07f0a342746b2a5048d5c36ce0) hadoop-hdfs-project/hadoop-hdfs/CHANGES.txt hadoop-hdfs-project/hadoop-hdfs/src/test/java/org/apache/hadoop/tools/TestHdfsConfigFields.java

            People

            • Assignee:
              arshad.mohammad Mohammad Arshad
              Reporter:
              arshad.mohammad Mohammad Arshad
            • Votes:
              0 Vote for this issue
              Watchers:
              5 Start watching this issue

              Dates

              • Created:
                Updated:
                Resolved:

                Development