Hadoop HDFS
  1. Hadoop HDFS
  2. HDFS-6539

test_native_mini_dfs is skipped in hadoop-hdfs/pom.xml

    Details

    • Type: Bug Bug
    • Status: Closed
    • Priority: Major Major
    • Resolution: Fixed
    • Affects Version/s: None
    • Fix Version/s: 2.5.0
    • Component/s: None
    • Labels:
      None
    • Target Version/s:
    1. HDFS-6539.v1.patch
      0.9 kB
      Binglin Chang

      Activity

      Hide
      Binglin Chang added a comment -

      Hi Colin Patrick McCabe,
      looks like the patch in HADOOP-8480 has a little error, test_native_mini_dfs was changed to test_libhdfs_threaded, so test_libhdfs_threaded was tested twice, but test_native_mini_dfs is skipped.

      Show
      Binglin Chang added a comment - Hi Colin Patrick McCabe , looks like the patch in HADOOP-8480 has a little error, test_native_mini_dfs was changed to test_libhdfs_threaded, so test_libhdfs_threaded was tested twice, but test_native_mini_dfs is skipped.
      Hide
      Hadoop QA added a comment -

      -1 overall. Here are the results of testing the latest attachment
      http://issues.apache.org/jira/secure/attachment/12650504/HDFS-6539.v1.patch
      against trunk revision .

      +1 @author. The patch does not contain any @author tags.

      -1 tests included. The patch doesn't appear to include any new or modified tests.
      Please justify why no new tests are needed for this patch.
      Also please list what manual steps were performed to verify this patch.

      +1 javac. The applied patch does not increase the total number of javac compiler warnings.

      +1 javadoc. There were no new javadoc warning messages.

      +1 eclipse:eclipse. The patch built with eclipse:eclipse.

      +1 findbugs. The patch does not introduce any new Findbugs (version 1.3.9) warnings.

      +1 release audit. The applied patch does not increase the total number of release audit warnings.

      -1 core tests. The patch failed these unit tests in hadoop-hdfs-project/hadoop-hdfs:

      org.apache.hadoop.hdfs.web.TestWebHdfsWithMultipleNameNodes

      +1 contrib tests. The patch passed contrib unit tests.

      Test results: https://builds.apache.org/job/PreCommit-HDFS-Build/7124//testReport/
      Console output: https://builds.apache.org/job/PreCommit-HDFS-Build/7124//console

      This message is automatically generated.

      Show
      Hadoop QA added a comment - -1 overall . Here are the results of testing the latest attachment http://issues.apache.org/jira/secure/attachment/12650504/HDFS-6539.v1.patch against trunk revision . +1 @author . The patch does not contain any @author tags. -1 tests included . The patch doesn't appear to include any new or modified tests. Please justify why no new tests are needed for this patch. Also please list what manual steps were performed to verify this patch. +1 javac . The applied patch does not increase the total number of javac compiler warnings. +1 javadoc . There were no new javadoc warning messages. +1 eclipse:eclipse . The patch built with eclipse:eclipse. +1 findbugs . The patch does not introduce any new Findbugs (version 1.3.9) warnings. +1 release audit . The applied patch does not increase the total number of release audit warnings. -1 core tests . The patch failed these unit tests in hadoop-hdfs-project/hadoop-hdfs: org.apache.hadoop.hdfs.web.TestWebHdfsWithMultipleNameNodes +1 contrib tests . The patch passed contrib unit tests. Test results: https://builds.apache.org/job/PreCommit-HDFS-Build/7124//testReport/ Console output: https://builds.apache.org/job/PreCommit-HDFS-Build/7124//console This message is automatically generated.
      Hide
      Binglin Chang added a comment -

      The failed test is not related, create HDFS-6541 to track this

      Show
      Binglin Chang added a comment - The failed test is not related, create HDFS-6541 to track this
      Hide
      Colin Patrick McCabe added a comment -

      +1. Thanks, Binglin.

      Show
      Colin Patrick McCabe added a comment - +1. Thanks, Binglin.
      Hide
      Hudson added a comment -

      FAILURE: Integrated in Hadoop-trunk-Commit #5711 (See https://builds.apache.org/job/Hadoop-trunk-Commit/5711/)
      HDFS-6539. test_native_mini_dfs is skipped in hadoop-hdfs pom.xml (decstery via cmccabe) (cmccabe: http://svn.apache.org/viewcvs.cgi/?root=Apache-SVN&view=rev&rev=1602998)

      • /hadoop/common/trunk/hadoop-hdfs-project/hadoop-hdfs/CHANGES.txt
      • /hadoop/common/trunk/hadoop-hdfs-project/hadoop-hdfs/pom.xml
      Show
      Hudson added a comment - FAILURE: Integrated in Hadoop-trunk-Commit #5711 (See https://builds.apache.org/job/Hadoop-trunk-Commit/5711/ ) HDFS-6539 . test_native_mini_dfs is skipped in hadoop-hdfs pom.xml (decstery via cmccabe) (cmccabe: http://svn.apache.org/viewcvs.cgi/?root=Apache-SVN&view=rev&rev=1602998 ) /hadoop/common/trunk/hadoop-hdfs-project/hadoop-hdfs/CHANGES.txt /hadoop/common/trunk/hadoop-hdfs-project/hadoop-hdfs/pom.xml
      Hide
      Hudson added a comment -

      SUCCESS: Integrated in Hadoop-Yarn-trunk #586 (See https://builds.apache.org/job/Hadoop-Yarn-trunk/586/)
      HDFS-6539. test_native_mini_dfs is skipped in hadoop-hdfs pom.xml (decstery via cmccabe) (cmccabe: http://svn.apache.org/viewcvs.cgi/?root=Apache-SVN&view=rev&rev=1602998)

      • /hadoop/common/trunk/hadoop-hdfs-project/hadoop-hdfs/CHANGES.txt
      • /hadoop/common/trunk/hadoop-hdfs-project/hadoop-hdfs/pom.xml
      Show
      Hudson added a comment - SUCCESS: Integrated in Hadoop-Yarn-trunk #586 (See https://builds.apache.org/job/Hadoop-Yarn-trunk/586/ ) HDFS-6539 . test_native_mini_dfs is skipped in hadoop-hdfs pom.xml (decstery via cmccabe) (cmccabe: http://svn.apache.org/viewcvs.cgi/?root=Apache-SVN&view=rev&rev=1602998 ) /hadoop/common/trunk/hadoop-hdfs-project/hadoop-hdfs/CHANGES.txt /hadoop/common/trunk/hadoop-hdfs-project/hadoop-hdfs/pom.xml
      Hide
      Hudson added a comment -

      SUCCESS: Integrated in Hadoop-Hdfs-trunk #1777 (See https://builds.apache.org/job/Hadoop-Hdfs-trunk/1777/)
      HDFS-6539. test_native_mini_dfs is skipped in hadoop-hdfs pom.xml (decstery via cmccabe) (cmccabe: http://svn.apache.org/viewcvs.cgi/?root=Apache-SVN&view=rev&rev=1602998)

      • /hadoop/common/trunk/hadoop-hdfs-project/hadoop-hdfs/CHANGES.txt
      • /hadoop/common/trunk/hadoop-hdfs-project/hadoop-hdfs/pom.xml
      Show
      Hudson added a comment - SUCCESS: Integrated in Hadoop-Hdfs-trunk #1777 (See https://builds.apache.org/job/Hadoop-Hdfs-trunk/1777/ ) HDFS-6539 . test_native_mini_dfs is skipped in hadoop-hdfs pom.xml (decstery via cmccabe) (cmccabe: http://svn.apache.org/viewcvs.cgi/?root=Apache-SVN&view=rev&rev=1602998 ) /hadoop/common/trunk/hadoop-hdfs-project/hadoop-hdfs/CHANGES.txt /hadoop/common/trunk/hadoop-hdfs-project/hadoop-hdfs/pom.xml
      Hide
      Hudson added a comment -

      FAILURE: Integrated in Hadoop-Mapreduce-trunk #1804 (See https://builds.apache.org/job/Hadoop-Mapreduce-trunk/1804/)
      HDFS-6539. test_native_mini_dfs is skipped in hadoop-hdfs pom.xml (decstery via cmccabe) (cmccabe: http://svn.apache.org/viewcvs.cgi/?root=Apache-SVN&view=rev&rev=1602998)

      • /hadoop/common/trunk/hadoop-hdfs-project/hadoop-hdfs/CHANGES.txt
      • /hadoop/common/trunk/hadoop-hdfs-project/hadoop-hdfs/pom.xml
      Show
      Hudson added a comment - FAILURE: Integrated in Hadoop-Mapreduce-trunk #1804 (See https://builds.apache.org/job/Hadoop-Mapreduce-trunk/1804/ ) HDFS-6539 . test_native_mini_dfs is skipped in hadoop-hdfs pom.xml (decstery via cmccabe) (cmccabe: http://svn.apache.org/viewcvs.cgi/?root=Apache-SVN&view=rev&rev=1602998 ) /hadoop/common/trunk/hadoop-hdfs-project/hadoop-hdfs/CHANGES.txt /hadoop/common/trunk/hadoop-hdfs-project/hadoop-hdfs/pom.xml

        People

        • Assignee:
          Binglin Chang
          Reporter:
          Binglin Chang
        • Votes:
          0 Vote for this issue
          Watchers:
          4 Start watching this issue

          Dates

          • Created:
            Updated:
            Resolved:

            Development