Hadoop HDFS
  1. Hadoop HDFS
  2. HDFS-2657

TestHttpFSServer and TestServerWebApp are failing on trunk

    Details

    • Type: Bug Bug
    • Status: Closed
    • Priority: Major Major
    • Resolution: Fixed
    • Affects Version/s: 0.23.1
    • Fix Version/s: 0.23.1
    • Component/s: None
    • Labels:
      None
    • Hadoop Flags:
      Reviewed

      Description

      >>> org.apache.hadoop.fs.http.server.TestHttpFSServer.instrumentation
      >>> org.apache.hadoop.lib.servlet.TestServerWebApp.lifecycle

      1. HDFS-2657.patch
        6 kB
        Alejandro Abdelnur

        Issue Links

          Activity

          Hide
          Hudson added a comment -

          Integrated in Hadoop-Mapreduce-trunk #934 (See https://builds.apache.org/job/Hadoop-Mapreduce-trunk/934/)
          HDFS-2657. TestHttpFSServer and TestServerWebApp are failing on trunk. (tucu)

          tucu : http://svn.apache.org/viewcvs.cgi/?root=Apache-SVN&view=rev&rev=1221580
          Files :

          • /hadoop/common/trunk/hadoop-hdfs-project/hadoop-hdfs-httpfs/src/test/java/org/apache/hadoop/fs/http/server/TestHttpFSServer.java
          • /hadoop/common/trunk/hadoop-hdfs-project/hadoop-hdfs-httpfs/src/test/java/org/apache/hadoop/lib/service/security/DummyGroupMapping.java
          • /hadoop/common/trunk/hadoop-hdfs-project/hadoop-hdfs-httpfs/src/test/resources/TestServerWebApp1.properties
          • /hadoop/common/trunk/hadoop-hdfs-project/hadoop-hdfs-httpfs/src/test/resources/TestServerWebApp2.properties
          • /hadoop/common/trunk/hadoop-hdfs-project/hadoop-hdfs-httpfs/src/test/resources/testserverwebapp1.properties
          • /hadoop/common/trunk/hadoop-hdfs-project/hadoop-hdfs-httpfs/src/test/resources/testserverwebapp2.properties
          • /hadoop/common/trunk/hadoop-hdfs-project/hadoop-hdfs/CHANGES.txt
          Show
          Hudson added a comment - Integrated in Hadoop-Mapreduce-trunk #934 (See https://builds.apache.org/job/Hadoop-Mapreduce-trunk/934/ ) HDFS-2657 . TestHttpFSServer and TestServerWebApp are failing on trunk. (tucu) tucu : http://svn.apache.org/viewcvs.cgi/?root=Apache-SVN&view=rev&rev=1221580 Files : /hadoop/common/trunk/hadoop-hdfs-project/hadoop-hdfs-httpfs/src/test/java/org/apache/hadoop/fs/http/server/TestHttpFSServer.java /hadoop/common/trunk/hadoop-hdfs-project/hadoop-hdfs-httpfs/src/test/java/org/apache/hadoop/lib/service/security/DummyGroupMapping.java /hadoop/common/trunk/hadoop-hdfs-project/hadoop-hdfs-httpfs/src/test/resources/TestServerWebApp1.properties /hadoop/common/trunk/hadoop-hdfs-project/hadoop-hdfs-httpfs/src/test/resources/TestServerWebApp2.properties /hadoop/common/trunk/hadoop-hdfs-project/hadoop-hdfs-httpfs/src/test/resources/testserverwebapp1.properties /hadoop/common/trunk/hadoop-hdfs-project/hadoop-hdfs-httpfs/src/test/resources/testserverwebapp2.properties /hadoop/common/trunk/hadoop-hdfs-project/hadoop-hdfs/CHANGES.txt
          Hide
          Hudson added a comment -

          Integrated in Hadoop-Mapreduce-0.23-Build #135 (See https://builds.apache.org/job/Hadoop-Mapreduce-0.23-Build/135/)
          Merge -r 1221579:1221580 from trunk to branch. FIXES: HDFS-2657

          tucu : http://svn.apache.org/viewcvs.cgi/?root=Apache-SVN&view=rev&rev=1221584
          Files :

          • /hadoop/common/branches/branch-0.23/hadoop-hdfs-project/hadoop-hdfs-httpfs/src/test/java/org/apache/hadoop/fs/http/server/TestHttpFSServer.java
          • /hadoop/common/branches/branch-0.23/hadoop-hdfs-project/hadoop-hdfs-httpfs/src/test/java/org/apache/hadoop/lib/service/security/DummyGroupMapping.java
          • /hadoop/common/branches/branch-0.23/hadoop-hdfs-project/hadoop-hdfs-httpfs/src/test/resources/TestServerWebApp1.properties
          • /hadoop/common/branches/branch-0.23/hadoop-hdfs-project/hadoop-hdfs-httpfs/src/test/resources/TestServerWebApp2.properties
          • /hadoop/common/branches/branch-0.23/hadoop-hdfs-project/hadoop-hdfs-httpfs/src/test/resources/testserverwebapp1.properties
          • /hadoop/common/branches/branch-0.23/hadoop-hdfs-project/hadoop-hdfs-httpfs/src/test/resources/testserverwebapp2.properties
          • /hadoop/common/branches/branch-0.23/hadoop-hdfs-project/hadoop-hdfs/CHANGES.txt
          Show
          Hudson added a comment - Integrated in Hadoop-Mapreduce-0.23-Build #135 (See https://builds.apache.org/job/Hadoop-Mapreduce-0.23-Build/135/ ) Merge -r 1221579:1221580 from trunk to branch. FIXES: HDFS-2657 tucu : http://svn.apache.org/viewcvs.cgi/?root=Apache-SVN&view=rev&rev=1221584 Files : /hadoop/common/branches/branch-0.23/hadoop-hdfs-project/hadoop-hdfs-httpfs/src/test/java/org/apache/hadoop/fs/http/server/TestHttpFSServer.java /hadoop/common/branches/branch-0.23/hadoop-hdfs-project/hadoop-hdfs-httpfs/src/test/java/org/apache/hadoop/lib/service/security/DummyGroupMapping.java /hadoop/common/branches/branch-0.23/hadoop-hdfs-project/hadoop-hdfs-httpfs/src/test/resources/TestServerWebApp1.properties /hadoop/common/branches/branch-0.23/hadoop-hdfs-project/hadoop-hdfs-httpfs/src/test/resources/TestServerWebApp2.properties /hadoop/common/branches/branch-0.23/hadoop-hdfs-project/hadoop-hdfs-httpfs/src/test/resources/testserverwebapp1.properties /hadoop/common/branches/branch-0.23/hadoop-hdfs-project/hadoop-hdfs-httpfs/src/test/resources/testserverwebapp2.properties /hadoop/common/branches/branch-0.23/hadoop-hdfs-project/hadoop-hdfs/CHANGES.txt
          Hide
          Hudson added a comment -

          Integrated in Hadoop-Hdfs-0.23-Build #114 (See https://builds.apache.org/job/Hadoop-Hdfs-0.23-Build/114/)
          Merge -r 1221579:1221580 from trunk to branch. FIXES: HDFS-2657

          tucu : http://svn.apache.org/viewcvs.cgi/?root=Apache-SVN&view=rev&rev=1221584
          Files :

          • /hadoop/common/branches/branch-0.23/hadoop-hdfs-project/hadoop-hdfs-httpfs/src/test/java/org/apache/hadoop/fs/http/server/TestHttpFSServer.java
          • /hadoop/common/branches/branch-0.23/hadoop-hdfs-project/hadoop-hdfs-httpfs/src/test/java/org/apache/hadoop/lib/service/security/DummyGroupMapping.java
          • /hadoop/common/branches/branch-0.23/hadoop-hdfs-project/hadoop-hdfs-httpfs/src/test/resources/TestServerWebApp1.properties
          • /hadoop/common/branches/branch-0.23/hadoop-hdfs-project/hadoop-hdfs-httpfs/src/test/resources/TestServerWebApp2.properties
          • /hadoop/common/branches/branch-0.23/hadoop-hdfs-project/hadoop-hdfs-httpfs/src/test/resources/testserverwebapp1.properties
          • /hadoop/common/branches/branch-0.23/hadoop-hdfs-project/hadoop-hdfs-httpfs/src/test/resources/testserverwebapp2.properties
          • /hadoop/common/branches/branch-0.23/hadoop-hdfs-project/hadoop-hdfs/CHANGES.txt
          Show
          Hudson added a comment - Integrated in Hadoop-Hdfs-0.23-Build #114 (See https://builds.apache.org/job/Hadoop-Hdfs-0.23-Build/114/ ) Merge -r 1221579:1221580 from trunk to branch. FIXES: HDFS-2657 tucu : http://svn.apache.org/viewcvs.cgi/?root=Apache-SVN&view=rev&rev=1221584 Files : /hadoop/common/branches/branch-0.23/hadoop-hdfs-project/hadoop-hdfs-httpfs/src/test/java/org/apache/hadoop/fs/http/server/TestHttpFSServer.java /hadoop/common/branches/branch-0.23/hadoop-hdfs-project/hadoop-hdfs-httpfs/src/test/java/org/apache/hadoop/lib/service/security/DummyGroupMapping.java /hadoop/common/branches/branch-0.23/hadoop-hdfs-project/hadoop-hdfs-httpfs/src/test/resources/TestServerWebApp1.properties /hadoop/common/branches/branch-0.23/hadoop-hdfs-project/hadoop-hdfs-httpfs/src/test/resources/TestServerWebApp2.properties /hadoop/common/branches/branch-0.23/hadoop-hdfs-project/hadoop-hdfs-httpfs/src/test/resources/testserverwebapp1.properties /hadoop/common/branches/branch-0.23/hadoop-hdfs-project/hadoop-hdfs-httpfs/src/test/resources/testserverwebapp2.properties /hadoop/common/branches/branch-0.23/hadoop-hdfs-project/hadoop-hdfs/CHANGES.txt
          Hide
          Hudson added a comment -

          Integrated in Hadoop-Hdfs-trunk #901 (See https://builds.apache.org/job/Hadoop-Hdfs-trunk/901/)
          HDFS-2657. TestHttpFSServer and TestServerWebApp are failing on trunk. (tucu)

          tucu : http://svn.apache.org/viewcvs.cgi/?root=Apache-SVN&view=rev&rev=1221580
          Files :

          • /hadoop/common/trunk/hadoop-hdfs-project/hadoop-hdfs-httpfs/src/test/java/org/apache/hadoop/fs/http/server/TestHttpFSServer.java
          • /hadoop/common/trunk/hadoop-hdfs-project/hadoop-hdfs-httpfs/src/test/java/org/apache/hadoop/lib/service/security/DummyGroupMapping.java
          • /hadoop/common/trunk/hadoop-hdfs-project/hadoop-hdfs-httpfs/src/test/resources/TestServerWebApp1.properties
          • /hadoop/common/trunk/hadoop-hdfs-project/hadoop-hdfs-httpfs/src/test/resources/TestServerWebApp2.properties
          • /hadoop/common/trunk/hadoop-hdfs-project/hadoop-hdfs-httpfs/src/test/resources/testserverwebapp1.properties
          • /hadoop/common/trunk/hadoop-hdfs-project/hadoop-hdfs-httpfs/src/test/resources/testserverwebapp2.properties
          • /hadoop/common/trunk/hadoop-hdfs-project/hadoop-hdfs/CHANGES.txt
          Show
          Hudson added a comment - Integrated in Hadoop-Hdfs-trunk #901 (See https://builds.apache.org/job/Hadoop-Hdfs-trunk/901/ ) HDFS-2657 . TestHttpFSServer and TestServerWebApp are failing on trunk. (tucu) tucu : http://svn.apache.org/viewcvs.cgi/?root=Apache-SVN&view=rev&rev=1221580 Files : /hadoop/common/trunk/hadoop-hdfs-project/hadoop-hdfs-httpfs/src/test/java/org/apache/hadoop/fs/http/server/TestHttpFSServer.java /hadoop/common/trunk/hadoop-hdfs-project/hadoop-hdfs-httpfs/src/test/java/org/apache/hadoop/lib/service/security/DummyGroupMapping.java /hadoop/common/trunk/hadoop-hdfs-project/hadoop-hdfs-httpfs/src/test/resources/TestServerWebApp1.properties /hadoop/common/trunk/hadoop-hdfs-project/hadoop-hdfs-httpfs/src/test/resources/TestServerWebApp2.properties /hadoop/common/trunk/hadoop-hdfs-project/hadoop-hdfs-httpfs/src/test/resources/testserverwebapp1.properties /hadoop/common/trunk/hadoop-hdfs-project/hadoop-hdfs-httpfs/src/test/resources/testserverwebapp2.properties /hadoop/common/trunk/hadoop-hdfs-project/hadoop-hdfs/CHANGES.txt
          Hide
          Hudson added a comment -

          Integrated in Hadoop-Mapreduce-0.23-Commit #326 (See https://builds.apache.org/job/Hadoop-Mapreduce-0.23-Commit/326/)
          Merge -r 1221579:1221580 from trunk to branch. FIXES: HDFS-2657

          tucu : http://svn.apache.org/viewcvs.cgi/?root=Apache-SVN&view=rev&rev=1221584
          Files :

          • /hadoop/common/branches/branch-0.23/hadoop-hdfs-project/hadoop-hdfs-httpfs/src/test/java/org/apache/hadoop/fs/http/server/TestHttpFSServer.java
          • /hadoop/common/branches/branch-0.23/hadoop-hdfs-project/hadoop-hdfs-httpfs/src/test/java/org/apache/hadoop/lib/service/security/DummyGroupMapping.java
          • /hadoop/common/branches/branch-0.23/hadoop-hdfs-project/hadoop-hdfs-httpfs/src/test/resources/TestServerWebApp1.properties
          • /hadoop/common/branches/branch-0.23/hadoop-hdfs-project/hadoop-hdfs-httpfs/src/test/resources/TestServerWebApp2.properties
          • /hadoop/common/branches/branch-0.23/hadoop-hdfs-project/hadoop-hdfs-httpfs/src/test/resources/testserverwebapp1.properties
          • /hadoop/common/branches/branch-0.23/hadoop-hdfs-project/hadoop-hdfs-httpfs/src/test/resources/testserverwebapp2.properties
          • /hadoop/common/branches/branch-0.23/hadoop-hdfs-project/hadoop-hdfs/CHANGES.txt
          Show
          Hudson added a comment - Integrated in Hadoop-Mapreduce-0.23-Commit #326 (See https://builds.apache.org/job/Hadoop-Mapreduce-0.23-Commit/326/ ) Merge -r 1221579:1221580 from trunk to branch. FIXES: HDFS-2657 tucu : http://svn.apache.org/viewcvs.cgi/?root=Apache-SVN&view=rev&rev=1221584 Files : /hadoop/common/branches/branch-0.23/hadoop-hdfs-project/hadoop-hdfs-httpfs/src/test/java/org/apache/hadoop/fs/http/server/TestHttpFSServer.java /hadoop/common/branches/branch-0.23/hadoop-hdfs-project/hadoop-hdfs-httpfs/src/test/java/org/apache/hadoop/lib/service/security/DummyGroupMapping.java /hadoop/common/branches/branch-0.23/hadoop-hdfs-project/hadoop-hdfs-httpfs/src/test/resources/TestServerWebApp1.properties /hadoop/common/branches/branch-0.23/hadoop-hdfs-project/hadoop-hdfs-httpfs/src/test/resources/TestServerWebApp2.properties /hadoop/common/branches/branch-0.23/hadoop-hdfs-project/hadoop-hdfs-httpfs/src/test/resources/testserverwebapp1.properties /hadoop/common/branches/branch-0.23/hadoop-hdfs-project/hadoop-hdfs-httpfs/src/test/resources/testserverwebapp2.properties /hadoop/common/branches/branch-0.23/hadoop-hdfs-project/hadoop-hdfs/CHANGES.txt
          Hide
          Hudson added a comment -

          Integrated in Hadoop-Mapreduce-trunk-Commit #1484 (See https://builds.apache.org/job/Hadoop-Mapreduce-trunk-Commit/1484/)
          HDFS-2657. TestHttpFSServer and TestServerWebApp are failing on trunk. (tucu)

          tucu : http://svn.apache.org/viewcvs.cgi/?root=Apache-SVN&view=rev&rev=1221580
          Files :

          • /hadoop/common/trunk/hadoop-hdfs-project/hadoop-hdfs-httpfs/src/test/java/org/apache/hadoop/fs/http/server/TestHttpFSServer.java
          • /hadoop/common/trunk/hadoop-hdfs-project/hadoop-hdfs-httpfs/src/test/java/org/apache/hadoop/lib/service/security/DummyGroupMapping.java
          • /hadoop/common/trunk/hadoop-hdfs-project/hadoop-hdfs-httpfs/src/test/resources/TestServerWebApp1.properties
          • /hadoop/common/trunk/hadoop-hdfs-project/hadoop-hdfs-httpfs/src/test/resources/TestServerWebApp2.properties
          • /hadoop/common/trunk/hadoop-hdfs-project/hadoop-hdfs-httpfs/src/test/resources/testserverwebapp1.properties
          • /hadoop/common/trunk/hadoop-hdfs-project/hadoop-hdfs-httpfs/src/test/resources/testserverwebapp2.properties
          • /hadoop/common/trunk/hadoop-hdfs-project/hadoop-hdfs/CHANGES.txt
          Show
          Hudson added a comment - Integrated in Hadoop-Mapreduce-trunk-Commit #1484 (See https://builds.apache.org/job/Hadoop-Mapreduce-trunk-Commit/1484/ ) HDFS-2657 . TestHttpFSServer and TestServerWebApp are failing on trunk. (tucu) tucu : http://svn.apache.org/viewcvs.cgi/?root=Apache-SVN&view=rev&rev=1221580 Files : /hadoop/common/trunk/hadoop-hdfs-project/hadoop-hdfs-httpfs/src/test/java/org/apache/hadoop/fs/http/server/TestHttpFSServer.java /hadoop/common/trunk/hadoop-hdfs-project/hadoop-hdfs-httpfs/src/test/java/org/apache/hadoop/lib/service/security/DummyGroupMapping.java /hadoop/common/trunk/hadoop-hdfs-project/hadoop-hdfs-httpfs/src/test/resources/TestServerWebApp1.properties /hadoop/common/trunk/hadoop-hdfs-project/hadoop-hdfs-httpfs/src/test/resources/TestServerWebApp2.properties /hadoop/common/trunk/hadoop-hdfs-project/hadoop-hdfs-httpfs/src/test/resources/testserverwebapp1.properties /hadoop/common/trunk/hadoop-hdfs-project/hadoop-hdfs-httpfs/src/test/resources/testserverwebapp2.properties /hadoop/common/trunk/hadoop-hdfs-project/hadoop-hdfs/CHANGES.txt
          Hide
          Hudson added a comment -

          Integrated in Hadoop-Hdfs-0.23-Commit #304 (See https://builds.apache.org/job/Hadoop-Hdfs-0.23-Commit/304/)
          Merge -r 1221579:1221580 from trunk to branch. FIXES: HDFS-2657

          tucu : http://svn.apache.org/viewcvs.cgi/?root=Apache-SVN&view=rev&rev=1221584
          Files :

          • /hadoop/common/branches/branch-0.23/hadoop-hdfs-project/hadoop-hdfs-httpfs/src/test/java/org/apache/hadoop/fs/http/server/TestHttpFSServer.java
          • /hadoop/common/branches/branch-0.23/hadoop-hdfs-project/hadoop-hdfs-httpfs/src/test/java/org/apache/hadoop/lib/service/security/DummyGroupMapping.java
          • /hadoop/common/branches/branch-0.23/hadoop-hdfs-project/hadoop-hdfs-httpfs/src/test/resources/TestServerWebApp1.properties
          • /hadoop/common/branches/branch-0.23/hadoop-hdfs-project/hadoop-hdfs-httpfs/src/test/resources/TestServerWebApp2.properties
          • /hadoop/common/branches/branch-0.23/hadoop-hdfs-project/hadoop-hdfs-httpfs/src/test/resources/testserverwebapp1.properties
          • /hadoop/common/branches/branch-0.23/hadoop-hdfs-project/hadoop-hdfs-httpfs/src/test/resources/testserverwebapp2.properties
          • /hadoop/common/branches/branch-0.23/hadoop-hdfs-project/hadoop-hdfs/CHANGES.txt
          Show
          Hudson added a comment - Integrated in Hadoop-Hdfs-0.23-Commit #304 (See https://builds.apache.org/job/Hadoop-Hdfs-0.23-Commit/304/ ) Merge -r 1221579:1221580 from trunk to branch. FIXES: HDFS-2657 tucu : http://svn.apache.org/viewcvs.cgi/?root=Apache-SVN&view=rev&rev=1221584 Files : /hadoop/common/branches/branch-0.23/hadoop-hdfs-project/hadoop-hdfs-httpfs/src/test/java/org/apache/hadoop/fs/http/server/TestHttpFSServer.java /hadoop/common/branches/branch-0.23/hadoop-hdfs-project/hadoop-hdfs-httpfs/src/test/java/org/apache/hadoop/lib/service/security/DummyGroupMapping.java /hadoop/common/branches/branch-0.23/hadoop-hdfs-project/hadoop-hdfs-httpfs/src/test/resources/TestServerWebApp1.properties /hadoop/common/branches/branch-0.23/hadoop-hdfs-project/hadoop-hdfs-httpfs/src/test/resources/TestServerWebApp2.properties /hadoop/common/branches/branch-0.23/hadoop-hdfs-project/hadoop-hdfs-httpfs/src/test/resources/testserverwebapp1.properties /hadoop/common/branches/branch-0.23/hadoop-hdfs-project/hadoop-hdfs-httpfs/src/test/resources/testserverwebapp2.properties /hadoop/common/branches/branch-0.23/hadoop-hdfs-project/hadoop-hdfs/CHANGES.txt
          Hide
          Hudson added a comment -

          Integrated in Hadoop-Common-trunk-Commit #1463 (See https://builds.apache.org/job/Hadoop-Common-trunk-Commit/1463/)
          HDFS-2657. TestHttpFSServer and TestServerWebApp are failing on trunk. (tucu)

          tucu : http://svn.apache.org/viewcvs.cgi/?root=Apache-SVN&view=rev&rev=1221580
          Files :

          • /hadoop/common/trunk/hadoop-hdfs-project/hadoop-hdfs-httpfs/src/test/java/org/apache/hadoop/fs/http/server/TestHttpFSServer.java
          • /hadoop/common/trunk/hadoop-hdfs-project/hadoop-hdfs-httpfs/src/test/java/org/apache/hadoop/lib/service/security/DummyGroupMapping.java
          • /hadoop/common/trunk/hadoop-hdfs-project/hadoop-hdfs-httpfs/src/test/resources/TestServerWebApp1.properties
          • /hadoop/common/trunk/hadoop-hdfs-project/hadoop-hdfs-httpfs/src/test/resources/TestServerWebApp2.properties
          • /hadoop/common/trunk/hadoop-hdfs-project/hadoop-hdfs-httpfs/src/test/resources/testserverwebapp1.properties
          • /hadoop/common/trunk/hadoop-hdfs-project/hadoop-hdfs-httpfs/src/test/resources/testserverwebapp2.properties
          • /hadoop/common/trunk/hadoop-hdfs-project/hadoop-hdfs/CHANGES.txt
          Show
          Hudson added a comment - Integrated in Hadoop-Common-trunk-Commit #1463 (See https://builds.apache.org/job/Hadoop-Common-trunk-Commit/1463/ ) HDFS-2657 . TestHttpFSServer and TestServerWebApp are failing on trunk. (tucu) tucu : http://svn.apache.org/viewcvs.cgi/?root=Apache-SVN&view=rev&rev=1221580 Files : /hadoop/common/trunk/hadoop-hdfs-project/hadoop-hdfs-httpfs/src/test/java/org/apache/hadoop/fs/http/server/TestHttpFSServer.java /hadoop/common/trunk/hadoop-hdfs-project/hadoop-hdfs-httpfs/src/test/java/org/apache/hadoop/lib/service/security/DummyGroupMapping.java /hadoop/common/trunk/hadoop-hdfs-project/hadoop-hdfs-httpfs/src/test/resources/TestServerWebApp1.properties /hadoop/common/trunk/hadoop-hdfs-project/hadoop-hdfs-httpfs/src/test/resources/TestServerWebApp2.properties /hadoop/common/trunk/hadoop-hdfs-project/hadoop-hdfs-httpfs/src/test/resources/testserverwebapp1.properties /hadoop/common/trunk/hadoop-hdfs-project/hadoop-hdfs-httpfs/src/test/resources/testserverwebapp2.properties /hadoop/common/trunk/hadoop-hdfs-project/hadoop-hdfs/CHANGES.txt
          Hide
          Hudson added a comment -

          Integrated in Hadoop-Common-0.23-Commit #315 (See https://builds.apache.org/job/Hadoop-Common-0.23-Commit/315/)
          Merge -r 1221579:1221580 from trunk to branch. FIXES: HDFS-2657

          tucu : http://svn.apache.org/viewcvs.cgi/?root=Apache-SVN&view=rev&rev=1221584
          Files :

          • /hadoop/common/branches/branch-0.23/hadoop-hdfs-project/hadoop-hdfs-httpfs/src/test/java/org/apache/hadoop/fs/http/server/TestHttpFSServer.java
          • /hadoop/common/branches/branch-0.23/hadoop-hdfs-project/hadoop-hdfs-httpfs/src/test/java/org/apache/hadoop/lib/service/security/DummyGroupMapping.java
          • /hadoop/common/branches/branch-0.23/hadoop-hdfs-project/hadoop-hdfs-httpfs/src/test/resources/TestServerWebApp1.properties
          • /hadoop/common/branches/branch-0.23/hadoop-hdfs-project/hadoop-hdfs-httpfs/src/test/resources/TestServerWebApp2.properties
          • /hadoop/common/branches/branch-0.23/hadoop-hdfs-project/hadoop-hdfs-httpfs/src/test/resources/testserverwebapp1.properties
          • /hadoop/common/branches/branch-0.23/hadoop-hdfs-project/hadoop-hdfs-httpfs/src/test/resources/testserverwebapp2.properties
          • /hadoop/common/branches/branch-0.23/hadoop-hdfs-project/hadoop-hdfs/CHANGES.txt
          Show
          Hudson added a comment - Integrated in Hadoop-Common-0.23-Commit #315 (See https://builds.apache.org/job/Hadoop-Common-0.23-Commit/315/ ) Merge -r 1221579:1221580 from trunk to branch. FIXES: HDFS-2657 tucu : http://svn.apache.org/viewcvs.cgi/?root=Apache-SVN&view=rev&rev=1221584 Files : /hadoop/common/branches/branch-0.23/hadoop-hdfs-project/hadoop-hdfs-httpfs/src/test/java/org/apache/hadoop/fs/http/server/TestHttpFSServer.java /hadoop/common/branches/branch-0.23/hadoop-hdfs-project/hadoop-hdfs-httpfs/src/test/java/org/apache/hadoop/lib/service/security/DummyGroupMapping.java /hadoop/common/branches/branch-0.23/hadoop-hdfs-project/hadoop-hdfs-httpfs/src/test/resources/TestServerWebApp1.properties /hadoop/common/branches/branch-0.23/hadoop-hdfs-project/hadoop-hdfs-httpfs/src/test/resources/TestServerWebApp2.properties /hadoop/common/branches/branch-0.23/hadoop-hdfs-project/hadoop-hdfs-httpfs/src/test/resources/testserverwebapp1.properties /hadoop/common/branches/branch-0.23/hadoop-hdfs-project/hadoop-hdfs-httpfs/src/test/resources/testserverwebapp2.properties /hadoop/common/branches/branch-0.23/hadoop-hdfs-project/hadoop-hdfs/CHANGES.txt
          Hide
          Hudson added a comment -

          Integrated in Hadoop-Hdfs-trunk-Commit #1535 (See https://builds.apache.org/job/Hadoop-Hdfs-trunk-Commit/1535/)
          HDFS-2657. TestHttpFSServer and TestServerWebApp are failing on trunk. (tucu)

          tucu : http://svn.apache.org/viewcvs.cgi/?root=Apache-SVN&view=rev&rev=1221580
          Files :

          • /hadoop/common/trunk/hadoop-hdfs-project/hadoop-hdfs-httpfs/src/test/java/org/apache/hadoop/fs/http/server/TestHttpFSServer.java
          • /hadoop/common/trunk/hadoop-hdfs-project/hadoop-hdfs-httpfs/src/test/java/org/apache/hadoop/lib/service/security/DummyGroupMapping.java
          • /hadoop/common/trunk/hadoop-hdfs-project/hadoop-hdfs-httpfs/src/test/resources/TestServerWebApp1.properties
          • /hadoop/common/trunk/hadoop-hdfs-project/hadoop-hdfs-httpfs/src/test/resources/TestServerWebApp2.properties
          • /hadoop/common/trunk/hadoop-hdfs-project/hadoop-hdfs-httpfs/src/test/resources/testserverwebapp1.properties
          • /hadoop/common/trunk/hadoop-hdfs-project/hadoop-hdfs-httpfs/src/test/resources/testserverwebapp2.properties
          • /hadoop/common/trunk/hadoop-hdfs-project/hadoop-hdfs/CHANGES.txt
          Show
          Hudson added a comment - Integrated in Hadoop-Hdfs-trunk-Commit #1535 (See https://builds.apache.org/job/Hadoop-Hdfs-trunk-Commit/1535/ ) HDFS-2657 . TestHttpFSServer and TestServerWebApp are failing on trunk. (tucu) tucu : http://svn.apache.org/viewcvs.cgi/?root=Apache-SVN&view=rev&rev=1221580 Files : /hadoop/common/trunk/hadoop-hdfs-project/hadoop-hdfs-httpfs/src/test/java/org/apache/hadoop/fs/http/server/TestHttpFSServer.java /hadoop/common/trunk/hadoop-hdfs-project/hadoop-hdfs-httpfs/src/test/java/org/apache/hadoop/lib/service/security/DummyGroupMapping.java /hadoop/common/trunk/hadoop-hdfs-project/hadoop-hdfs-httpfs/src/test/resources/TestServerWebApp1.properties /hadoop/common/trunk/hadoop-hdfs-project/hadoop-hdfs-httpfs/src/test/resources/TestServerWebApp2.properties /hadoop/common/trunk/hadoop-hdfs-project/hadoop-hdfs-httpfs/src/test/resources/testserverwebapp1.properties /hadoop/common/trunk/hadoop-hdfs-project/hadoop-hdfs-httpfs/src/test/resources/testserverwebapp2.properties /hadoop/common/trunk/hadoop-hdfs-project/hadoop-hdfs/CHANGES.txt
          Hide
          Alejandro Abdelnur added a comment -

          committed to trunk and branch-0.23

          Show
          Alejandro Abdelnur added a comment - committed to trunk and branch-0.23
          Hide
          Eli Collins added a comment -

          +1 lgtm

          Show
          Eli Collins added a comment - +1 lgtm
          Hide
          Alejandro Abdelnur added a comment -

          20 javadoc warnings are unrelated (the 2 of them taken care by HDFS-2658)
          4 findbugs are taken care by HDFS-2646, 1 is unrelated
          failing testcases are unrelated

          Show
          Alejandro Abdelnur added a comment - 20 javadoc warnings are unrelated (the 2 of them taken care by HDFS-2658 ) 4 findbugs are taken care by HDFS-2646 , 1 is unrelated failing testcases are unrelated
          Hide
          Hadoop QA added a comment -

          -1 overall. Here are the results of testing the latest attachment
          http://issues.apache.org/jira/secure/attachment/12508018/HDFS-2657.patch
          against trunk revision .

          +1 @author. The patch does not contain any @author tags.

          +1 tests included. The patch appears to include 13 new or modified tests.

          -1 javadoc. The javadoc tool appears to have generated 20 warning messages.

          +1 javac. The applied patch does not increase the total number of javac compiler warnings.

          +1 eclipse:eclipse. The patch built with eclipse:eclipse.

          -1 findbugs. The patch appears to introduce 5 new Findbugs (version 1.3.9) warnings.

          +1 release audit. The applied patch does not increase the total number of release audit warnings.

          -1 core tests. The patch failed these unit tests:
          org.apache.hadoop.hdfs.TestFileAppend2
          org.apache.hadoop.hdfs.TestDatanodeDeath

          +1 contrib tests. The patch passed contrib unit tests.

          Test results: https://builds.apache.org/job/PreCommit-HDFS-Build/1731//testReport/
          Findbugs warnings: https://builds.apache.org/job/PreCommit-HDFS-Build/1731//artifact/trunk/hadoop-hdfs-project/patchprocess/newPatchFindbugsWarningshadoop-hdfs-httpfs.html
          Findbugs warnings: https://builds.apache.org/job/PreCommit-HDFS-Build/1731//artifact/trunk/hadoop-hdfs-project/patchprocess/newPatchFindbugsWarningshadoop-hdfs.html
          Console output: https://builds.apache.org/job/PreCommit-HDFS-Build/1731//console

          This message is automatically generated.

          Show
          Hadoop QA added a comment - -1 overall. Here are the results of testing the latest attachment http://issues.apache.org/jira/secure/attachment/12508018/HDFS-2657.patch against trunk revision . +1 @author. The patch does not contain any @author tags. +1 tests included. The patch appears to include 13 new or modified tests. -1 javadoc. The javadoc tool appears to have generated 20 warning messages. +1 javac. The applied patch does not increase the total number of javac compiler warnings. +1 eclipse:eclipse. The patch built with eclipse:eclipse. -1 findbugs. The patch appears to introduce 5 new Findbugs (version 1.3.9) warnings. +1 release audit. The applied patch does not increase the total number of release audit warnings. -1 core tests. The patch failed these unit tests: org.apache.hadoop.hdfs.TestFileAppend2 org.apache.hadoop.hdfs.TestDatanodeDeath +1 contrib tests. The patch passed contrib unit tests. Test results: https://builds.apache.org/job/PreCommit-HDFS-Build/1731//testReport/ Findbugs warnings: https://builds.apache.org/job/PreCommit-HDFS-Build/1731//artifact/trunk/hadoop-hdfs-project/patchprocess/newPatchFindbugsWarningshadoop-hdfs-httpfs.html Findbugs warnings: https://builds.apache.org/job/PreCommit-HDFS-Build/1731//artifact/trunk/hadoop-hdfs-project/patchprocess/newPatchFindbugsWarningshadoop-hdfs.html Console output: https://builds.apache.org/job/PreCommit-HDFS-Build/1731//console This message is automatically generated.
          Hide
          Alejandro Abdelnur added a comment -

          The testserverwebapp#.properties (with # = 1 & 2) files had capitals (in case insensitive FSs the tests were passing).

          The instrumentation test was assuming that root user belongs to admin group, not the case in Ubuntu. Using a dummy GroupMapping class for testing now.

          Show
          Alejandro Abdelnur added a comment - The testserverwebapp#.properties (with # = 1 & 2) files had capitals (in case insensitive FSs the tests were passing). The instrumentation test was assuming that root user belongs to admin group, not the case in Ubuntu. Using a dummy GroupMapping class for testing now.
          Hide
          Alejandro Abdelnur added a comment -

          found the issues, one has to do with my Mac OS X filesystem being case insensitive and the other with the groups root belongs to in a Mac. In Linux this is different. Working on a patch.

          Show
          Alejandro Abdelnur added a comment - found the issues, one has to do with my Mac OS X filesystem being case insensitive and the other with the groups root belongs to in a Mac. In Linux this is different. Working on a patch.
          Hide
          Eli Collins added a comment -

          Yea, every trunk build for the last couple of days has failed these.

          TestHttpFSServer fails the same assert and TestServerWebApp gets the following NPE.

          org.apache.hadoop.lib.servlet.TestServerWebApp.lifecycle
          
          Failing for the past 5 builds (Since #894 )
          Took 11 ms.
          add description
          Stacktrace
          
          java.lang.NullPointerException
          	at java.util.Properties$LineReader.readLine(Properties.java:418)
          	at java.util.Properties.load0(Properties.java:337)
          	at java.util.Properties.load(Properties.java:325)
          	at org.apache.hadoop.lib.server.Server.init(Server.java:348)
          	at org.apache.hadoop.lib.servlet.ServerWebApp.contextInitialized(ServerWebApp.java:142)
          	at org.apache.hadoop.lib.servlet.TestServerWebApp.__CLR3_0_2sd9si72uk(TestServerWebApp.java:56)
          	at org.apache.hadoop.lib.servlet.TestServerWebApp.lifecycle(TestServerWebApp.java:46)
          	at sun.reflect.NativeMethodAccessorImpl.invoke0(Native Method)
          	at sun.reflect.NativeMethodAccessorImpl.invoke(NativeMethodAccessorImpl.java:39)
          	at sun.reflect.DelegatingMethodAccessorImpl.invoke(DelegatingMethodAccessorImpl.java:25)
          	at java.lang.reflect.Method.invoke(Method.java:597)
          	at org.junit.runners.model.FrameworkMethod$1.runReflectiveCall(FrameworkMethod.java:44)
          	at org.junit.internal.runners.model.ReflectiveCallable.run(ReflectiveCallable.java:15)
          	at org.junit.runners.model.FrameworkMethod.invokeExplosively(FrameworkMethod.java:41)
          	at org.junit.internal.runners.statements.InvokeMethod.evaluate(InvokeMethod.java:20)
          	at org.apache.hadoop.test.TestDirHelper$1.evaluate(TestDirHelper.java:108)
          	at org.apache.hadoop.test.TestJettyHelper$1.evaluate(TestJettyHelper.java:51)
          	at org.apache.hadoop.test.TestExceptionHelper$1.evaluate(TestExceptionHelper.java:41)
          	at org.junit.runners.BlockJUnit4ClassRunner.runChild(BlockJUnit4ClassRunner.java:76)
          	at org.junit.runners.BlockJUnit4ClassRunner.runChild(BlockJUnit4ClassRunner.java:50)
          	at org.junit.runners.ParentRunner$3.run(ParentRunner.java:193)
          	at org.junit.runners.ParentRunner$1.schedule(ParentRunner.java:52)
          	at org.junit.runners.ParentRunner.runChildren(ParentRunner.java:191)
          	at org.junit.runners.ParentRunner.access$000(ParentRunner.java:42)
          	at org.junit.runners.ParentRunner$2.evaluate(ParentRunner.java:184)
          	at org.junit.runners.ParentRunner.run(ParentRunner.java:236)
          	at org.apache.maven.surefire.junit4.JUnit4TestSet.execute(JUnit4TestSet.java:53)
          	at org.apache.maven.surefire.junit4.JUnit4Provider.executeTestSet(JUnit4Provider.java:123)
          	at org.apache.maven.surefire.junit4.JUnit4Provider.invoke(JUnit4Provider.java:104)
          	at sun.reflect.NativeMethodAccessorImpl.invoke0(Native Method)
          	at sun.reflect.NativeMethodAccessorImpl.invoke(NativeMethodAccessorImpl.java:39)
          	at sun.reflect.DelegatingMethodAccessorImpl.invoke(DelegatingMethodAccessorImpl.java:25)
          	at java.lang.reflect.Method.invoke(Method.java:597)
          	at org.apache.maven.surefire.util.ReflectionUtils.invokeMethodWithArray(ReflectionUtils.java:164)
          	at org.apache.maven.surefire.booter.ProviderFactory$ProviderProxy.invoke(ProviderFactory.java:110)
          	at org.apache.maven.surefire.booter.SurefireStarter.invokeProvider(SurefireStarter.java:175)
          	at org.apache.maven.surefire.booter.SurefireStarter.runSuitesInProcessWhenForked(SurefireStarter.java:81)
          	at org.apache.maven.surefire.booter.ForkedBooter.main(ForkedBooter.java:68)
          Standard Output
          
          >>> test.properties : <NONE>
          
          >>> test.dir        : /home/jenkins/jenkins-slave/workspace/Hadoop-Hdfs-trunk/trunk/hadoop-hdfs-project/hadoop-hdfs-httpfs/target/testdir
          
          Show
          Eli Collins added a comment - Yea, every trunk build for the last couple of days has failed these. TestHttpFSServer fails the same assert and TestServerWebApp gets the following NPE. org.apache.hadoop.lib.servlet.TestServerWebApp.lifecycle Failing for the past 5 builds (Since #894 ) Took 11 ms. add description Stacktrace java.lang.NullPointerException at java.util.Properties$LineReader.readLine(Properties.java:418) at java.util.Properties.load0(Properties.java:337) at java.util.Properties.load(Properties.java:325) at org.apache.hadoop.lib.server.Server.init(Server.java:348) at org.apache.hadoop.lib.servlet.ServerWebApp.contextInitialized(ServerWebApp.java:142) at org.apache.hadoop.lib.servlet.TestServerWebApp.__CLR3_0_2sd9si72uk(TestServerWebApp.java:56) at org.apache.hadoop.lib.servlet.TestServerWebApp.lifecycle(TestServerWebApp.java:46) at sun.reflect.NativeMethodAccessorImpl.invoke0(Native Method) at sun.reflect.NativeMethodAccessorImpl.invoke(NativeMethodAccessorImpl.java:39) at sun.reflect.DelegatingMethodAccessorImpl.invoke(DelegatingMethodAccessorImpl.java:25) at java.lang.reflect.Method.invoke(Method.java:597) at org.junit.runners.model.FrameworkMethod$1.runReflectiveCall(FrameworkMethod.java:44) at org.junit.internal.runners.model.ReflectiveCallable.run(ReflectiveCallable.java:15) at org.junit.runners.model.FrameworkMethod.invokeExplosively(FrameworkMethod.java:41) at org.junit.internal.runners.statements.InvokeMethod.evaluate(InvokeMethod.java:20) at org.apache.hadoop.test.TestDirHelper$1.evaluate(TestDirHelper.java:108) at org.apache.hadoop.test.TestJettyHelper$1.evaluate(TestJettyHelper.java:51) at org.apache.hadoop.test.TestExceptionHelper$1.evaluate(TestExceptionHelper.java:41) at org.junit.runners.BlockJUnit4ClassRunner.runChild(BlockJUnit4ClassRunner.java:76) at org.junit.runners.BlockJUnit4ClassRunner.runChild(BlockJUnit4ClassRunner.java:50) at org.junit.runners.ParentRunner$3.run(ParentRunner.java:193) at org.junit.runners.ParentRunner$1.schedule(ParentRunner.java:52) at org.junit.runners.ParentRunner.runChildren(ParentRunner.java:191) at org.junit.runners.ParentRunner.access$000(ParentRunner.java:42) at org.junit.runners.ParentRunner$2.evaluate(ParentRunner.java:184) at org.junit.runners.ParentRunner.run(ParentRunner.java:236) at org.apache.maven.surefire.junit4.JUnit4TestSet.execute(JUnit4TestSet.java:53) at org.apache.maven.surefire.junit4.JUnit4Provider.executeTestSet(JUnit4Provider.java:123) at org.apache.maven.surefire.junit4.JUnit4Provider.invoke(JUnit4Provider.java:104) at sun.reflect.NativeMethodAccessorImpl.invoke0(Native Method) at sun.reflect.NativeMethodAccessorImpl.invoke(NativeMethodAccessorImpl.java:39) at sun.reflect.DelegatingMethodAccessorImpl.invoke(DelegatingMethodAccessorImpl.java:25) at java.lang.reflect.Method.invoke(Method.java:597) at org.apache.maven.surefire.util.ReflectionUtils.invokeMethodWithArray(ReflectionUtils.java:164) at org.apache.maven.surefire.booter.ProviderFactory$ProviderProxy.invoke(ProviderFactory.java:110) at org.apache.maven.surefire.booter.SurefireStarter.invokeProvider(SurefireStarter.java:175) at org.apache.maven.surefire.booter.SurefireStarter.runSuitesInProcessWhenForked(SurefireStarter.java:81) at org.apache.maven.surefire.booter.ForkedBooter.main(ForkedBooter.java:68) Standard Output >>> test.properties : <NONE> >>> test.dir : /home/jenkins/jenkins-slave/workspace/Hadoop-Hdfs-trunk/trunk/hadoop-hdfs-project/hadoop-hdfs-httpfs/target/testdir
          Hide
          Tsz Wo Nicholas Sze added a comment -

          It seems that the test failures are non-deterministic. They failed in build #1705 on trunk.

          Show
          Tsz Wo Nicholas Sze added a comment - It seems that the test failures are non-deterministic. They failed in build #1705 on trunk.
          Hide
          Eli Collins added a comment -

          ###################################################################################

                                                                    1. FAILED TESTS (if any) ##############################
                                                                      2 tests failed.
                                                                      FAILED: org.apache.hadoop.fs.http.server.TestHttpFSServer.instrumentation
                                                                      Maybe it's just 23, eg https://builds.apache.org/job/Hadoop-Hdfs-0.23-Build/105/

          Error Message:
          expected:<401> but was:<200>

          Stack Trace:
          junit.framework.AssertionFailedError: expected:<401> but was:<200>
          at junit.framework.Assert.fail(Assert.java:47)
          at junit.framework.Assert.failNotEquals(Assert.java:283)
          at junit.framework.Assert.assertEquals(Assert.java:64)
          at junit.framework.Assert.assertEquals(Assert.java:195)
          at junit.framework.Assert.assertEquals(Assert.java:201)
          at org.apache.hadoop.fs.http.server.TestHttpFSServer.__CLR3_0_2bnqkmt1wc(TestHttpFSServer.java:97)

          Show
          Eli Collins added a comment - ################################################################################### FAILED TESTS (if any) ############################## 2 tests failed. FAILED: org.apache.hadoop.fs.http.server.TestHttpFSServer.instrumentation Maybe it's just 23, eg https://builds.apache.org/job/Hadoop-Hdfs-0.23-Build/105/ Error Message: expected:<401> but was:<200> Stack Trace: junit.framework.AssertionFailedError: expected:<401> but was:<200> at junit.framework.Assert.fail(Assert.java:47) at junit.framework.Assert.failNotEquals(Assert.java:283) at junit.framework.Assert.assertEquals(Assert.java:64) at junit.framework.Assert.assertEquals(Assert.java:195) at junit.framework.Assert.assertEquals(Assert.java:201) at org.apache.hadoop.fs.http.server.TestHttpFSServer.__CLR3_0_2bnqkmt1wc(TestHttpFSServer.java:97)
          Hide
          Alejandro Abdelnur added a comment -

          Just did a build from trunk and run these testcases and they are passing

          
          Running org.apache.hadoop.fs.http.server.TestHttpFSServer
          Tests run: 5, Failures: 0, Errors: 0, Skipped: 0, Time elapsed: 9.049 sec
          Running org.apache.hadoop.lib.servlet.TestServerWebApp
          Tests run: 4, Failures: 0, Errors: 0, Skipped: 0, Time elapsed: 0.3 sec
          

          And looking at the latest build:

          https://builds.apache.org/job/Hadoop-Hdfs-trunk/892/

          These error are no there.

          Show
          Alejandro Abdelnur added a comment - Just did a build from trunk and run these testcases and they are passing Running org.apache.hadoop.fs.http.server.TestHttpFSServer Tests run: 5, Failures: 0, Errors: 0, Skipped: 0, Time elapsed: 9.049 sec Running org.apache.hadoop.lib.servlet.TestServerWebApp Tests run: 4, Failures: 0, Errors: 0, Skipped: 0, Time elapsed: 0.3 sec And looking at the latest build: https://builds.apache.org/job/Hadoop-Hdfs-trunk/892/ These error are no there.
          Hide
          Eli Collins added a comment -

          @Tucu, assigning to you, I think these are httpfs related.

          Show
          Eli Collins added a comment - @Tucu, assigning to you, I think these are httpfs related.

            People

            • Assignee:
              Alejandro Abdelnur
              Reporter:
              Eli Collins
            • Votes:
              0 Vote for this issue
              Watchers:
              1 Start watching this issue

              Dates

              • Created:
                Updated:
                Resolved:

                Development