Uploaded image for project: 'Hadoop HDFS'
  1. Hadoop HDFS
  2. HDFS-16536

TestOfflineImageViewer fails on branch-3.3

    XMLWordPrintableJSON

Details

    Description

      The NameNodeLayoutVersion -67 is not supported in Hadoop 3.3.x, so we need to downgrade the version in the XML to -66.

      [INFO] Running org.apache.hadoop.hdfs.tools.offlineImageViewer.TestOfflineImageViewer
      [ERROR] Tests run: 27, Failures: 0, Errors: 1, Skipped: 0, Time elapsed: 7.918 s <<< FAILURE! - in org.apache.hadoop.hdfs.tools.offlineImageViewer.TestOfflineImageViewer
      [ERROR] testReverseXmlWithoutSnapshotDiffSection(org.apache.hadoop.hdfs.tools.offlineImageViewer.TestOfflineImageViewer)  Time elapsed: 0.009 s  <<< ERROR!
      java.io.IOException: Layout version mismatch.  This oiv tool handles layout version -66, but the XML file has <layoutVersion> -67.  Please either re-generate the XML file with the proper layout version, or manually edit the XML file to be usable with this version of the oiv tool.
      	at org.apache.hadoop.hdfs.tools.offlineImageViewer.OfflineImageReconstructor.readVersion(OfflineImageReconstructor.java:1699)
      	at org.apache.hadoop.hdfs.tools.offlineImageViewer.OfflineImageReconstructor.processXml(OfflineImageReconstructor.java:1753)
      	at org.apache.hadoop.hdfs.tools.offlineImageViewer.OfflineImageReconstructor.run(OfflineImageReconstructor.java:1846)
      	at org.apache.hadoop.hdfs.tools.offlineImageViewer.TestOfflineImageViewer.testReverseXmlWithoutSnapshotDiffSection(TestOfflineImageViewer.java:1209)
      	at sun.reflect.NativeMethodAccessorImpl.invoke0(Native Method)
      	at sun.reflect.NativeMethodAccessorImpl.invoke(NativeMethodAccessorImpl.java:62)
      	at sun.reflect.DelegatingMethodAccessorImpl.invoke(DelegatingMethodAccessorImpl.java:43)
      	at java.lang.reflect.Method.invoke(Method.java:498)
      	at org.junit.runners.model.FrameworkMethod$1.runReflectiveCall(FrameworkMethod.java:59)
      	at org.junit.internal.runners.model.ReflectiveCallable.run(ReflectiveCallable.java:12)
      	at org.junit.runners.model.FrameworkMethod.invokeExplosively(FrameworkMethod.java:56)
      	at org.junit.internal.runners.statements.InvokeMethod.evaluate(InvokeMethod.java:17)
      	at org.junit.runners.ParentRunner$3.evaluate(ParentRunner.java:306)
      	at org.junit.runners.BlockJUnit4ClassRunner$1.evaluate(BlockJUnit4ClassRunner.java:100)
      	at org.junit.runners.ParentRunner.runLeaf(ParentRunner.java:366)
      	at org.junit.runners.BlockJUnit4ClassRunner.runChild(BlockJUnit4ClassRunner.java:103)
      	at org.junit.runners.BlockJUnit4ClassRunner.runChild(BlockJUnit4ClassRunner.java:63)
      	at org.junit.runners.ParentRunner$4.run(ParentRunner.java:331)
      	at org.junit.runners.ParentRunner$1.schedule(ParentRunner.java:79)
      	at org.junit.runners.ParentRunner.runChildren(ParentRunner.java:329)
      	at org.junit.runners.ParentRunner.access$100(ParentRunner.java:66)
      	at org.junit.runners.ParentRunner$2.evaluate(ParentRunner.java:293)
      	at org.junit.internal.runners.statements.RunBefores.evaluate(RunBefores.java:26)
      	at org.junit.internal.runners.statements.RunAfters.evaluate(RunAfters.java:27)
      	at org.junit.runners.ParentRunner$3.evaluate(ParentRunner.java:306)
      	at org.junit.runners.ParentRunner.run(ParentRunner.java:413)
      	at org.apache.maven.surefire.junit4.JUnit4Provider.execute(JUnit4Provider.java:365)
      	at org.apache.maven.surefire.junit4.JUnit4Provider.executeWithRerun(JUnit4Provider.java:273)
      	at org.apache.maven.surefire.junit4.JUnit4Provider.executeTestSet(JUnit4Provider.java:238)
      	at org.apache.maven.surefire.junit4.JUnit4Provider.invoke(JUnit4Provider.java:159)
      	at org.apache.maven.surefire.booter.ForkedBooter.invokeProviderInSameClassLoader(ForkedBooter.java:384)
      	at org.apache.maven.surefire.booter.ForkedBooter.runSuitesInProcess(ForkedBooter.java:345)
      	at org.apache.maven.surefire.booter.ForkedBooter.execute(ForkedBooter.java:126)
      	at org.apache.maven.surefire.booter.ForkedBooter.main(ForkedBooter.java:418) 

      Attachments

        Issue Links

          Activity

            People

              groot groot
              aajisaka Akira Ajisaka
              Votes:
              0 Vote for this issue
              Watchers:
              1 Start watching this issue

              Dates

                Created:
                Updated:
                Resolved:

                Time Tracking

                  Estimated:
                  Original Estimate - Not Specified
                  Not Specified
                  Remaining:
                  Remaining Estimate - 0h
                  0h
                  Logged:
                  Time Spent - 40m
                  40m