Uploaded image for project: 'Hadoop HDFS'
  1. Hadoop HDFS
  2. HDFS-15646 Track failing tests in HDFS
  3. HDFS-15878

RBF: Flaky test TestRouterWebHDFSContractCreate>AbstractContractCreateTest#testSyncable in Trunk

Log workAgile BoardRank to TopRank to BottomAttach filesAttach ScreenshotAdd voteVotersWatch issueWatchersConvert to IssueMoveLinkCloneLabelsUpdate Comment AuthorReplace String in CommentUpdate Comment VisibilityDelete Comments
    XMLWordPrintableJSON

Details

    • Sub-task
    • Status: Reopened
    • Major
    • Resolution: Unresolved
    • None
    • None
    • hdfs, rbf
    • None

    Description

      ERROR] Tests run: 16, Failures: 0, Errors: 1, Skipped: 2, Time elapsed: 24.627 s <<< FAILURE! - in org.apache.hadoop.fs.contract.router.web.TestRouterWebHDFSContractCreate
      [ERROR] testSyncable(org.apache.hadoop.fs.contract.router.web.TestRouterWebHDFSContractCreate) Time elapsed: 0.222 s <<< ERROR!
      java.io.FileNotFoundException: File /test/testSyncable not found.
      at sun.reflect.NativeConstructorAccessorImpl.newInstance0(Native Method)
      at sun.reflect.NativeConstructorAccessorImpl.newInstance(NativeConstructorAccessorImpl.java:62)
      at sun.reflect.DelegatingConstructorAccessorImpl.newInstance(DelegatingConstructorAccessorImpl.java:45)
      at java.lang.reflect.Constructor.newInstance(Constructor.java:423)
      at org.apache.hadoop.ipc.RemoteException.instantiateException(RemoteException.java:121)
      at org.apache.hadoop.ipc.RemoteException.unwrapRemoteException(RemoteException.java:110)
      at org.apache.hadoop.hdfs.web.WebHdfsFileSystem.toIOException(WebHdfsFileSystem.java:576)
      at org.apache.hadoop.hdfs.web.WebHdfsFileSystem.access$900(WebHdfsFileSystem.java:146)
      at org.apache.hadoop.hdfs.web.WebHdfsFileSystem$AbstractRunner.shouldRetry(WebHdfsFileSystem.java:892)
      at org.apache.hadoop.hdfs.web.WebHdfsFileSystem$AbstractRunner.runWithRetry(WebHdfsFileSystem.java:858)
      at org.apache.hadoop.hdfs.web.WebHdfsFileSystem$AbstractRunner.access$100(WebHdfsFileSystem.java:652)
      at org.apache.hadoop.hdfs.web.WebHdfsFileSystem$AbstractRunner$1.run(WebHdfsFileSystem.java:690)
      at java.security.AccessController.doPrivileged(Native Method)
      at javax.security.auth.Subject.doAs(Subject.java:422)
      at org.apache.hadoop.security.UserGroupInformation.doAs(UserGroupInformation.java:1899)
      at org.apache.hadoop.hdfs.web.WebHdfsFileSystem$AbstractRunner.run(WebHdfsFileSystem.java:686)
      at org.apache.hadoop.hdfs.web.WebHdfsFileSystem$ReadRunner.getRedirectedUrl(WebHdfsFileSystem.java:2307)
      at org.apache.hadoop.hdfs.web.WebHdfsFileSystem$ReadRunner.<init>(WebHdfsFileSystem.java:2296)
      at org.apache.hadoop.hdfs.web.WebHdfsFileSystem$WebHdfsInputStream.<init>(WebHdfsFileSystem.java:2176)
      at org.apache.hadoop.hdfs.web.WebHdfsFileSystem.open(WebHdfsFileSystem.java:1610)
      at org.apache.hadoop.fs.FileSystem.open(FileSystem.java:975)
      at org.apache.hadoop.fs.contract.AbstractContractCreateTest.validateSyncableSemantics(AbstractContractCreateTest.java:556)
      at org.apache.hadoop.fs.contract.AbstractContractCreateTest.testSyncable(AbstractContractCreateTest.java:459)
      at sun.reflect.NativeMethodAccessorImpl.invoke0(Native Method)
      at sun.reflect.NativeMethodAccessorImpl.invoke(NativeMethodAccessorImpl.java:62)
      at sun.reflect.DelegatingMethodAccessorImpl.invoke(DelegatingMethodAccessorImpl.java:43)
      at java.lang.reflect.Method.invoke(Method.java:498)
      at org.junit.runners.model.FrameworkMethod$1.runReflectiveCall(FrameworkMethod.java:50)
      at org.junit.internal.runners.model.ReflectiveCallable.run(ReflectiveCallable.java:12)
      at org.junit.runners.model.FrameworkMethod.invokeExplosively(FrameworkMethod.java:47)
      at org.junit.internal.runners.statements.InvokeMethod.evaluate(InvokeMethod.java:17)
      at org.junit.internal.runners.statements.RunBefores.evaluate(RunBefores.java:26)
      at org.junit.internal.runners.statements.RunAfters.evaluate(RunAfters.java:27)
      at org.junit.rules.TestWatcher$1.evaluate(TestWatcher.java:55)
      at org.junit.internal.runners.statements.FailOnTimeout$CallableStatement.call(FailOnTimeout.java:298)
      at org.junit.internal.runners.statements.FailOnTimeout$CallableStatement.call(FailOnTimeout.java:292)
      at java.util.concurrent.FutureTask.run(FutureTask.java:266)
      at java.lang.Thread.run(Thread.java:748)
      Caused by: org.apache.hadoop.ipc.RemoteException(java.io.FileNotFoundException): File /test/testSyncable not found.
      at org.apache.hadoop.hdfs.web.JsonUtilClient.toRemoteException(JsonUtilClient.java:90)
      at org.apache.hadoop.hdfs.web.WebHdfsFileSystem.validateResponse(WebHdfsFileSystem.java:537)
      at org.apache.hadoop.hdfs.web.WebHdfsFileSystem.access$300(WebHdfsFileSystem.java:146)
      at org.apache.hadoop.hdfs.web.WebHdfsFileSystem$AbstractRunner.connect(WebHdfsFileSystem.java:738)
      at org.apache.hadoop.hdfs.web.WebHdfsFileSystem$AbstractRunner.runWithRetry(WebHdfsFileSystem.java:829)
      ... 28 more

      [INFO]
      [INFO] Results:
      [INFO]
      [ERROR] Errors:
      [ERROR] TestRouterWebHDFSContractCreate>AbstractContractCreateTest.testSyncable:459->AbstractContractCreateTest.validateSyncableSemantics:556 ? FileNotFound

      Attachments

        Issue Links

        Activity

          This comment will be Viewable by All Users Viewable by All Users
          Cancel

          People

            fengnanli Fengnan Li Assign to me
            prasad-acit Renukaprasad C

            Dates

              Created:
              Updated:

              Issue deployment