Uploaded image for project: 'Hadoop HDFS'
  1. Hadoop HDFS
  2. HDFS-13548

TestResolveHdfsSymlink#testFcResolveAfs fails on Windows

    Details

    • Type: Test
    • Status: Resolved
    • Priority: Minor
    • Resolution: Fixed
    • Affects Version/s: None
    • Fix Version/s: 2.10.0, 3.2.0, 3.1.1, 2.9.2, 3.0.3
    • Component/s: None
    • Labels:
      None
    • Hadoop Flags:
      Reviewed

      Description

      TestResolveHdfsSymlink#testFcResolveAfs fails on Windows with error message:

      [INFO] Running org.apache.hadoop.fs.TestResolveHdfsSymlink
      [ERROR] Tests run: 1, Failures: 0, Errors: 1, Skipped: 0, Time elapsed: 28.574 s <<< FAILURE! - in org.apache.hadoop.fs.TestResolveHdfsSymlink
      [ERROR] testFcResolveAfs(org.apache.hadoop.fs.TestResolveHdfsSymlink) Time elapsed: 0.039 s <<< ERROR!
      java.io.IOException: Mkdirs failed to create file:/E:/OSS/hadoop/hadoop-hdfs-project/hadoop-hdfs/file:/E:/OSS/hadoop/hadoop-hdfs-project/hadoop-hdfs/target/test/data/n014HnmeeA
      at org.apache.hadoop.hdfs.DFSTestUtil.createFile(DFSTestUtil.java:360)
      at org.apache.hadoop.fs.TestResolveHdfsSymlink.testFcResolveAfs(TestResolveHdfsSymlink.java:88)
      at sun.reflect.NativeMethodAccessorImpl.invoke0(Native Method)
      at sun.reflect.NativeMethodAccessorImpl.invoke(NativeMethodAccessorImpl.java:62)
      at sun.reflect.DelegatingMethodAccessorImpl.invoke(DelegatingMethodAccessorImpl.java:43)
      at java.lang.reflect.Method.invoke(Method.java:498)
      at org.junit.runners.model.FrameworkMethod$1.runReflectiveCall(FrameworkMethod.java:47)
      at org.junit.internal.runners.model.ReflectiveCallable.run(ReflectiveCallable.java:12)
      at org.junit.runners.model.FrameworkMethod.invokeExplosively(FrameworkMethod.java:44)
      at org.junit.internal.runners.statements.InvokeMethod.evaluate(InvokeMethod.java:17)
      at org.junit.runners.ParentRunner.runLeaf(ParentRunner.java:271)
      at org.junit.runners.BlockJUnit4ClassRunner.runChild(BlockJUnit4ClassRunner.java:70)
      at org.junit.runners.BlockJUnit4ClassRunner.runChild(BlockJUnit4ClassRunner.java:50)
      at org.junit.runners.ParentRunner$3.run(ParentRunner.java:238)
      at org.junit.runners.ParentRunner$1.schedule(ParentRunner.java:63)
      at org.junit.runners.ParentRunner.runChildren(ParentRunner.java:236)
      at org.junit.runners.ParentRunner.access$000(ParentRunner.java:53)
      at org.junit.runners.ParentRunner$2.evaluate(ParentRunner.java:229)
      at org.junit.internal.runners.statements.RunBefores.evaluate(RunBefores.java:26)
      at org.junit.internal.runners.statements.RunAfters.evaluate(RunAfters.java:27)
      at org.junit.runners.ParentRunner.run(ParentRunner.java:309)
      at org.apache.maven.surefire.junit4.JUnit4Provider.execute(JUnit4Provider.java:365)
      at org.apache.maven.surefire.junit4.JUnit4Provider.executeWithRerun(JUnit4Provider.java:273)
      at org.apache.maven.surefire.junit4.JUnit4Provider.executeTestSet(JUnit4Provider.java:238)
      at org.apache.maven.surefire.junit4.JUnit4Provider.invoke(JUnit4Provider.java:159)
      at org.apache.maven.surefire.booter.ForkedBooter.invokeProviderInSameClassLoader(ForkedBooter.java:379)
      at org.apache.maven.surefire.booter.ForkedBooter.runSuitesInProcess(ForkedBooter.java:340)
      at org.apache.maven.surefire.booter.ForkedBooter.execute(ForkedBooter.java:125)
      at org.apache.maven.surefire.booter.ForkedBooter.main(ForkedBooter.java:413)

      [INFO]
      [INFO] Results:
      [INFO]
      [ERROR] Errors:
      [ERROR] TestResolveHdfsSymlink.testFcResolveAfs:88 â•— IO Mkdirs failed to create file:/...
      [INFO]
      [ERROR] Tests run: 1, Failures: 0, Errors: 1, Skipped: 0

        Attachments

          Issue Links

            Activity

              People

              • Assignee:
                huanbang1993 Anbang Hu
                Reporter:
                huanbang1993 Anbang Hu
              • Votes:
                0 Vote for this issue
                Watchers:
                4 Start watching this issue

                Dates

                • Created:
                  Updated:
                  Resolved: