Uploaded image for project: 'Hadoop HDFS'
  1. Hadoop HDFS
  2. HDFS-12845

JournalNode Test failures

    XMLWordPrintableJSON

    Details

    • Type: Bug
    • Status: Resolved
    • Priority: Major
    • Resolution: Fixed
    • Affects Version/s: 3.0.0
    • Fix Version/s: 3.0.1
    • Component/s: journal-node
    • Labels:
      None
    • Hadoop Flags:
      Reviewed

      Description

      testJournalNodeSyncerNotStartWhenSyncEnabled(org.apache.hadoop.hdfs.qjournal.server.TestJournalNode)  Time elapsed: 0.258 sec  <<< FAILURE!
      java.lang.AssertionError: expected:<true> but was:<false>
        at org.junit.Assert.fail(Assert.java:88)
        at org.junit.Assert.failNotEquals(Assert.java:743)
        at org.junit.Assert.assertEquals(Assert.java:118)
        at org.junit.Assert.assertEquals(Assert.java:144)
        at org.apache.hadoop.hdfs.qjournal.server.TestJournalNode.testJournalNodeSyncerNotStartWhenSyncEnabled(TestJournalNode.java:448)

      testJournalNodeSyncerNotStartWhenSyncEnabledIncorrectURI(org.apache.hadoop.hdfs.qjournal.server.TestJournalNode)  Time elapsed: 0.224 sec  <<< FAILURE!
      java.lang.AssertionError: expected:<true> but was:<false>
        at org.junit.Assert.fail(Assert.java:88)
        at org.junit.Assert.failNotEquals(Assert.java:743)
        at org.junit.Assert.assertEquals(Assert.java:118)
        at org.junit.Assert.assertEquals(Assert.java:144)
        at org.apache.hadoop.hdfs.qjournal.server.TestJournalNode.testJournalNodeSyncerNotStartWhenSyncEnabledIncorrectURI(TestJournalNode.java:427)

        Attachments

        1. HDFS-12845-branch-3.0.00.patch
          1 kB
          Bharat Viswanadham

          Activity

            People

            • Assignee:
              bharat Bharat Viswanadham
              Reporter:
              bharat Bharat Viswanadham
            • Votes:
              0 Vote for this issue
              Watchers:
              3 Start watching this issue

              Dates

              • Created:
                Updated:
                Resolved: