Details

    • Type: Bug
    • Status: Resolved
    • Priority: Major
    • Resolution: Fixed
    • Affects Version/s: None
    • Fix Version/s: 2.8.0, 3.0.0-alpha1
    • Component/s: None
    • Labels:
      None
    • Hadoop Flags:
      Reviewed

      Description

      Jenkins link
      https://builds.apache.org/job/PreCommit-HDFS-Build/15041/testReport/
      Trace

      java.lang.RuntimeException: org.apache.hadoop.TestRefreshCallQueue$MockCallQueue could not be constructed.
      	at org.apache.hadoop.ipc.CallQueueManager.createCallQueueInstance(CallQueueManager.java:164)
      	at org.apache.hadoop.ipc.CallQueueManager.<init>(CallQueueManager.java:70)
      	at org.apache.hadoop.ipc.Server.<init>(Server.java:2579)
      	at org.apache.hadoop.ipc.RPC$Server.<init>(RPC.java:958)
      	at org.apache.hadoop.ipc.ProtobufRpcEngine$Server.<init>(ProtobufRpcEngine.java:535)
      	at org.apache.hadoop.ipc.ProtobufRpcEngine.getServer(ProtobufRpcEngine.java:510)
      	at org.apache.hadoop.ipc.RPC$Builder.build(RPC.java:800)
      	at org.apache.hadoop.hdfs.server.namenode.NameNodeRpcServer.<init>(NameNodeRpcServer.java:421)
      	at org.apache.hadoop.hdfs.server.namenode.NameNode.createRpcServer(NameNode.java:759)
      	at org.apache.hadoop.hdfs.server.namenode.NameNode.initialize(NameNode.java:701)
      	at org.apache.hadoop.hdfs.server.namenode.NameNode.<init>(NameNode.java:900)
      	at org.apache.hadoop.hdfs.server.namenode.NameNode.<init>(NameNode.java:879)
      	at org.apache.hadoop.hdfs.server.namenode.NameNode.createNameNode(NameNode.java:1596)
      	at org.apache.hadoop.hdfs.MiniDFSCluster.createNameNode(MiniDFSCluster.java:1247)
      	at org.apache.hadoop.hdfs.MiniDFSCluster.configureNameService(MiniDFSCluster.java:1016)
      	at org.apache.hadoop.hdfs.MiniDFSCluster.createNameNodesAndSetConf(MiniDFSCluster.java:891)
      	at org.apache.hadoop.hdfs.MiniDFSCluster.initMiniDFSCluster(MiniDFSCluster.java:823)
      	at org.apache.hadoop.hdfs.MiniDFSCluster.<init>(MiniDFSCluster.java:482)
      	at org.apache.hadoop.hdfs.MiniDFSCluster$Builder.build(MiniDFSCluster.java:441)
      	at org.apache.hadoop.TestRefreshCallQueue.setUp(TestRefreshCallQueue.java:71)
      

        Issue Links

          Activity

          Hide
          brahmareddy Brahma Reddy Battula added a comment -

          broken by HADOOP-12916.

          Show
          brahmareddy Brahma Reddy Battula added a comment - broken by HADOOP-12916 .
          Hide
          xyao Xiaoyu Yao added a comment -

          Thanks Brahma Reddy Battula for catching this. Attach a simple fix for reference if you have not started working on it .

          Show
          xyao Xiaoyu Yao added a comment - Thanks Brahma Reddy Battula for catching this. Attach a simple fix for reference if you have not started working on it .
          Hide
          vinayrpet Vinayakumar B added a comment -

          Verified Locally. Its passing.
          +1, pending jenkins.

          Show
          vinayrpet Vinayakumar B added a comment - Verified Locally. Its passing. +1, pending jenkins.
          Hide
          hadoopqa Hadoop QA added a comment -
          -1 overall



          Vote Subsystem Runtime Comment
          0 reexec 0m 15s Docker mode activated.
          +1 @author 0m 0s The patch does not contain any @author tags.
          +1 test4tests 0m 0s The patch appears to include 1 new or modified test files.
          +1 mvninstall 7m 6s trunk passed
          +1 compile 0m 52s trunk passed with JDK v1.8.0_74
          +1 compile 0m 42s trunk passed with JDK v1.7.0_95
          +1 checkstyle 0m 21s trunk passed
          +1 mvnsite 0m 51s trunk passed
          +1 mvneclipse 0m 14s trunk passed
          +1 findbugs 1m 59s trunk passed
          +1 javadoc 1m 14s trunk passed with JDK v1.8.0_74
          +1 javadoc 1m 50s trunk passed with JDK v1.7.0_95
          +1 mvninstall 0m 49s the patch passed
          +1 compile 0m 50s the patch passed with JDK v1.8.0_74
          +1 javac 0m 50s the patch passed
          +1 compile 0m 41s the patch passed with JDK v1.7.0_95
          +1 javac 0m 41s the patch passed
          +1 checkstyle 0m 18s the patch passed
          +1 mvnsite 0m 53s the patch passed
          +1 mvneclipse 0m 11s the patch passed
          +1 whitespace 0m 0s Patch has no whitespace issues.
          +1 findbugs 2m 10s the patch passed
          +1 javadoc 1m 14s the patch passed with JDK v1.8.0_74
          +1 javadoc 1m 52s the patch passed with JDK v1.7.0_95
          -1 unit 80m 32s hadoop-hdfs in the patch failed with JDK v1.8.0_74.
          -1 unit 73m 58s hadoop-hdfs in the patch failed with JDK v1.7.0_95.
          +1 asflicense 0m 21s Patch does not generate ASF License warnings.
          181m 28s



          Reason Tests
          JDK v1.8.0_74 Failed junit tests hadoop.hdfs.TestHFlush
            hadoop.hdfs.security.TestDelegationTokenForProxyUser
            hadoop.hdfs.server.namenode.TestEditLog
            hadoop.hdfs.TestEncryptionZones
          JDK v1.7.0_95 Failed junit tests hadoop.hdfs.TestHFlush
            hadoop.hdfs.server.datanode.fsdataset.impl.TestFsDatasetImpl
            hadoop.hdfs.server.namenode.TestEditLog
            hadoop.hdfs.TestReconstructStripedFile



          Subsystem Report/Notes
          Docker Image:yetus/hadoop:fbe3e86
          JIRA Patch URL https://issues.apache.org/jira/secure/attachment/12796702/HDFS-10253.00.patch
          JIRA Issue HDFS-10253
          Optional Tests asflicense compile javac javadoc mvninstall mvnsite unit findbugs checkstyle
          uname Linux 07cd41649bf7 3.13.0-36-lowlatency #63-Ubuntu SMP PREEMPT Wed Sep 3 21:56:12 UTC 2014 x86_64 x86_64 x86_64 GNU/Linux
          Build tool maven
          Personality /testptch/hadoop/patchprocess/precommit/personality/provided.sh
          git revision trunk / 81d04ca
          Default Java 1.7.0_95
          Multi-JDK versions /usr/lib/jvm/java-8-oracle:1.8.0_74 /usr/lib/jvm/java-7-openjdk-amd64:1.7.0_95
          findbugs v3.0.0
          unit https://builds.apache.org/job/PreCommit-HDFS-Build/15047/artifact/patchprocess/patch-unit-hadoop-hdfs-project_hadoop-hdfs-jdk1.8.0_74.txt
          unit https://builds.apache.org/job/PreCommit-HDFS-Build/15047/artifact/patchprocess/patch-unit-hadoop-hdfs-project_hadoop-hdfs-jdk1.7.0_95.txt
          unit test logs https://builds.apache.org/job/PreCommit-HDFS-Build/15047/artifact/patchprocess/patch-unit-hadoop-hdfs-project_hadoop-hdfs-jdk1.8.0_74.txt https://builds.apache.org/job/PreCommit-HDFS-Build/15047/artifact/patchprocess/patch-unit-hadoop-hdfs-project_hadoop-hdfs-jdk1.7.0_95.txt
          JDK v1.7.0_95 Test Results https://builds.apache.org/job/PreCommit-HDFS-Build/15047/testReport/
          modules C: hadoop-hdfs-project/hadoop-hdfs U: hadoop-hdfs-project/hadoop-hdfs
          Console output https://builds.apache.org/job/PreCommit-HDFS-Build/15047/console
          Powered by Apache Yetus 0.2.0 http://yetus.apache.org

          This message was automatically generated.

          Show
          hadoopqa Hadoop QA added a comment - -1 overall Vote Subsystem Runtime Comment 0 reexec 0m 15s Docker mode activated. +1 @author 0m 0s The patch does not contain any @author tags. +1 test4tests 0m 0s The patch appears to include 1 new or modified test files. +1 mvninstall 7m 6s trunk passed +1 compile 0m 52s trunk passed with JDK v1.8.0_74 +1 compile 0m 42s trunk passed with JDK v1.7.0_95 +1 checkstyle 0m 21s trunk passed +1 mvnsite 0m 51s trunk passed +1 mvneclipse 0m 14s trunk passed +1 findbugs 1m 59s trunk passed +1 javadoc 1m 14s trunk passed with JDK v1.8.0_74 +1 javadoc 1m 50s trunk passed with JDK v1.7.0_95 +1 mvninstall 0m 49s the patch passed +1 compile 0m 50s the patch passed with JDK v1.8.0_74 +1 javac 0m 50s the patch passed +1 compile 0m 41s the patch passed with JDK v1.7.0_95 +1 javac 0m 41s the patch passed +1 checkstyle 0m 18s the patch passed +1 mvnsite 0m 53s the patch passed +1 mvneclipse 0m 11s the patch passed +1 whitespace 0m 0s Patch has no whitespace issues. +1 findbugs 2m 10s the patch passed +1 javadoc 1m 14s the patch passed with JDK v1.8.0_74 +1 javadoc 1m 52s the patch passed with JDK v1.7.0_95 -1 unit 80m 32s hadoop-hdfs in the patch failed with JDK v1.8.0_74. -1 unit 73m 58s hadoop-hdfs in the patch failed with JDK v1.7.0_95. +1 asflicense 0m 21s Patch does not generate ASF License warnings. 181m 28s Reason Tests JDK v1.8.0_74 Failed junit tests hadoop.hdfs.TestHFlush   hadoop.hdfs.security.TestDelegationTokenForProxyUser   hadoop.hdfs.server.namenode.TestEditLog   hadoop.hdfs.TestEncryptionZones JDK v1.7.0_95 Failed junit tests hadoop.hdfs.TestHFlush   hadoop.hdfs.server.datanode.fsdataset.impl.TestFsDatasetImpl   hadoop.hdfs.server.namenode.TestEditLog   hadoop.hdfs.TestReconstructStripedFile Subsystem Report/Notes Docker Image:yetus/hadoop:fbe3e86 JIRA Patch URL https://issues.apache.org/jira/secure/attachment/12796702/HDFS-10253.00.patch JIRA Issue HDFS-10253 Optional Tests asflicense compile javac javadoc mvninstall mvnsite unit findbugs checkstyle uname Linux 07cd41649bf7 3.13.0-36-lowlatency #63-Ubuntu SMP PREEMPT Wed Sep 3 21:56:12 UTC 2014 x86_64 x86_64 x86_64 GNU/Linux Build tool maven Personality /testptch/hadoop/patchprocess/precommit/personality/provided.sh git revision trunk / 81d04ca Default Java 1.7.0_95 Multi-JDK versions /usr/lib/jvm/java-8-oracle:1.8.0_74 /usr/lib/jvm/java-7-openjdk-amd64:1.7.0_95 findbugs v3.0.0 unit https://builds.apache.org/job/PreCommit-HDFS-Build/15047/artifact/patchprocess/patch-unit-hadoop-hdfs-project_hadoop-hdfs-jdk1.8.0_74.txt unit https://builds.apache.org/job/PreCommit-HDFS-Build/15047/artifact/patchprocess/patch-unit-hadoop-hdfs-project_hadoop-hdfs-jdk1.7.0_95.txt unit test logs https://builds.apache.org/job/PreCommit-HDFS-Build/15047/artifact/patchprocess/patch-unit-hadoop-hdfs-project_hadoop-hdfs-jdk1.8.0_74.txt https://builds.apache.org/job/PreCommit-HDFS-Build/15047/artifact/patchprocess/patch-unit-hadoop-hdfs-project_hadoop-hdfs-jdk1.7.0_95.txt JDK v1.7.0_95 Test Results https://builds.apache.org/job/PreCommit-HDFS-Build/15047/testReport/ modules C: hadoop-hdfs-project/hadoop-hdfs U: hadoop-hdfs-project/hadoop-hdfs Console output https://builds.apache.org/job/PreCommit-HDFS-Build/15047/console Powered by Apache Yetus 0.2.0 http://yetus.apache.org This message was automatically generated.
          Hide
          vinayrpet Vinayakumar B added a comment -

          Committed to trunk, branch-2 and branch-2.8
          Thanks Brahma Reddy Battula for reporting.
          Thanks Xiaoyu Yao for the fix.

          Show
          vinayrpet Vinayakumar B added a comment - Committed to trunk, branch-2 and branch-2.8 Thanks Brahma Reddy Battula for reporting. Thanks Xiaoyu Yao for the fix.
          Hide
          hudson Hudson added a comment -

          FAILURE: Integrated in Hadoop-trunk-Commit #9544 (See https://builds.apache.org/job/Hadoop-trunk-Commit/9544/)
          HDFS-10253. Fix TestRefreshCallQueue failure (Contributed by Xiaoyu Yao) (vinayakumarb: rev 54b2e78fd28c9def42bec7f0418833bad352686c)

          • hadoop-hdfs-project/hadoop-hdfs/src/test/java/org/apache/hadoop/TestRefreshCallQueue.java
          Show
          hudson Hudson added a comment - FAILURE: Integrated in Hadoop-trunk-Commit #9544 (See https://builds.apache.org/job/Hadoop-trunk-Commit/9544/ ) HDFS-10253 . Fix TestRefreshCallQueue failure (Contributed by Xiaoyu Yao) (vinayakumarb: rev 54b2e78fd28c9def42bec7f0418833bad352686c) hadoop-hdfs-project/hadoop-hdfs/src/test/java/org/apache/hadoop/TestRefreshCallQueue.java

            People

            • Assignee:
              xyao Xiaoyu Yao
              Reporter:
              brahmareddy Brahma Reddy Battula
            • Votes:
              0 Vote for this issue
              Watchers:
              5 Start watching this issue

              Dates

              • Created:
                Updated:
                Resolved:

                Development