Details

    • Type: Sub-task Sub-task
    • Status: Closed
    • Priority: Minor Minor
    • Resolution: Fixed
    • Affects Version/s: None
    • Fix Version/s: 0.95.0
    • Component/s: test
    • Labels:
      None
    • Hadoop Flags:
      Reviewed

      Description

      Failed tests: testScannerResultCodes(org.apache.hadoop.hbase.rest.TestGzipFilter): expected:<204> but was:<200>

      1. trunk-7113.patch
        1.0 kB
        Jimmy Xiang

        Issue Links

          Activity

          Hide
          Andrew Purtell added a comment -

          This is the first time I've seen this in at least a year. Flagging the test as flaky may be premature. Can we see more detail on the failure?

          Show
          Andrew Purtell added a comment - This is the first time I've seen this in at least a year. Flagging the test as flaky may be premature. Can we see more detail on the failure?
          Hide
          Andrew Purtell added a comment -

          Ah, I see a patch was added. Is this a JDK7 thing?

          Show
          Andrew Purtell added a comment - Ah, I see a patch was added. Is this a JDK7 thing?
          Hide
          Jimmy Xiang added a comment -

          testScannerResultCodes must run after testGzipFilter. Since there is no good way to specify the execution order, I re-order the test code a little.

          Show
          Jimmy Xiang added a comment - testScannerResultCodes must run after testGzipFilter. Since there is no good way to specify the execution order, I re-order the test code a little.
          Hide
          Jimmy Xiang added a comment -

          Yes, that's right. It is related to jdk7.

          Show
          Jimmy Xiang added a comment - Yes, that's right. It is related to jdk7.
          Hide
          Andrew Purtell added a comment -

          +1

          Show
          Andrew Purtell added a comment - +1
          Hide
          Jimmy Xiang added a comment -

          Thanks for reviewing it. I updated the title to be clear.

          Show
          Jimmy Xiang added a comment - Thanks for reviewing it. I updated the title to be clear.
          Hide
          Hadoop QA added a comment -

          -1 overall. Here are the results of testing the latest attachment
          http://issues.apache.org/jira/secure/attachment/12552490/trunk-7113.patch
          against trunk revision .

          +1 @author. The patch does not contain any @author tags.

          +1 tests included. The patch appears to include 3 new or modified tests.

          +1 hadoop2.0. The patch compiles against the hadoop 2.0 profile.

          -1 javadoc. The javadoc tool appears to have generated 87 warning messages.

          +1 javac. The applied patch does not increase the total number of javac compiler warnings.

          -1 findbugs. The patch appears to introduce 15 new Findbugs (version 1.3.9) warnings.

          +1 release audit. The applied patch does not increase the total number of release audit warnings.

          -1 core tests. The patch failed these unit tests:
          org.apache.hadoop.hbase.mapreduce.TestHFileOutputFormat

          Test results: https://builds.apache.org/job/PreCommit-HBASE-Build/3254//testReport/
          Findbugs warnings: https://builds.apache.org/job/PreCommit-HBASE-Build/3254//artifact/trunk/patchprocess/newPatchFindbugsWarningshbase-hadoop2-compat.html
          Findbugs warnings: https://builds.apache.org/job/PreCommit-HBASE-Build/3254//artifact/trunk/patchprocess/newPatchFindbugsWarningshbase-examples.html
          Findbugs warnings: https://builds.apache.org/job/PreCommit-HBASE-Build/3254//artifact/trunk/patchprocess/newPatchFindbugsWarningshbase-server.html
          Findbugs warnings: https://builds.apache.org/job/PreCommit-HBASE-Build/3254//artifact/trunk/patchprocess/newPatchFindbugsWarningshbase-hadoop1-compat.html
          Findbugs warnings: https://builds.apache.org/job/PreCommit-HBASE-Build/3254//artifact/trunk/patchprocess/newPatchFindbugsWarningshbase-common.html
          Findbugs warnings: https://builds.apache.org/job/PreCommit-HBASE-Build/3254//artifact/trunk/patchprocess/newPatchFindbugsWarningshbase-hadoop-compat.html
          Console output: https://builds.apache.org/job/PreCommit-HBASE-Build/3254//console

          This message is automatically generated.

          Show
          Hadoop QA added a comment - -1 overall . Here are the results of testing the latest attachment http://issues.apache.org/jira/secure/attachment/12552490/trunk-7113.patch against trunk revision . +1 @author . The patch does not contain any @author tags. +1 tests included . The patch appears to include 3 new or modified tests. +1 hadoop2.0 . The patch compiles against the hadoop 2.0 profile. -1 javadoc . The javadoc tool appears to have generated 87 warning messages. +1 javac . The applied patch does not increase the total number of javac compiler warnings. -1 findbugs . The patch appears to introduce 15 new Findbugs (version 1.3.9) warnings. +1 release audit . The applied patch does not increase the total number of release audit warnings. -1 core tests . The patch failed these unit tests: org.apache.hadoop.hbase.mapreduce.TestHFileOutputFormat Test results: https://builds.apache.org/job/PreCommit-HBASE-Build/3254//testReport/ Findbugs warnings: https://builds.apache.org/job/PreCommit-HBASE-Build/3254//artifact/trunk/patchprocess/newPatchFindbugsWarningshbase-hadoop2-compat.html Findbugs warnings: https://builds.apache.org/job/PreCommit-HBASE-Build/3254//artifact/trunk/patchprocess/newPatchFindbugsWarningshbase-examples.html Findbugs warnings: https://builds.apache.org/job/PreCommit-HBASE-Build/3254//artifact/trunk/patchprocess/newPatchFindbugsWarningshbase-server.html Findbugs warnings: https://builds.apache.org/job/PreCommit-HBASE-Build/3254//artifact/trunk/patchprocess/newPatchFindbugsWarningshbase-hadoop1-compat.html Findbugs warnings: https://builds.apache.org/job/PreCommit-HBASE-Build/3254//artifact/trunk/patchprocess/newPatchFindbugsWarningshbase-common.html Findbugs warnings: https://builds.apache.org/job/PreCommit-HBASE-Build/3254//artifact/trunk/patchprocess/newPatchFindbugsWarningshbase-hadoop-compat.html Console output: https://builds.apache.org/job/PreCommit-HBASE-Build/3254//console This message is automatically generated.
          Hide
          Hudson added a comment -

          Integrated in HBase-TRUNK #3519 (See https://builds.apache.org/job/HBase-TRUNK/3519/)
          HBASE-7113 TestGzipFilter is flaky with jdk1.7 (Revision 1406797)

          Result = FAILURE
          jxiang :
          Files :

          • /hbase/trunk/hbase-server/src/test/java/org/apache/hadoop/hbase/rest/TestGzipFilter.java
          Show
          Hudson added a comment - Integrated in HBase-TRUNK #3519 (See https://builds.apache.org/job/HBase-TRUNK/3519/ ) HBASE-7113 TestGzipFilter is flaky with jdk1.7 (Revision 1406797) Result = FAILURE jxiang : Files : /hbase/trunk/hbase-server/src/test/java/org/apache/hadoop/hbase/rest/TestGzipFilter.java
          Hide
          Hudson added a comment -

          Integrated in HBase-TRUNK-on-Hadoop-2.0.0 #252 (See https://builds.apache.org/job/HBase-TRUNK-on-Hadoop-2.0.0/252/)
          HBASE-7113 TestGzipFilter is flaky with jdk1.7 (Revision 1406797)

          Result = FAILURE
          jxiang :
          Files :

          • /hbase/trunk/hbase-server/src/test/java/org/apache/hadoop/hbase/rest/TestGzipFilter.java
          Show
          Hudson added a comment - Integrated in HBase-TRUNK-on-Hadoop-2.0.0 #252 (See https://builds.apache.org/job/HBase-TRUNK-on-Hadoop-2.0.0/252/ ) HBASE-7113 TestGzipFilter is flaky with jdk1.7 (Revision 1406797) Result = FAILURE jxiang : Files : /hbase/trunk/hbase-server/src/test/java/org/apache/hadoop/hbase/rest/TestGzipFilter.java
          Hide
          Hudson added a comment -

          FAILURE: Integrated in HBase-0.94 #1139 (See https://builds.apache.org/job/HBase-0.94/1139/)
          HBASE-9455 Port HBASE-7113 'TestGzipFilter is flaky with jdk1.7' to 0.94 (tedyu: rev 1520715)

          • /hbase/branches/0.94/src/test/java/org/apache/hadoop/hbase/rest/TestGzipFilter.java
          Show
          Hudson added a comment - FAILURE: Integrated in HBase-0.94 #1139 (See https://builds.apache.org/job/HBase-0.94/1139/ ) HBASE-9455 Port HBASE-7113 'TestGzipFilter is flaky with jdk1.7' to 0.94 (tedyu: rev 1520715) /hbase/branches/0.94/src/test/java/org/apache/hadoop/hbase/rest/TestGzipFilter.java
          Hide
          Hudson added a comment -

          FAILURE: Integrated in HBase-0.94-security #286 (See https://builds.apache.org/job/HBase-0.94-security/286/)
          HBASE-9455 Port HBASE-7113 'TestGzipFilter is flaky with jdk1.7' to 0.94 (tedyu: rev 1520715)

          • /hbase/branches/0.94/src/test/java/org/apache/hadoop/hbase/rest/TestGzipFilter.java
          Show
          Hudson added a comment - FAILURE: Integrated in HBase-0.94-security #286 (See https://builds.apache.org/job/HBase-0.94-security/286/ ) HBASE-9455 Port HBASE-7113 'TestGzipFilter is flaky with jdk1.7' to 0.94 (tedyu: rev 1520715) /hbase/branches/0.94/src/test/java/org/apache/hadoop/hbase/rest/TestGzipFilter.java

            People

            • Assignee:
              Jimmy Xiang
              Reporter:
              Jimmy Xiang
            • Votes:
              0 Vote for this issue
              Watchers:
              4 Start watching this issue

              Dates

              • Created:
                Updated:
                Resolved:

                Development