XMLWordPrintableJSON

    Details

    • Type: Sub-task
    • Status: Closed
    • Priority: Minor
    • Resolution: Fixed
    • Affects Version/s: 0.95.2
    • Fix Version/s: 0.95.0
    • Component/s: test
    • Labels:
      None
    • Hadoop Flags:
      Reviewed

      Description

      Failed tests: testOrphanTaskAcquisition(org.apache.hadoop.hbase.master.TestSplitLogManager)
      testCreateAndUpdate(org.apache.hadoop.hbase.util.TestFSTableDescriptors): statuses.length=5
      testManageSingleton(org.apache.hadoop.hbase.util.TestEnvironmentEdgeManager)

      Tests in error:
      testRegionTransitionOperations(org.apache.hadoop.hbase.coprocessor.TestMasterObserver): org.apache.hadoop.hbase.UnknownRegionException: ef07dae0851f4fbe7d550413530b8774
      testTableOperations(org.apache.hadoop.hbase.coprocessor.TestMasterObserver): org.apache.hadoop.hbase.TableExistsException: observed_table
      testClassLoadingFromHDFS(org.apache.hadoop.hbase.coprocessor.TestClassLoading): org.apache.hadoop.hbase.TableNotEnabledException: TestClassLoading

        Attachments

        1. 6202-hbase.patch
          11 kB
          Jimmy Xiang

          Activity

            People

            • Assignee:
              jxiang Jimmy Xiang
              Reporter:
              jxiang Jimmy Xiang
            • Votes:
              0 Vote for this issue
              Watchers:
              3 Start watching this issue

              Dates

              • Created:
                Updated:
                Resolved: