Uploaded image for project: 'Hadoop Common'
  1. Hadoop Common
  2. HADOOP-16774

TestDiskChecker and TestReadWriteDiskValidator fails when run with -Pparallel-tests

    XMLWordPrintableJSON

    Details

    • Type: Bug
    • Status: Resolved
    • Priority: Major
    • Resolution: Fixed
    • Affects Version/s: None
    • Fix Version/s: 3.3.0
    • Component/s: None
    • Labels:
      None
    • Hadoop Flags:
      Reviewed

      Description

      $  mvn test -Pparallel-tests -Dtest=TestReadWriteDiskValidator,TestDiskChecker -Pnative
       
      [INFO] Results:
      [INFO] 
      [ERROR] Errors: 
      [ERROR]   TestDiskChecker.testCheckDir_normal:111->_checkDirs:158->createTempDir:153 » NoSuchFile
      [ERROR]   TestDiskChecker.testCheckDir_normal_local:180->checkDirs:205->createTempDir:153 » NoSuchFile
      [ERROR]   TestDiskChecker.testCheckDir_notDir:116->_checkDirs:158->createTempFile:142 » NoSuchFile
      [ERROR]   TestDiskChecker.testCheckDir_notDir_local:185->checkDirs:205->createTempFile:142 » NoSuchFile
      [ERROR]   TestDiskChecker.testCheckDir_notListable:131->_checkDirs:158->createTempDir:153 » NoSuchFile
      [ERROR]   TestDiskChecker.testCheckDir_notListable_local:200->checkDirs:205->createTempDir:153 » NoSuchFile
      [ERROR]   TestDiskChecker.testCheckDir_notReadable:121->_checkDirs:158->createTempDir:153 » NoSuchFile
      [ERROR]   TestDiskChecker.testCheckDir_notReadable_local:190->checkDirs:205->createTempDir:153 » NoSuchFile
      [ERROR]   TestDiskChecker.testCheckDir_notWritable:126->_checkDirs:158->createTempDir:153 » NoSuchFile
      [ERROR]   TestDiskChecker.testCheckDir_notWritable_local:195->checkDirs:205->createTempDir:153 » NoSuchFile
      [ERROR]   TestReadWriteDiskValidator.testCheckFailures:114 » NoSuchFile /usr1/code/hadoo...
      [ERROR]   TestReadWriteDiskValidator.testReadWriteDiskValidator:62 » DiskError Disk Chec...
      [INFO] 
      [ERROR] Tests run: 16, Failures: 0, Errors: 12, Skipped: 0
      
      

        Attachments

          Issue Links

            Activity

              People

              • Assignee:
                vinayakumarb Vinayakumar B
                Reporter:
                vinayakumarb Vinayakumar B
              • Votes:
                0 Vote for this issue
                Watchers:
                3 Start watching this issue

                Dates

                • Created:
                  Updated:
                  Resolved: