Uploaded image for project: 'Hadoop Common'
  1. Hadoop Common
  2. HADOOP-16031

TestSecureLogins#testValidKerberosName fails

    Details

    • Type: Bug
    • Status: Resolved
    • Priority: Major
    • Resolution: Fixed
    • Affects Version/s: None
    • Fix Version/s: 3.2.0, 3.3.0, 3.1.3
    • Component/s: security
    • Labels:
      None

      Description

      [INFO] Running org.apache.hadoop.registry.secure.TestSecureLogins
      [ERROR] Tests run: 11, Failures: 0, Errors: 1, Skipped: 0, Time elapsed: 2.724 s <<< FAILURE! - in org.apache.hadoop.registry.secure.TestSecureLogins
      [ERROR] testValidKerberosName(org.apache.hadoop.registry.secure.TestSecureLogins)  Time elapsed: 0.01 s  <<< ERROR!
      org.apache.hadoop.security.authentication.util.KerberosName$NoMatchingRule: No rules applied to zookeeper/localhost
      	at org.apache.hadoop.security.authentication.util.KerberosName.getShortName(KerberosName.java:429)
      	at org.apache.hadoop.registry.secure.TestSecureLogins.testValidKerberosName(TestSecureLogins.java:203)
      	at sun.reflect.NativeMethodAccessorImpl.invoke0(Native Method)
      	at sun.reflect.NativeMethodAccessorImpl.invoke(NativeMethodAccessorImpl.java:62)
      	at sun.reflect.DelegatingMethodAccessorImpl.invoke(DelegatingMethodAccessorImpl.java:43)
      	at java.lang.reflect.Method.invoke(Method.java:498)
      

        Attachments

          Issue Links

            Activity

              People

              • Assignee:
                ajisakaa Akira Ajisaka
                Reporter:
                ajisakaa Akira Ajisaka
              • Votes:
                0 Vote for this issue
                Watchers:
                4 Start watching this issue

                Dates

                • Created:
                  Updated:
                  Resolved: