Details

    • Type: Sub-task
    • Status: Resolved
    • Priority: Major
    • Resolution: Fixed
    • Affects Version/s: 3.2.0
    • Fix Version/s: 3.2.0
    • Component/s: fs/s3
    • Labels:
      None

      Description

      To reproduce failure: mvn verify -Dscale -Dit.test=org.apache.hadoop.fs.contract.s3a.ITestS3AContractMultipartUploader -Dtest=skip against eu-west-1.

      Test output:

      [INFO] Running org.apache.hadoop.fs.contract.s3a.ITestS3AContractMultipartUploader
      [ERROR] Tests run: 11, Failures: 0, Errors: 1, Skipped: 0, Time elapsed: 59.301 s <<< FAILURE! - in org.apache.hadoop.fs.contract.s3a.ITestS3AContractMultipartUploader
      [ERROR] testMultipartUploadEmptyPart(org.apache.hadoop.fs.contract.s3a.ITestS3AContractMultipartUploader)  Time elapsed: 0.75 s  <<< ERROR!
      java.lang.IllegalArgumentException: partNumber must be between 1 and 10000 inclusive, but is 0
      

        Attachments

          Activity

            People

            • Assignee:
              ehiggs Ewan Higgs
              Reporter:
              gabor.bota Gabor Bota
            • Votes:
              0 Vote for this issue
              Watchers:
              3 Start watching this issue

              Dates

              • Created:
                Updated:
                Resolved: