Details

    • Type: Sub-task
    • Status: Resolved
    • Priority: Major
    • Resolution: Fixed
    • Affects Version/s: None
    • Fix Version/s: 3.1.0
    • Component/s: test
    • Labels:
      None
    • Environment:
    • Hadoop Flags:
      Reviewed

      Description

      [INFO] Running org.apache.hadoop.log.TestLogLevel
      [ERROR] Tests run: 7, Failures: 2, Errors: 0, Skipped: 0, Time elapsed: 9.805 s <<< FAILURE! - in org.apache.hadoop.log.TestLogLevel
      [ERROR] testLogLevelByHttpWithSpnego(org.apache.hadoop.log.TestLogLevel)  Time elapsed: 1.179 s  <<< FAILURE!
      java.lang.AssertionError: 
       Expected to find 'Unrecognized SSL message' but got unexpected exception: javax.net.ssl.SSLException: Unsupported or unrecognized SSL message
      	at java.base/sun.security.ssl.SSLSocketInputRecord.handleUnknownRecord(SSLSocketInputRecord.java:416)
      

        Attachments

        1. HADOOP-15293.1.patch
          2 kB
          Takanobu Asanuma
        2. HADOOP-15293.2.patch
          1 kB
          Takanobu Asanuma

          Activity

            People

            • Assignee:
              tasanuma Takanobu Asanuma
              Reporter:
              aajisaka Akira Ajisaka
            • Votes:
              0 Vote for this issue
              Watchers:
              4 Start watching this issue

              Dates

              • Created:
                Updated:
                Resolved: