Uploaded image for project: 'Apache Gora'
  1. Apache Gora
  2. GORA-635

Gora - Main Build problem

    XMLWordPrintableJSON

    Details

    • Type: Bug
    • Status: Closed
    • Priority: Blocker
    • Resolution: Duplicate
    • Affects Version/s: 0.8
    • Fix Version/s: None
    • Labels:
      None
    • Environment:
      Lunix Debina 9 updated to last release before version 10 all stable,
      Java, Maven, Git all in place.
    • Flags:
      Important

      Description

      root@hgclusterambari00:/home/ambari/gora/apache-gora-0.8# ls
      bin gora-accumulo gora-cassandra-cql gora-core gora-goraci gora-infinispan gora-mongodb gora-solr-5 KEYS pom.xml release.properties
      CHANGES.md gora-aerospike gora-compiler gora-couchdb gora-gradle-plugin gora-jcache gora-orientdb gora-sql LICENSE.md pom.xml.releaseBackup sources-dist
      conf gora-cassandra gora-compiler-cli gora-dynamodb gora-hbase gora-maven-plugin gora-solr gora-tutorial NOTICE.md README.md
      root@hgclusterambari00:/home/ambari/gora/apache-gora-0.8# mvn clean install
      Warning: JAVA_HOME environment variable is not set.
      [INFO] Scanning for projects...
      [INFO] ------------------------------------------------------------------------
      [INFO] Reactor Build Order:
      [INFO]
      [INFO] Apache Gora
      [INFO] Apache Gora :: Compiler
      [INFO] Apache Gora :: Compiler-CLI
      [INFO] Apache Gora :: Core
      [INFO] Apache Gora :: Accumulo
      [INFO] Apache Gora :: HBase
      [INFO] Apache Gora :: Cassandra - CQL
      [INFO] Apache Gora :: GoraCI
      [INFO] Apache Gora :: Infinispan
      [INFO] Apache Gora :: JCache
      [INFO] Apache Gora :: OrientDB
      [INFO] Apache Gora :: Dynamodb
      [INFO] Apache Gora :: CouchDB
      [INFO] Apache Gora :: Maven Plugin
      [INFO] Apache Gora :: MongoDB
      [INFO] Apache Gora :: Solr
      [INFO] Apache Gora :: Aerospike
      [INFO] Apache Gora :: Tutorial
      [INFO] Apache Gora :: Sources-Dist
      [INFO]
      [INFO] ------------------------------------------------------------------------
      [INFO] Building Apache Gora 0.8
      [INFO] ------------------------------------------------------------------------
      Downloading: https://repo.maven.apache.org/maven2/org/apache/maven/plugins/maven-remote-resources-plugin/1.2.1/maven-remote-resources-plugin-1.2.1.pom
      Downloaded: https://repo.maven.apache.org/maven2/org/apache/maven/plugins/maven-remote-resources-plugin/1.2.1/maven-remote-resources-plugin-1.2.1.pom (13 KB at 8.1 KB/sec)
      Downloading: https://repo.maven.apache.org/maven2/org/apache/maven/plugins/maven-plugins/19/maven-plugins-19.pom
      Downloaded: https://repo.maven.apache.org/maven2/org/apache/maven/plugins/maven-plugins/19/maven-plugins-19.pom (11 KB at 71.7 KB/sec)
      Downloading: https://repo.maven.apache.org/maven2/org/apache/maven/plugins/maven-remote-resources-plugin/1.2.1/maven-remote-resources-plugin-1.2.1.jar
      Downloaded: https://repo.maven.apache.org/maven2/org/apache/maven/plugins/maven-remote-resources-plugin/1.2.1/maven-remote-resources-plugin-1.2.1.jar (63 KB at 428.3 KB/sec)
      Downloading: https://repo.maven.apache.org/maven2/org/apache/maven/plugins/maven-site-plugin/3.0/maven-site-plugin-3.0.pom
      Downloaded: https://repo.maven.apache.org/maven2/org/apache/maven/plugins/maven-site-plugin/3.0/maven-site-plugin-3.0.pom (20 KB at 215.5 KB/sec)
      Downloading: https://repo.maven.apache.org/maven2/org/apache/maven/plugins/maven-plugins/21/maven-plugins-21.pom
      Downloaded: https://repo.maven.apache.org/maven2/org/apache/maven/plugins/maven-plugins/21/maven-plugins-21.pom (13 KB at 141.7 KB/sec)
      Downloading: https://repo.maven.apache.org/maven2/org/apache/maven/plugins/maven-site-plugin/3.0/maven-site-plugin-3.0.jar
      Downloaded: https://repo.maven.apache.org/maven2/org/apache/maven/plugins/maven-site-plugin/3.0/maven-site-plugin-3.0.jar (112 KB at 905.9 KB/sec)
      Downloading: https://repo.maven.apache.org/maven2/org/apache/maven/plugins/maven-install-plugin/2.3.1/maven-install-plugin-2.3.1.pom
      Downloaded: https://repo.maven.apache.org/maven2/org/apache/maven/plugins/maven-install-plugin/2.3.1/maven-install-plugin-2.3.1.pom (5 KB at 58.9 KB/sec)
      Downloading: https://repo.maven.apache.org/maven2/org/apache/maven/plugins/maven-plugins/18/maven-plugins-18.pom
      Downloaded: https://repo.maven.apache.org/maven2/org/apache/maven/plugins/maven-plugins/18/maven-plugins-18.pom (13 KB at 154.8 KB/sec)
      Downloading: https://repo.maven.apache.org/maven2/org/apache/maven/plugins/maven-install-plugin/2.3.1/maven-install-plugin-2.3.1.jar
      Downloaded: https://repo.maven.apache.org/maven2/org/apache/maven/plugins/maven-install-plugin/2.3.1/maven-install-plugin-2.3.1.jar (23 KB at 274.4 KB/sec)
      [INFO]
      [INFO] — maven-clean-plugin:2.5:clean (default-clean) @ gora —
      [INFO]
      [INFO] — maven-remote-resources-plugin:1.2.1:process (default) @ gora —
      Downloading: https://repo.maven.apache.org/maven2/org/apache/maven/shared/maven-common-artifact-filters/1.0/maven-common-artifact-filters-1.0.pom
      Downloaded: https://repo.maven.apache.org/maven2/org/apache/maven/shared/maven-common-artifact-filters/1.0/maven-common-artifact-filters-1.0.pom (2 KB at 28.9 KB/sec)
      Downloading: https://repo.maven.apache.org/maven2/org/apache/maven/shared/maven-plugin-testing-harness/1.1/maven-plugin-testing-harness-1.1.pom
      Downloaded: https://repo.maven.apache.org/maven2/org/apache/maven/shared/maven-plugin-testing-harness/1.1/maven-plugin-testing-harness-1.1.pom (7 KB at 80.3 KB/sec)
      Downloading: https://repo.maven.apache.org/maven2/org/apache/maven/shared/maven-shared-components/7/maven-shared-components-7.pom
      Downloaded: https://repo.maven.apache.org/maven2/org/apache/maven/shared/maven-shared-components/7/maven-shared-components-7.pom (3 KB at 32.5 KB/sec)
      Downloading: https://repo.maven.apache.org/maven2/org/apache/maven/maven-project/2.0/maven-project-2.0.pom
      Downloaded: https://repo.maven.apache.org/maven2/org/apache/maven/maven-project/2.0/maven-project-2.0.pom (2 KB at 17.4 KB/sec)
      Downloading: https://repo.maven.apache.org/maven2/org/apache/maven/maven-profile/2.0/maven-profile-2.0.pom
      Downloaded: https://repo.maven.apache.org/maven2/org/apache/maven/maven-profile/2.0/maven-profile-2.0.pom (2 KB at 17.9 KB/sec)
      Downloading: https://repo.maven.apache.org/maven2/org/apache/maven/maven-model/2.0/maven-model-2.0.pom
      Downloaded: https://repo.maven.apache.org/maven2/org/apache/maven/maven-model/2.0/maven-model-2.0.pom (3 KB at 30.1 KB/sec)
      Downloading: https://repo.maven.apache.org/maven2/org/apache/maven/maven-artifact-manager/2.0/maven-artifact-manager-2.0.pom
      Downloaded: https://repo.maven.apache.org/maven2/org/apache/maven/maven-artifact-manager/2.0/maven-artifact-manager-2.0.pom (2 KB at 16.3 KB/sec)
      Downloading: https://repo.maven.apache.org/maven2/org/apache/maven/maven-repository-metadata/2.0/maven-repository-metadata-2.0.pom
      Downloaded: https://repo.maven.apache.org/maven2/org/apache/maven/maven-repository-metadata/2.0/maven-repository-metadata-2.0.pom (2 KB at 14.8 KB/sec)
      Downloading: https://repo.maven.apache.org/maven2/org/apache/maven/maven-artifact/2.0/maven-artifact-2.0.pom
      Downloaded: https://repo.maven.apache.org/maven2/org/apache/maven/maven-artifact/2.0/maven-artifact-2.0.pom (723 B at 10.5 KB/sec)
      Downloading: https://repo.maven.apache.org/maven2/org/apache/maven/maven-core/2.0/maven-core-2.0.pom
      Downloaded: https://repo.maven.apache.org/maven2/org/apache/maven/maven-core/2.0/maven-core-2.0.pom (6 KB at 70.1 KB/sec)
      Downloading: https://repo.maven.apache.org/maven2/org/apache/maven/maven-settings/2.0/maven-settings-2.0.pom
      Downloaded: https://repo.maven.apache.org/maven2/org/apache/maven/maven-settings/2.0/maven-settings-2.0.pom (2 KB at 18.7 KB/sec)
      Downloading: https://repo.maven.apache.org/maven2/org/apache/maven/maven-plugin-parameter-documenter/2.0/maven-plugin-parameter-documenter-2.0.pom
      Downloaded: https://repo.maven.apache.org/maven2/org/apache/maven/maven-plugin-parameter-documenter/2.0/maven-plugin-parameter-documenter-2.0.pom (2 KB at 20.4 KB/sec)
      Downloading: https://repo.maven.apache.org/maven2/org/apache/maven/reporting/maven-reporting-api/2.0/maven-reporting-api-2.0.pom
      Downloaded: https://repo.maven.apache.org/maven2/org/apache/maven/reporting/maven-reporting-api/2.0/maven-reporting-api-2.0.pom (2 KB at 15.5 KB/sec)
      Downloading: https://repo.maven.apache.org/maven2/org/apache/maven/reporting/maven-reporting/2.0/maven-reporting-2.0.pom
      Downloaded: https://repo.maven.apache.org/maven2/org/apache/maven/reporting/maven-reporting/2.0/maven-reporting-2.0.pom (504 B at 6.7 KB/sec)
      Downloading: https://repo.maven.apache.org/maven2/doxia/doxia-sink-api/1.0-alpha-4/doxia-sink-api-1.0-alpha-4.pom
      Downloaded: https://repo.maven.apache.org/maven2/doxia/doxia-sink-api/1.0-alpha-4/doxia-sink-api-1.0-alpha-4.pom (2 KB at 14.0 KB/sec)
      Downloading: https://repo.maven.apache.org/maven2/org/apache/maven/maven-error-diagnostics/2.0/maven-error-diagnostics-2.0.pom
      Downloaded: https://repo.maven.apache.org/maven2/org/apache/maven/maven-error-diagnostics/2.0/maven-error-diagnostics-2.0.pom (812 B at 11.7 KB/sec)
      Downloading: https://repo.maven.apache.org/maven2/org/apache/maven/maven-plugin-registry/2.0/maven-plugin-registry-2.0.pom
      Downloaded: https://repo.maven.apache.org/maven2/org/apache/maven/maven-plugin-registry/2.0/maven-plugin-registry-2.0.pom (2 KB at 17.7 KB/sec)
      Downloading: https://repo.maven.apache.org/maven2/org/apache/maven/maven-plugin-descriptor/2.0/maven-plugin-descriptor-2.0.pom
      Downloaded: https://repo.maven.apache.org/maven2/org/apache/maven/maven-plugin-descriptor/2.0/maven-plugin-descriptor-2.0.pom (2 KB at 19.3 KB/sec)
      Downloading: https://repo.maven.apache.org/maven2/org/apache/maven/maven-monitor/2.0/maven-monitor-2.0.pom
      Downloaded: https://repo.maven.apache.org/maven2/org/apache/maven/maven-monitor/2.0/maven-monitor-2.0.pom (400 B at 5.1 KB/sec)
      Downloading: https://repo.maven.apache.org/maven2/org/codehaus/plexus/plexus-archiver/1.0-alpha-7/plexus-archiver-1.0-alpha-7.pom
      Downloaded: https://repo.maven.apache.org/maven2/org/codehaus/plexus/plexus-archiver/1.0-alpha-7/plexus-archiver-1.0-alpha-7.pom (2 KB at 13.1 KB/sec)
      Downloading: https://repo.maven.apache.org/maven2/org/codehaus/plexus/plexus-components/1.1.6/plexus-components-1.1.6.pom
      Downloaded: https://repo.maven.apache.org/maven2/org/codehaus/plexus/plexus-components/1.1.6/plexus-components-1.1.6.pom (2 KB at 25.6 KB/sec)
      Downloading: https://repo.maven.apache.org/maven2/org/codehaus/plexus/plexus-utils/1.2/plexus-utils-1.2.pom
      Downloaded: https://repo.maven.apache.org/maven2/org/codehaus/plexus/plexus-utils/1.2/plexus-utils-1.2.pom (767 B at 10.7 KB/sec)
      Downloading: https://repo.maven.apache.org/maven2/org/codehaus/plexus/plexus/1.0.5/plexus-1.0.5.pom
      Downloaded: https://repo.maven.apache.org/maven2/org/codehaus/plexus/plexus/1.0.5/plexus-1.0.5.pom (6 KB at 77.4 KB/sec)
      Downloading: https://repo.maven.apache.org/maven2/org/apache/maven/shared/maven-downloader/1.1/maven-downloader-1.1.pom
      Downloaded: https://repo.maven.apache.org/maven2/org/apache/maven/shared/maven-downloader/1.1/maven-downloader-1.1.pom (2 KB at 21.9 KB/sec)
      Downloading: https://repo.maven.apache.org/maven2/org/apache/maven/shared/maven-shared-components/4/maven-shared-components-4.pom
      Downloaded: https://repo.maven.apache.org/maven2/org/apache/maven/shared/maven-shared-components/4/maven-shared-components-4.pom (3 KB at 28.4 KB/sec)
      Downloading: https://repo.maven.apache.org/maven2/org/apache/maven/maven-parent/4/maven-parent-4.pom
      Downloaded: https://repo.maven.apache.org/maven2/org/apache/maven/maven-parent/4/maven-parent-4.pom (10 KB at 110.9 KB/sec)
      Downloading: https://repo.maven.apache.org/maven2/org/apache/maven/shared/maven-filtering/1.0/maven-filtering-1.0.pom
      Downloaded: https://repo.maven.apache.org/maven2/org/apache/maven/shared/maven-filtering/1.0/maven-filtering-1.0.pom (6 KB at 71.3 KB/sec)
      Downloading: https://repo.maven.apache.org/maven2/org/apache/maven/shared/maven-shared-components/16/maven-shared-components-16.pom
      Downloaded: https://repo.maven.apache.org/maven2/org/apache/maven/shared/maven-shared-components/16/maven-shared-components-16.pom (9 KB at 81.2 KB/sec)
      Downloading: https://repo.maven.apache.org/maven2/org/codehaus/plexus/plexus-resources/1.0-alpha-5/plexus-resources-1.0-alpha-5.pom
      Downloaded: https://repo.maven.apache.org/maven2/org/codehaus/plexus/plexus-resources/1.0-alpha-5/plexus-resources-1.0-alpha-5.pom (2 KB at 18.4 KB/sec)
      Downloading: https://repo.maven.apache.org/maven2/org/codehaus/plexus/plexus-utils/1.5.12/plexus-utils-1.5.12.pom
      Downloaded: https://repo.maven.apache.org/maven2/org/codehaus/plexus/plexus-utils/1.5.12/plexus-utils-1.5.12.pom (6 KB at 59.2 KB/sec)
      Downloading: https://repo.maven.apache.org/maven2/org/codehaus/plexus/plexus-velocity/1.1.8/plexus-velocity-1.1.8.pom
      Downloaded: https://repo.maven.apache.org/maven2/org/codehaus/plexus/plexus-velocity/1.1.8/plexus-velocity-1.1.8.pom (2 KB at 24.7 KB/sec)
      Downloading: https://repo.maven.apache.org/maven2/org/codehaus/plexus/plexus-components/1.1.15/plexus-components-1.1.15.pom
      Downloaded: https://repo.maven.apache.org/maven2/org/codehaus/plexus/plexus-components/1.1.15/plexus-components-1.1.15.pom (3 KB at 38.1 KB/sec)
      Downloading: https://repo.maven.apache.org/maven2/velocity/velocity/1.5/velocity-1.5.pom
      Downloaded: https://repo.maven.apache.org/maven2/velocity/velocity/1.5/velocity-1.5.pom (8 KB at 94.7 KB/sec)
      Downloading: https://repo.maven.apache.org/maven2/org/apache/velocity/velocity/1.6.4/velocity-1.6.4.pom
      Downloaded: https://repo.maven.apache.org/maven2/org/apache/velocity/velocity/1.6.4/velocity-1.6.4.pom (11 KB at 112.7 KB/sec)
      Downloading: https://repo.maven.apache.org/maven2/org/apache/maven/shared/maven-common-artifact-filters/1.0/maven-common-artifact-filters-1.0.jar
      Downloading: https://repo.maven.apache.org/maven2/org/codehaus/plexus/plexus-archiver/1.0-alpha-7/plexus-archiver-1.0-alpha-7.jar
      Downloading: https://repo.maven.apache.org/maven2/org/apache/maven/shared/maven-downloader/1.1/maven-downloader-1.1.jar
      Downloading: https://repo.maven.apache.org/maven2/org/apache/maven/shared/maven-filtering/1.0/maven-filtering-1.0.jar
      Downloading: https://repo.maven.apache.org/maven2/org/apache/maven/shared/maven-plugin-testing-harness/1.1/maven-plugin-testing-harness-1.1.jar
      Downloaded: https://repo.maven.apache.org/maven2/org/apache/maven/shared/maven-common-artifact-filters/1.0/maven-common-artifact-filters-1.0.jar (27 KB at 143.1 KB/sec)
      Downloading: https://repo.maven.apache.org/maven2/org/codehaus/plexus/plexus-container-default/1.0-alpha-9/plexus-container-default-1.0-alpha-9.jar
      Downloaded: https://repo.maven.apache.org/maven2/org/apache/maven/shared/maven-downloader/1.1/maven-downloader-1.1.jar (7 KB at 23.7 KB/sec)
      Downloading: https://repo.maven.apache.org/maven2/org/codehaus/plexus/plexus-resources/1.0-alpha-5/plexus-resources-1.0-alpha-5.jar
      Downloaded: https://repo.maven.apache.org/maven2/org/apache/maven/shared/maven-plugin-testing-harness/1.1/maven-plugin-testing-harness-1.1.jar (32 KB at 101.7 KB/sec)
      Downloading: https://repo.maven.apache.org/maven2/org/codehaus/plexus/plexus-utils/1.5.12/plexus-utils-1.5.12.jar
      Downloaded: https://repo.maven.apache.org/maven2/org/apache/maven/shared/maven-filtering/1.0/maven-filtering-1.0.jar (42 KB at 134.4 KB/sec)
      Downloading: https://repo.maven.apache.org/maven2/org/codehaus/plexus/plexus-velocity/1.1.8/plexus-velocity-1.1.8.jar
      Downloaded: https://repo.maven.apache.org/maven2/org/codehaus/plexus/plexus-resources/1.0-alpha-5/plexus-resources-1.0-alpha-5.jar (22 KB at 61.1 KB/sec)
      Downloading: https://repo.maven.apache.org/maven2/commons-collections/commons-collections/3.1/commons-collections-3.1.jar
      Downloaded: https://repo.maven.apache.org/maven2/org/codehaus/plexus/plexus-archiver/1.0-alpha-7/plexus-archiver-1.0-alpha-7.jar (139 KB at 347.6 KB/sec)
      Downloading: https://repo.maven.apache.org/maven2/velocity/velocity/1.5/velocity-1.5.jar
      Downloaded: https://repo.maven.apache.org/maven2/org/codehaus/plexus/plexus-velocity/1.1.8/plexus-velocity-1.1.8.jar (8 KB at 18.6 KB/sec)
      Downloading: https://repo.maven.apache.org/maven2/org/apache/velocity/velocity/1.6.4/velocity-1.6.4.jar
      Downloaded: https://repo.maven.apache.org/maven2/org/codehaus/plexus/plexus-container-default/1.0-alpha-9/plexus-container-default-1.0-alpha-9.jar (191 KB at 416.6 KB/sec)
      Downloaded: https://repo.maven.apache.org/maven2/org/codehaus/plexus/plexus-utils/1.5.12/plexus-utils-1.5.12.jar (276 KB at 451.6 KB/sec)
      Downloaded: https://repo.maven.apache.org/maven2/org/apache/velocity/velocity/1.6.4/velocity-1.6.4.jar (412 KB at 526.2 KB/sec)
      Downloaded: https://repo.maven.apache.org/maven2/velocity/velocity/1.5/velocity-1.5.jar (383 KB at 488.4 KB/sec)
      Downloaded: https://repo.maven.apache.org/maven2/commons-collections/commons-collections/3.1/commons-collections-3.1.jar (547 KB at 661.3 KB/sec)
      [INFO]
      [INFO] — maven-compiler-plugin:3.1:testCompile (default-testCompile) @ gora —
      [INFO] No sources to compile
      [INFO]
      [INFO] — maven-site-plugin:3.0:attach-descriptor (attach-descriptor) @ gora —
      Downloading: https://repo.maven.apache.org/maven2/org/apache/maven/wagon/wagon-ssh/1.0/wagon-ssh-1.0.pom
      Downloaded: https://repo.maven.apache.org/maven2/org/apache/maven/wagon/wagon-ssh/1.0/wagon-ssh-1.0.pom (3 KB at 32.1 KB/sec)
      Downloading: https://repo.maven.apache.org/maven2/org/apache/maven/wagon/wagon-providers/1.0/wagon-providers-1.0.pom
      Downloaded: https://repo.maven.apache.org/maven2/org/apache/maven/wagon/wagon-providers/1.0/wagon-providers-1.0.pom (3 KB at 29.3 KB/sec)
      Downloading: https://repo.maven.apache.org/maven2/com/jcraft/jsch/0.1.44-1/jsch-0.1.44-1.pom
      Downloaded: https://repo.maven.apache.org/maven2/com/jcraft/jsch/0.1.44-1/jsch-0.1.44-1.pom (4 KB at 47.4 KB/sec)
      Downloading: https://repo.maven.apache.org/maven2/org/sonatype/oss/oss-parent/6/oss-parent-6.pom
      Downloaded: https://repo.maven.apache.org/maven2/org/sonatype/oss/oss-parent/6/oss-parent-6.pom (5 KB at 63.8 KB/sec)
      Downloading: https://repo.maven.apache.org/maven2/org/apache/maven/wagon/wagon-ssh-common/1.0/wagon-ssh-common-1.0.pom
      Downloaded: https://repo.maven.apache.org/maven2/org/apache/maven/wagon/wagon-ssh-common/1.0/wagon-ssh-common-1.0.pom (2 KB at 24.6 KB/sec)
      Downloading: https://repo.maven.apache.org/maven2/org/codehaus/plexus/plexus-interactivity-api/1.0-alpha-6/plexus-interactivity-api-1.0-alpha-6.pom
      Downloaded: https://repo.maven.apache.org/maven2/org/codehaus/plexus/plexus-interactivity-api/1.0-alpha-6/plexus-interactivity-api-1.0-alpha-6.pom (726 B at 9.3 KB/sec)
      Downloading: https://repo.maven.apache.org/maven2/org/codehaus/plexus/plexus-interactivity/1.0-alpha-6/plexus-interactivity-1.0-alpha-6.pom
      Downloaded: https://repo.maven.apache.org/maven2/org/codehaus/plexus/plexus-interactivity/1.0-alpha-6/plexus-interactivity-1.0-alpha-6.pom (2 KB at 15.0 KB/sec)
      Downloading: https://repo.maven.apache.org/maven2/org/codehaus/plexus/plexus-components/1.1.9/plexus-components-1.1.9.pom
      Downloaded: https://repo.maven.apache.org/maven2/org/codehaus/plexus/plexus-components/1.1.9/plexus-components-1.1.9.pom (3 KB at 32.5 KB/sec)
      Downloading: https://repo.maven.apache.org/maven2/org/codehaus/plexus/plexus-utils/1.4/plexus-utils-1.4.pom
      Downloaded: https://repo.maven.apache.org/maven2/org/codehaus/plexus/plexus-utils/1.4/plexus-utils-1.4.pom (2 KB at 15.8 KB/sec)
      Downloading: https://repo.maven.apache.org/maven2/org/apache/maven/reporting/maven-reporting-exec/1.0.1/maven-reporting-exec-1.0.1.pom
      Downloaded: https://repo.maven.apache.org/maven2/org/apache/maven/reporting/maven-reporting-exec/1.0.1/maven-reporting-exec-1.0.1.pom (10 KB at 134.3 KB/sec)
      Downloading: https://repo.maven.apache.org/maven2/org/codehaus/plexus/plexus-component-annotations/1.5.4/plexus-component-annotations-1.5.4.pom
      Downloaded: https://repo.maven.apache.org/maven2/org/codehaus/plexus/plexus-component-annotations/1.5.4/plexus-component-annotations-1.5.4.pom (815 B at 11.9 KB/sec)
      Downloading: https://repo.maven.apache.org/maven2/org/codehaus/plexus/plexus-containers/1.5.4/plexus-containers-1.5.4.pom
      Downloaded: https://repo.maven.apache.org/maven2/org/codehaus/plexus/plexus-containers/1.5.4/plexus-containers-1.5.4.pom (5 KB at 63.7 KB/sec)
      Downloading: https://repo.maven.apache.org/maven2/org/apache/maven/doxia/doxia-module-apt/1.2/doxia-module-apt-1.2.pom
      Downloaded: https://repo.maven.apache.org/maven2/org/apache/maven/doxia/doxia-module-apt/1.2/doxia-module-apt-1.2.pom (3 KB at 35.9 KB/sec)
      Downloading: https://repo.maven.apache.org/maven2/org/apache/maven/doxia/doxia-module-xdoc/1.2/doxia-module-xdoc-1.2.pom
      Downloaded: https://repo.maven.apache.org/maven2/org/apache/maven/doxia/doxia-module-xdoc/1.2/doxia-module-xdoc-1.2.pom (6 KB at 63.8 KB/sec)
      Downloading: https://repo.maven.apache.org/maven2/org/apache/maven/shared/maven-doxia-tools/1.4/maven-doxia-tools-1.4.pom
      Downloaded: https://repo.maven.apache.org/maven2/org/apache/maven/shared/maven-doxia-tools/1.4/maven-doxia-tools-1.4.pom (8 KB at 104.0 KB/sec)
      Downloading: https://repo.maven.apache.org/maven2/org/codehaus/plexus/plexus-archiver/1.0/plexus-archiver-1.0.pom
      Downloaded: https://repo.maven.apache.org/maven2/org/codehaus/plexus/plexus-archiver/1.0/plexus-archiver-1.0.pom (2 KB at 19.2 KB/sec)
      Downloading: https://repo.maven.apache.org/maven2/org/codehaus/plexus/plexus-io/1.0/plexus-io-1.0.pom
      Downloaded: https://repo.maven.apache.org/maven2/org/codehaus/plexus/plexus-io/1.0/plexus-io-1.0.pom (2 KB at 18.2 KB/sec)
      Downloading: https://repo.maven.apache.org/maven2/org/codehaus/plexus/plexus-utils/1.5.10/plexus-utils-1.5.10.pom
      Downloaded: https://repo.maven.apache.org/maven2/org/codehaus/plexus/plexus-utils/1.5.10/plexus-utils-1.5.10.pom (6 KB at 64.7 KB/sec)
      Downloading: https://repo.maven.apache.org/maven2/commons-lang/commons-lang/2.5/commons-lang-2.5.pom
      Downloaded: https://repo.maven.apache.org/maven2/commons-lang/commons-lang/2.5/commons-lang-2.5.pom (17 KB at 229.1 KB/sec)
      Downloading: https://repo.maven.apache.org/maven2/org/apache/commons/commons-parent/12/commons-parent-12.pom
      Downloaded: https://repo.maven.apache.org/maven2/org/apache/commons/commons-parent/12/commons-parent-12.pom (27 KB at 341.4 KB/sec)
      Downloading: https://repo.maven.apache.org/maven2/org/apache/maven/wagon/wagon-ssh/1.0/wagon-ssh-1.0.jar
      Downloading: https://repo.maven.apache.org/maven2/org/apache/maven/wagon/wagon-ssh-common/1.0/wagon-ssh-common-1.0.jar
      Downloading: https://repo.maven.apache.org/maven2/org/codehaus/plexus/plexus-interactivity-api/1.0-alpha-6/plexus-interactivity-api-1.0-alpha-6.jar
      Downloading: https://repo.maven.apache.org/maven2/com/jcraft/jsch/0.1.44-1/jsch-0.1.44-1.jar
      Downloading: https://repo.maven.apache.org/maven2/org/apache/maven/reporting/maven-reporting-exec/1.0.1/maven-reporting-exec-1.0.1.jar
      Downloaded: https://repo.maven.apache.org/maven2/org/codehaus/plexus/plexus-interactivity-api/1.0-alpha-6/plexus-interactivity-api-1.0-alpha-6.jar (12 KB at 97.6 KB/sec)
      Downloading: https://repo.maven.apache.org/maven2/org/apache/maven/doxia/doxia-sink-api/1.2/doxia-sink-api-1.2.jar
      Downloaded: https://repo.maven.apache.org/maven2/org/apache/maven/wagon/wagon-ssh/1.0/wagon-ssh-1.0.jar (28 KB at 193.4 KB/sec)
      Downloaded: https://repo.maven.apache.org/maven2/org/apache/maven/wagon/wagon-ssh-common/1.0/wagon-ssh-common-1.0.jar (26 KB at 199.7 KB/sec)
      Downloaded: https://repo.maven.apache.org/maven2/org/apache/maven/reporting/maven-reporting-exec/1.0.1/maven-reporting-exec-1.0.1.jar (22 KB at 168.4 KB/sec)
      Downloading: https://repo.maven.apache.org/maven2/org/apache/maven/doxia/doxia-logging-api/1.2/doxia-logging-api-1.2.jar
      Downloading: https://repo.maven.apache.org/maven2/org/apache/maven/doxia/doxia-module-xhtml/1.2/doxia-module-xhtml-1.2.jar
      Downloading: https://repo.maven.apache.org/maven2/org/apache/maven/doxia/doxia-module-apt/1.2/doxia-module-apt-1.2.jar
      Downloaded: https://repo.maven.apache.org/maven2/org/apache/maven/doxia/doxia-logging-api/1.2/doxia-logging-api-1.2.jar (12 KB at 54.1 KB/sec)
      Downloading: https://repo.maven.apache.org/maven2/org/apache/maven/doxia/doxia-module-xdoc/1.2/doxia-module-xdoc-1.2.jar
      Downloaded: https://repo.maven.apache.org/maven2/org/apache/maven/doxia/doxia-sink-api/1.2/doxia-sink-api-1.2.jar (11 KB at 53.0 KB/sec)
      Downloading: https://repo.maven.apache.org/maven2/org/apache/maven/doxia/doxia-module-fml/1.2/doxia-module-fml-1.2.jar
      Downloaded: https://repo.maven.apache.org/maven2/org/apache/maven/doxia/doxia-module-xhtml/1.2/doxia-module-xhtml-1.2.jar (15 KB at 66.1 KB/sec)
      Downloading: https://repo.maven.apache.org/maven2/org/apache/maven/doxia/doxia-decoration-model/1.2/doxia-decoration-model-1.2.jar
      Downloaded: https://repo.maven.apache.org/maven2/com/jcraft/jsch/0.1.44-1/jsch-0.1.44-1.jar (209 KB at 869.9 KB/sec)
      Downloading: https://repo.maven.apache.org/maven2/org/apache/maven/doxia/doxia-site-renderer/1.2/doxia-site-renderer-1.2.jar
      Downloaded: https://repo.maven.apache.org/maven2/org/apache/maven/doxia/doxia-module-apt/1.2/doxia-module-apt-1.2.jar (51 KB at 209.6 KB/sec)
      Downloading: https://repo.maven.apache.org/maven2/org/apache/maven/shared/maven-doxia-tools/1.4/maven-doxia-tools-1.4.jar
      Downloaded: https://repo.maven.apache.org/maven2/org/apache/maven/doxia/doxia-module-xdoc/1.2/doxia-module-xdoc-1.2.jar (36 KB at 110.6 KB/sec)
      Downloaded: https://repo.maven.apache.org/maven2/org/apache/maven/doxia/doxia-module-fml/1.2/doxia-module-fml-1.2.jar (37 KB at 114.5 KB/sec)
      Downloading: https://repo.maven.apache.org/maven2/org/codehaus/plexus/plexus-archiver/1.0/plexus-archiver-1.0.jar
      Downloading: https://repo.maven.apache.org/maven2/org/codehaus/plexus/plexus-io/1.0/plexus-io-1.0.jar
      Downloaded: https://repo.maven.apache.org/maven2/org/apache/maven/shared/maven-doxia-tools/1.4/maven-doxia-tools-1.4.jar (45 KB at 126.8 KB/sec)
      Downloading: https://repo.maven.apache.org/maven2/org/codehaus/plexus/plexus-utils/1.5.10/plexus-utils-1.5.10.jar
      Downloaded: https://repo.maven.apache.org/maven2/org/apache/maven/doxia/doxia-site-renderer/1.2/doxia-site-renderer-1.2.jar (51 KB at 145.3 KB/sec)
      Downloaded: https://repo.maven.apache.org/maven2/org/apache/maven/doxia/doxia-decoration-model/1.2/doxia-decoration-model-1.2.jar (59 KB at 167.6 KB/sec)
      Downloading: https://repo.maven.apache.org/maven2/commons-lang/commons-lang/2.5/commons-lang-2.5.jar
      Downloaded: https://repo.maven.apache.org/maven2/org/codehaus/plexus/plexus-io/1.0/plexus-io-1.0.jar (50 KB at 106.0 KB/sec)
      Downloaded: https://repo.maven.apache.org/maven2/org/codehaus/plexus/plexus-archiver/1.0/plexus-archiver-1.0.jar (174 KB at 325.8 KB/sec)
      Downloaded: https://repo.maven.apache.org/maven2/org/codehaus/plexus/plexus-utils/1.5.10/plexus-utils-1.5.10.jar (274 KB at 478.1 KB/sec)
      Downloaded: https://repo.maven.apache.org/maven2/commons-lang/commons-lang/2.5/commons-lang-2.5.jar (273 KB at 475.0 KB/sec)
      [INFO]
      [INFO] — maven-dependency-plugin:2.9:copy-dependencies (copy) @ gora —
      [INFO]
      [INFO] — forbiddenapis:2.0:check (default) @ gora —
      [INFO] Skipping execution for packaging "pom"
      [INFO]
      [INFO] — forbiddenapis:2.0:testCheck (default) @ gora —
      [INFO] Skipping execution for packaging "pom"
      [INFO]
      [INFO] — maven-install-plugin:2.3.1:install (default-install) @ gora —
      Downloading: https://repo.maven.apache.org/maven2/org/codehaus/plexus/plexus-digest/1.0/plexus-digest-1.0.pom
      Downloaded: https://repo.maven.apache.org/maven2/org/codehaus/plexus/plexus-digest/1.0/plexus-digest-1.0.pom (2 KB at 14.8 KB/sec)
      Downloading: https://repo.maven.apache.org/maven2/org/codehaus/plexus/plexus-components/1.1.7/plexus-components-1.1.7.pom
      Downloaded: https://repo.maven.apache.org/maven2/org/codehaus/plexus/plexus-components/1.1.7/plexus-components-1.1.7.pom (5 KB at 75.9 KB/sec)
      Downloading: https://repo.maven.apache.org/maven2/org/codehaus/plexus/plexus-utils/2.0.5/plexus-utils-2.0.5.jar
      Downloading: https://repo.maven.apache.org/maven2/org/codehaus/plexus/plexus-digest/1.0/plexus-digest-1.0.jar
      Downloaded: https://repo.maven.apache.org/maven2/org/codehaus/plexus/plexus-digest/1.0/plexus-digest-1.0.jar (12 KB at 139.5 KB/sec)
      Downloaded: https://repo.maven.apache.org/maven2/org/codehaus/plexus/plexus-utils/2.0.5/plexus-utils-2.0.5.jar (218 KB at 1397.1 KB/sec)
      [INFO] Installing /home/ambari/gora/apache-gora-0.8/pom.xml to /root/.m2/repository/org/apache/gora/gora/0.8/gora-0.8.pom
      [INFO]
      [INFO] ------------------------------------------------------------------------
      [INFO] Building Apache Gora :: Compiler 0.8
      [INFO] ------------------------------------------------------------------------
      Downloading: https://repo.maven.apache.org/maven2/org/apache/maven/plugins/maven-resources-plugin/2.5/maven-resources-plugin-2.5.pom
      Downloaded: https://repo.maven.apache.org/maven2/org/apache/maven/plugins/maven-resources-plugin/2.5/maven-resources-plugin-2.5.pom (7 KB at 93.9 KB/sec)
      Downloading: https://repo.maven.apache.org/maven2/org/apache/maven/plugins/maven-resources-plugin/2.5/maven-resources-plugin-2.5.jar
      Downloaded: https://repo.maven.apache.org/maven2/org/apache/maven/plugins/maven-resources-plugin/2.5/maven-resources-plugin-2.5.jar (26 KB at 354.9 KB/sec)
      Downloading: https://repo.maven.apache.org/maven2/org/apache/avro/avro-compiler/1.8.1/avro-compiler-1.8.1.pom
      Downloaded: https://repo.maven.apache.org/maven2/org/apache/avro/avro-compiler/1.8.1/avro-compiler-1.8.1.pom (5 KB at 65.1 KB/sec)
      Downloading: https://repo.maven.apache.org/maven2/org/apache/avro/avro-parent/1.8.1/avro-parent-1.8.1.pom
      Downloaded: https://repo.maven.apache.org/maven2/org/apache/avro/avro-parent/1.8.1/avro-parent-1.8.1.pom (21 KB at 267.6 KB/sec)
      Downloading: https://repo.maven.apache.org/maven2/org/apache/avro/avro-toplevel/1.8.1/avro-toplevel-1.8.1.pom
      Downloaded: https://repo.maven.apache.org/maven2/org/apache/avro/avro-toplevel/1.8.1/avro-toplevel-1.8.1.pom (15 KB at 194.5 KB/sec)
      Downloading: https://repo.maven.apache.org/maven2/org/apache/avro/avro/1.8.1/avro-1.8.1.pom
      Downloaded: https://repo.maven.apache.org/maven2/org/apache/avro/avro/1.8.1/avro-1.8.1.pom (7 KB at 100.3 KB/sec)
      Downloading: https://repo.maven.apache.org/maven2/org/apache/avro/avro-compiler/1.8.1/avro-compiler-1.8.1.jar
      Downloading: https://repo.maven.apache.org/maven2/org/apache/avro/avro/1.8.1/avro-1.8.1.jar
      Downloaded: https://repo.maven.apache.org/maven2/org/apache/avro/avro-compiler/1.8.1/avro-compiler-1.8.1.jar (80 KB at 577.4 KB/sec)
      Downloaded: https://repo.maven.apache.org/maven2/org/apache/avro/avro/1.8.1/avro-1.8.1.jar (1314 KB at 2905.6 KB/sec)
      [INFO]
      [INFO] — maven-clean-plugin:2.5:clean (default-clean) @ gora-compiler —
      [INFO] Deleting /home/ambari/gora/apache-gora-0.8/gora-compiler/lib (includes = [*.jar], excludes = [])
      [INFO]
      [INFO] — maven-remote-resources-plugin:1.2.1:process (default) @ gora-compiler —
      [INFO]
      [INFO] — maven-resources-plugin:2.5:resources (default-resources) @ gora-compiler —
      Downloading: https://repo.maven.apache.org/maven2/org/codehaus/plexus/plexus-interpolation/1.13/plexus-interpolation-1.13.pom
      Downloaded: https://repo.maven.apache.org/maven2/org/codehaus/plexus/plexus-interpolation/1.13/plexus-interpolation-1.13.pom (890 B at 12.6 KB/sec)
      Downloading: https://repo.maven.apache.org/maven2/org/codehaus/plexus/plexus-interpolation/1.13/plexus-interpolation-1.13.jar
      Downloaded: https://repo.maven.apache.org/maven2/org/codehaus/plexus/plexus-interpolation/1.13/plexus-interpolation-1.13.jar (60 KB at 627.6 KB/sec)
      [debug] execute contextualize
      [INFO] Using 'UTF-8' encoding to copy filtered resources.
      [INFO] Copying 2 resources
      [INFO] Copying 3 resources
      [INFO]
      [INFO] — maven-compiler-plugin:3.1:compile (default-compile) @ gora-compiler —
      [INFO] Changes detected - recompiling the module!
      [INFO] Compiling 2 source files to /home/ambari/gora/apache-gora-0.8/gora-compiler/target/classes
      [WARNING] Unable to autodetect 'javac' path, using 'javac' from the environment.
      [INFO] ------------------------------------------------------------------------
      [INFO] Reactor Summary:
      [INFO]
      [INFO] Apache Gora ........................................ SUCCESS [ 17.396 s]
      [INFO] Apache Gora :: Compiler ............................ FAILURE [ 2.956 s]
      [INFO] Apache Gora :: Compiler-CLI ........................ SKIPPED
      [INFO] Apache Gora :: Core ................................ SKIPPED
      [INFO] Apache Gora :: Accumulo ............................ SKIPPED
      [INFO] Apache Gora :: HBase ............................... SKIPPED
      [INFO] Apache Gora :: Cassandra - CQL ..................... SKIPPED
      [INFO] Apache Gora :: GoraCI .............................. SKIPPED
      [INFO] Apache Gora :: Infinispan .......................... SKIPPED
      [INFO] Apache Gora :: JCache .............................. SKIPPED
      [INFO] Apache Gora :: OrientDB ............................ SKIPPED
      [INFO] Apache Gora :: Dynamodb ............................ SKIPPED
      [INFO] Apache Gora :: CouchDB ............................. SKIPPED
      [INFO] Apache Gora :: Maven Plugin ........................ SKIPPED
      [INFO] Apache Gora :: MongoDB ............................. SKIPPED
      [INFO] Apache Gora :: Solr ................................ SKIPPED
      [INFO] Apache Gora :: Aerospike ........................... SKIPPED
      [INFO] Apache Gora :: Tutorial ............................ SKIPPED
      [INFO] Apache Gora :: Sources-Dist ........................ SKIPPED
      [INFO] ------------------------------------------------------------------------
      [INFO] BUILD FAILURE
      [INFO] ------------------------------------------------------------------------
      [INFO] Total time: 25.726 s
      [INFO] Finished at: 2019-09-06T10:13:04+01:00
      [INFO] Final Memory: 32M/78M
      [INFO] ------------------------------------------------------------------------
      [ERROR] Failed to execute goal org.apache.maven.plugins:maven-compiler-plugin:3.1:compile (default-compile) on project gora-compiler: Compilation failure -> [Help 1]
      [ERROR]
      [ERROR] To see the full stack trace of the errors, re-run Maven with the -e switch.
      [ERROR] Re-run Maven using the -X switch to enable full debug logging.
      [ERROR]
      [ERROR] For more information about the errors and possible solutions, please read the following articles:
      [ERROR] [Help 1] http://cwiki.apache.org/confluence/display/MAVEN/MojoFailureException
      [ERROR]
      [ERROR] After correcting the problems, you can resume the build with the command
      [ERROR] mvn <goals> -rf :gora-compiler
      root@hgclusterambari00:/home/ambari/gora/apache-gora-0.8#

        Attachments

          Activity

            People

            • Assignee:
              Unassigned
              Reporter:
              eurocley Cleyson Barros
            • Votes:
              0 Vote for this issue
              Watchers:
              2 Start watching this issue

              Dates

              • Created:
                Updated:
                Resolved: