Uploaded image for project: 'Giraph'
  1. Giraph
  2. GIRAPH-864

'mvn clean test' fails for rexster

    XMLWordPrintableJSON

    Details

    • Type: Improvement
    • Status: Resolved
    • Priority: Major
    • Resolution: Fixed
    • Affects Version/s: None
    • Fix Version/s: 1.1.0
    • Component/s: None
    • Labels:
      None

      Description

      This used to work in the past. Can the rexster guys Claudio Martella] Armando Miraglia] please take a look?

      [INFO] ------------------------------------------------------------------------
      [INFO] Reactor Summary:
      [INFO]
      [INFO] Apache Giraph Parent .............................. SUCCESS [49.819s]
      [INFO] Apache Giraph Core ................................ SUCCESS [6:40.342s]
      [INFO] Apache Giraph Examples ............................ SUCCESS [9:06.653s]
      [INFO] Apache Giraph Accumulo I/O ........................ SUCCESS [42.679s]
      [INFO] Apache Giraph HBase I/O ........................... SUCCESS [2:54.177s]
      [INFO] Apache Giraph HCatalog I/O ........................ SUCCESS [56.357s]
      [INFO] Apache Giraph Hive I/O ............................ SUCCESS [5:53.348s]
      [INFO] Apache Giraph Gora I/O ............................ SUCCESS [1:45.304s]
      [INFO] Apache Giraph Rexster I/O ......................... SUCCESS [1.250s]
      [INFO] Apache Giraph Rexster Kibble ...................... SUCCESS [10.493s]
      [INFO] Apache Giraph Rexster I/O Formats ................. FAILURE [18.005s]
      [INFO] Apache Giraph Distribution ........................ SKIPPED
      [INFO] ------------------------------------------------------------------------
      [INFO] BUILD FAILURE
      [INFO] ------------------------------------------------------------------------
      [INFO] Total time: 29:20.210s
      [INFO] Finished at: Tue Feb 25 12:09:17 PST 2014
      [INFO] Final Memory: 77M/1842M
      [INFO] ------------------------------------------------------------------------
      [ERROR] Failed to execute goal on project giraph-rexster-io: Could not resolve dependencies for project org.apache.giraph:giraph-rexster-io:jar:1.1.0-SNAPSHOT: Could not find artifact org.apache.giraph:giraph-kibble:jar:1.1.0-SNAPSHOT at specified path /data/users/aching/giraph/giraph-rexster/giraph-rexster-io/../../giraph-rexster/giraph-kibble/target/giraph-kibble-1.1.0-SNAPSHOT.jar -> [Help 1]

        Attachments

        1. GIRAPH-864.patch
          1.0 kB
          Armando Miraglia

          Activity

            People

            • Assignee:
              cmartella Claudio Martella
              Reporter:
              aching Avery Ching
            • Votes:
              0 Vote for this issue
              Watchers:
              5 Start watching this issue

              Dates

              • Created:
                Updated:
                Resolved: