Uploaded image for project: 'Geode'
  1. Geode
  2. GEODE-8983

CI Failure: DeploymentManagementRedployDUnitTest.hotDeployShouldNotResultInAnyFailedFunctionExecutions

    XMLWordPrintableJSON

    Details

      Description

      org.apache.geode.management.internal.rest.DeploymentManagementRedployDUnitTest > hotDeployShouldNotResultInAnyFailedFunctionExecutions FAILED
          org.apache.geode.test.dunit.RMIException: While invoking org.apache.geode.management.internal.rest.DeploymentManagementRedployDUnitTest$$Lambda$422/0x000000010059f840.run in VM 1 running on Host 91f54af25dd2 with 4 VMs
              at org.apache.geode.test.dunit.VM.executeMethodOnObject(VM.java:631)
              at org.apache.geode.test.dunit.VM.invoke(VM.java:448)
              at org.apache.geode.test.junit.rules.VMProvider.invoke(VMProvider.java:94)
              at org.apache.geode.management.internal.rest.DeploymentManagementRedployDUnitTest.hotDeployShouldNotResultInAnyFailedFunctionExecutions(DeploymentManagementRedployDUnitTest.java:184)
      
              Caused by:
              org.apache.geode.cache.execute.FunctionException: Function named DeployCommandRedeployDUnitFunctionA is not registered to FunctionService
      
      371 tests completed, 1 failed
      
      =-=-=-=-=-=-=-=-=-=-=-=-=-=-=  Test Results URI =-=-=-=-=-=-=-=-=-=-=-=-=-=-=-=-=
      http://files.apachegeode-ci.info/builds/apache-develop-main/1.15.0-build.0021/test-results/distributedTest/1614547395/
      =-=-=-=-=-=-=-=-=-=-=-=-=-=-=-=-=-=-=-=-=-=-=-=-=-=-=-=-=-=-=-=-=-=-=-=-=-=-=-=-=
      
      Test report artifacts from this job are available at:
      
      http://files.apachegeode-ci.info/builds/apache-develop-main/1.15.0-build.0021/test-artifacts/1614547395/distributedtestfiles-OpenJDK11-1.15.0-build.0021.tgz
      

      This failure was also seen in a previous run, along with an instance of GEODE-8984. Artifacts for that failure can be found here:

      =-=-=-=-=-=-=-=-=-=-=-=-=-=-=  Test Results URI =-=-=-=-=-=-=-=-=-=-=-=-=-=-=-=-=
      http://files.apachegeode-ci.info/builds/apache-develop-main/1.15.0-build.0021/test-results/distributedTest/1614538872/
      =-=-=-=-=-=-=-=-=-=-=-=-=-=-=-=-=-=-=-=-=-=-=-=-=-=-=-=-=-=-=-=-=-=-=-=-=-=-=-=-=
      
      Test report artifacts from this job are available at:
      
      http://files.apachegeode-ci.info/builds/apache-develop-main/1.15.0-build.0021/test-artifacts/1614538872/distributedtestfiles-OpenJDK11-1.15.0-build.0021.tgz
      

        Attachments

          Issue Links

            Activity

              People

              • Assignee:
                ukohlmeyer Udo Kohlmeyer
                Reporter:
                donalevans Donal Evans
              • Votes:
                0 Vote for this issue
                Watchers:
                2 Start watching this issue

                Dates

                • Created:
                  Updated: