Uploaded image for project: 'Geode'
  1. Geode
  2. GEODE-8701

CI failure: DeltaPropagationStatsDUnitTest.testC2SDeltaPropagationCleanStats fails with AssertionError

    XMLWordPrintableJSON

    Details

    • Type: Bug
    • Status: Open
    • Priority: Major
    • Resolution: Unresolved
    • Affects Version/s: None
    • Fix Version/s: None
    • Component/s: regions, tests
    • Labels:
      None

      Description

      > Task :geode-core:distributedTest
      
      org.apache.geode.internal.cache.DeltaPropagationStatsDUnitTest > testC2SDeltaPropagationCleanStats FAILED
          org.apache.geode.test.dunit.RMIException: While invoking org.apache.geode.internal.cache.DeltaPropagationStatsDUnitTest$$Lambda$446/0x0000000100d1c040.run in VM 0 running on Host 125a44116b1b with 4 VMs
              at org.apache.geode.test.dunit.VM.executeMethodOnObject(VM.java:623)
              at org.apache.geode.test.dunit.VM.invoke(VM.java:447)
              at org.apache.geode.internal.cache.DeltaPropagationStatsDUnitTest.testC2SDeltaPropagationCleanStats(DeltaPropagationStatsDUnitTest.java:282)
      
              Caused by:
              java.lang.AssertionError: Bug #49539: stats do not match, expected messageNotQueuedOriginator: 2551, actual: 2552 expected:<2551> but was:<2552>
                  at org.junit.Assert.fail(Assert.java:89)
                  at org.junit.Assert.failNotEquals(Assert.java:835)
                  at org.junit.Assert.assertEquals(Assert.java:647)
                  at org.apache.geode.internal.cache.DeltaPropagationStatsDUnitTest.verifyCCPStatsBug49539(DeltaPropagationStatsDUnitTest.java:506)
                  at org.apache.geode.internal.cache.DeltaPropagationStatsDUnitTest.lambda$testC2SDeltaPropagationCleanStats$c7abd768$1(DeltaPropagationStatsDUnitTest.java:282)
      
      8719 tests completed, 1 failed, 452 skipped
      
      =-=-=-=-=-=-=-=-=-=-=-=-=-=-=  Test Results URI =-=-=-=-=-=-=-=-=-=-=-=-=-=-=-=-=

      http://files.apachegeode-ci.info/builds/apache-develop-main/1.14.0-build.0480/test-results/distributedTest/1605125153/

      =-=-=-=-=-=-=-=-=-=-=-=-=-=-=-=-=-=-=-=-=-=-=-=-=-=-=-=-=-=-=-=-=-=-=-=-=-=-=-=-=
      Test report artifacts from this job are available at:
      

      http://files.apachegeode-ci.info/builds/apache-develop-main/1.14.0-build.0480/test-artifacts/1605125153/distributedtestfiles-OpenJDK11-1.14.0-build.0480.tgz

        Attachments

          Activity

            People

            • Assignee:
              Unassigned
              Reporter:
              klund Kirk Lund
            • Votes:
              0 Vote for this issue
              Watchers:
              1 Start watching this issue

              Dates

              • Created:
                Updated: