Uploaded image for project: 'Flink'
  1. Flink
  2. FLINK-25088

KafkaSinkITCase failed on azure due to Container did not start correctly

    XMLWordPrintableJSON

Details

    Description

      Nov 29 03:38:00 	at org.junit.vintage.engine.VintageTestEngine.executeAllChildren(VintageTestEngine.java:82)
      Nov 29 03:38:00 	at org.junit.vintage.engine.VintageTestEngine.execute(VintageTestEngine.java:73)
      Nov 29 03:38:00 	at org.junit.platform.launcher.core.DefaultLauncher.execute(DefaultLauncher.java:220)
      Nov 29 03:38:00 	at org.junit.platform.launcher.core.DefaultLauncher.lambda$execute$6(DefaultLauncher.java:188)
      Nov 29 03:38:00 	at org.junit.platform.launcher.core.DefaultLauncher.withInterceptedStreams(DefaultLauncher.java:202)
      Nov 29 03:38:00 	at org.junit.platform.launcher.core.DefaultLauncher.execute(DefaultLauncher.java:181)
      Nov 29 03:38:00 	at org.junit.platform.launcher.core.DefaultLauncher.execute(DefaultLauncher.java:128)
      Nov 29 03:38:00 	at org.apache.maven.surefire.junitplatform.JUnitPlatformProvider.invokeAllTests(JUnitPlatformProvider.java:150)
      Nov 29 03:38:00 	at org.apache.maven.surefire.junitplatform.JUnitPlatformProvider.invoke(JUnitPlatformProvider.java:120)
      Nov 29 03:38:00 	at org.apache.maven.surefire.booter.ForkedBooter.invokeProviderInSameClassLoader(ForkedBooter.java:384)
      Nov 29 03:38:00 	at org.apache.maven.surefire.booter.ForkedBooter.runSuitesInProcess(ForkedBooter.java:345)
      Nov 29 03:38:00 	at org.apache.maven.surefire.booter.ForkedBooter.execute(ForkedBooter.java:126)
      Nov 29 03:38:00 	at org.apache.maven.surefire.booter.ForkedBooter.main(ForkedBooter.java:418)
      Nov 29 03:38:00 Caused by: org.rnorth.ducttape.RetryCountExceededException: Retry limit hit with exception
      Nov 29 03:38:00 	at org.rnorth.ducttape.unreliables.Unreliables.retryUntilSuccess(Unreliables.java:88)
      Nov 29 03:38:00 	at org.testcontainers.containers.GenericContainer.doStart(GenericContainer.java:327)
      Nov 29 03:38:00 	... 33 more
      Nov 29 03:38:00 Caused by: org.testcontainers.containers.ContainerLaunchException: Could not create/start container
      Nov 29 03:38:00 	at org.testcontainers.containers.GenericContainer.tryStart(GenericContainer.java:523)
      Nov 29 03:38:00 	at org.testcontainers.containers.GenericContainer.lambda$doStart$0(GenericContainer.java:329)
      Nov 29 03:38:00 	at org.rnorth.ducttape.unreliables.Unreliables.retryUntilSuccess(Unreliables.java:81)
      Nov 29 03:38:00 	... 34 more
      Nov 29 03:38:00 Caused by: java.lang.IllegalStateException: Container did not start correctly.
      Nov 29 03:38:00 	at org.testcontainers.containers.GenericContainer.tryStart(GenericContainer.java:461)
      Nov 29 03:38:00 	... 36 more
      Nov 29 03:38:00 
      Nov 29 03:38:01 [INFO] Running org.apache.flink.connector.kafka.sink.FlinkKafkaInternalProducerITCase
      Nov 29 03:38:16 [INFO] Tests run: 1, Failures: 0, Errors: 0, Skipped: 0, Time elapsed: 14.442 s - in org.apache.flink.connector.kafka.sink.FlinkKafkaInternalProducerITCase
      Nov 29 03:38:16 [INFO] 
      Nov 29 03:38:16 [INFO] Results:
      Nov 29 03:38:16 [INFO] 
      Nov 29 03:38:16 [ERROR] Errors: 
      Nov 29 03:38:16 [ERROR]   KafkaSinkITCase ยป ContainerLaunch Container startup failed
      Nov 29 03:38:16 [INFO] 
      Nov 29 03:38:16 [ERROR] Tests run: 186, Failures: 0, Errors: 1, Skipped: 0
       

      https://dev.azure.com/apache-flink/apache-flink/_build/results?buildId=27181&view=logs&j=b0097207-033c-5d9a-b48c-6d4796fbe60d&t=8338a7d2-16f7-52e5-f576-4b7b3071eb3d&l=7151

      Attachments

        Issue Links

          Activity

            People

              arvid Arvid Heise
              gaoyunhaii Yun Gao
              Votes:
              0 Vote for this issue
              Watchers:
              2 Start watching this issue

              Dates

                Created:
                Updated:
                Resolved: