Uploaded image for project: 'Flink'
  1. Flink
  2. FLINK-24304

ProcessFailureCancelingITCase.testCancelingOnProcessFailure fails due to leader retrieval timeout

    XMLWordPrintableJSON

    Details

      Description

      https://dev.azure.com/apache-flink/apache-flink/_build/results?buildId=24145&view=logs&j=5c8e7682-d68f-54d1-16a2-a09310218a49&t=f508e270-48d6-5f1e-3138-42a17e0714f0&l=4153

      [ERROR] Tests run: 1, Failures: 0, Errors: 1, Skipped: 0, Time elapsed: 26.597 s <<< FAILURE! - in org.apache.flink.test.recovery.ProcessFailureCancelingITCase
      [ERROR] testCancelingOnProcessFailure(org.apache.flink.test.recovery.ProcessFailureCancelingITCase)  Time elapsed: 25.988 s  <<< ERROR!
      org.apache.flink.runtime.leaderretrieval.LeaderRetrievalException: Could not retrieve the leader address and leader session ID.
      	at org.apache.flink.runtime.util.LeaderRetrievalUtils.retrieveLeaderConnectionInfo(LeaderRetrievalUtils.java:63)
      	at org.apache.flink.test.recovery.ProcessFailureCancelingITCase.retrieveDispatcherGateway(ProcessFailureCancelingITCase.java:283)
      	at org.apache.flink.test.recovery.ProcessFailureCancelingITCase.testCancelingOnProcessFailure(ProcessFailureCancelingITCase.java:216)
      	at sun.reflect.NativeMethodAccessorImpl.invoke0(Native Method)
      	at sun.reflect.NativeMethodAccessorImpl.invoke(NativeMethodAccessorImpl.java:62)
      	at sun.reflect.DelegatingMethodAccessorImpl.invoke(DelegatingMethodAccessorImpl.java:43)
      	at java.lang.reflect.Method.invoke(Method.java:498)
      	at org.junit.runners.model.FrameworkMethod$1.runReflectiveCall(FrameworkMethod.java:50)
      	at org.junit.internal.runners.model.ReflectiveCallable.run(ReflectiveCallable.java:12)
      	at org.junit.runners.model.FrameworkMethod.invokeExplosively(FrameworkMethod.java:47)
      	at org.junit.internal.runners.statements.InvokeMethod.evaluate(InvokeMethod.java:17)
      	at org.junit.rules.ExternalResource$1.evaluate(ExternalResource.java:48)
      	at org.junit.rules.ExternalResource$1.evaluate(ExternalResource.java:48)
      	at org.junit.rules.ExternalResource$1.evaluate(ExternalResource.java:48)
      	at org.junit.rules.TestWatcher$1.evaluate(TestWatcher.java:55)
      	at org.junit.rules.RunRules.evaluate(RunRules.java:20)
      	at org.junit.runners.ParentRunner.runLeaf(ParentRunner.java:325)
      	at org.junit.runners.BlockJUnit4ClassRunner.runChild(BlockJUnit4ClassRunner.java:78)
      	at org.junit.runners.BlockJUnit4ClassRunner.runChild(BlockJUnit4ClassRunner.java:57)
      	at org.junit.runners.ParentRunner$3.run(ParentRunner.java:290)
      	at org.junit.runners.ParentRunner$1.schedule(ParentRunner.java:71)
      	at org.junit.runners.ParentRunner.runChildren(ParentRunner.java:288)
      	at org.junit.runners.ParentRunner.access$000(ParentRunner.java:58)
      	at org.junit.runners.ParentRunner$2.evaluate(ParentRunner.java:268)
      	at org.junit.runners.ParentRunner.run(ParentRunner.java:363)
      	at org.apache.maven.surefire.junit4.JUnit4Provider.execute(JUnit4Provider.java:365)
      	at org.apache.maven.surefire.junit4.JUnit4Provider.executeWithRerun(JUnit4Provider.java:273)
      	at org.apache.maven.surefire.junit4.JUnit4Provider.executeTestSet(JUnit4Provider.java:238)
      	at org.apache.maven.surefire.junit4.JUnit4Provider.invoke(JUnit4Provider.java:159)
      	at org.apache.maven.surefire.booter.ForkedBooter.invokeProviderInSameClassLoader(ForkedBooter.java:384)
      	at org.apache.maven.surefire.booter.ForkedBooter.runSuitesInProcess(ForkedBooter.java:345)
      	at org.apache.maven.surefire.booter.ForkedBooter.execute(ForkedBooter.java:126)
      	at org.apache.maven.surefire.booter.ForkedBooter.main(ForkedBooter.java:418)
      Caused by: java.util.concurrent.TimeoutException
      	at java.util.concurrent.CompletableFuture.timedGet(CompletableFuture.java:1784)
      	at java.util.concurrent.CompletableFuture.get(CompletableFuture.java:1928)
      	at org.apache.flink.runtime.util.LeaderRetrievalUtils.retrieveLeaderConnectionInfo(LeaderRetrievalUtils.java:61)
      	... 32 more
      

        Attachments

          Activity

            People

            • Assignee:
              Unassigned
              Reporter:
              xtsong Xintong Song
            • Votes:
              0 Vote for this issue
              Watchers:
              1 Start watching this issue

              Dates

              • Created:
                Updated: