Uploaded image for project: 'Flink'
  1. Flink
  2. FLINK-24092

OrcFsStreamingSinkITCase.testPart times out on azure

Attach filesAttach ScreenshotVotersWatch issueWatchersCreate sub-taskLinkCloneUpdate Comment AuthorReplace String in CommentUpdate Comment VisibilityDelete Comments
    XMLWordPrintableJSON

Details

    • Bug
    • Status: Closed
    • Major
    • Resolution: Duplicate
    • 1.14.0, 1.15.0
    • None
    • Connectors / ORC

    Description

      https://dev.azure.com/apache-flink/apache-flink/_build/results?buildId=23245&view=logs&j=d44f43ce-542c-597d-bf94-b0718c71e5e8&t=ed165f3f-d0f6-524b-5279-86f8ee7d0e2d&l=13074

      Aug 31 20:07:07 [ERROR] Tests run: 3, Failures: 0, Errors: 1, Skipped: 0, Time elapsed: 32.79 s <<< FAILURE! - in org.apache.flink.orc.OrcFsStreamingSinkITCase
      Aug 31 20:07:07 [ERROR] testPart  Time elapsed: 20.322 s  <<< ERROR!
      Aug 31 20:07:07 org.junit.runners.model.TestTimedOutException: test timed out after 20 seconds
      Aug 31 20:07:07 	at java.lang.Thread.sleep(Native Method)
      Aug 31 20:07:07 	at org.apache.flink.streaming.api.operators.collect.CollectResultFetcher.sleepBeforeRetry(CollectResultFetcher.java:237)
      Aug 31 20:07:07 	at org.apache.flink.streaming.api.operators.collect.CollectResultFetcher.next(CollectResultFetcher.java:113)
      Aug 31 20:07:07 	at org.apache.flink.streaming.api.operators.collect.CollectResultIterator.nextResultFromFetcher(CollectResultIterator.java:106)
      Aug 31 20:07:07 	at org.apache.flink.streaming.api.operators.collect.CollectResultIterator.hasNext(CollectResultIterator.java:80)
      Aug 31 20:07:07 	at org.apache.flink.table.api.internal.TableResultImpl$CloseableRowIteratorWrapper.hasNext(TableResultImpl.java:370)
      Aug 31 20:07:07 	at java.util.Iterator.forEachRemaining(Iterator.java:115)
      Aug 31 20:07:07 	at org.apache.flink.util.CollectionUtil.iteratorToList(CollectionUtil.java:109)
      Aug 31 20:07:07 	at org.apache.flink.table.planner.runtime.stream.FsStreamingSinkITCaseBase.check(FsStreamingSinkITCaseBase.scala:133)
      Aug 31 20:07:07 	at org.apache.flink.table.planner.runtime.stream.FsStreamingSinkITCaseBase.test(FsStreamingSinkITCaseBase.scala:120)
      Aug 31 20:07:07 	at org.apache.flink.table.planner.runtime.stream.FsStreamingSinkITCaseBase.testPart(FsStreamingSinkITCaseBase.scala:84)
      Aug 31 20:07:07 	at sun.reflect.NativeMethodAccessorImpl.invoke0(Native Method)
      Aug 31 20:07:07 	at sun.reflect.NativeMethodAccessorImpl.invoke(NativeMethodAccessorImpl.java:62)
      Aug 31 20:07:07 	at sun.reflect.DelegatingMethodAccessorImpl.invoke(DelegatingMethodAccessorImpl.java:43)
      Aug 31 20:07:07 	at java.lang.reflect.Method.invoke(Method.java:498)
      Aug 31 20:07:07 	at org.junit.runners.model.FrameworkMethod$1.runReflectiveCall(FrameworkMethod.java:59)
      Aug 31 20:07:07 	at org.junit.internal.runners.model.ReflectiveCallable.run(ReflectiveCallable.java:12)
      Aug 31 20:07:07 	at org.junit.runners.model.FrameworkMethod.invokeExplosively(FrameworkMethod.java:56)
      Aug 31 20:07:07 	at org.junit.internal.runners.statements.InvokeMethod.evaluate(InvokeMethod.java:17)
      Aug 31 20:07:07 	at org.junit.internal.runners.statements.RunBefores.evaluate(RunBefores.java:26)
      Aug 31 20:07:07 	at org.junit.internal.runners.statements.RunAfters.evaluate(RunAfters.java:27)
      Aug 31 20:07:07 	at org.junit.internal.runners.statements.FailOnTimeout$CallableStatement.call(FailOnTimeout.java:299)
      Aug 31 20:07:07 	at org.junit.internal.runners.statements.FailOnTimeout$CallableStatement.call(FailOnTimeout.java:293)
      Aug 31 20:07:07 	at java.util.concurrent.FutureTask.run(FutureTask.java:266)
      Aug 31 20:07:07 	at java.lang.Thread.run(Thread.java:748)
      

      Attachments

        Issue Links

        Activity

          This comment will be Viewable by All Users Viewable by All Users
          Cancel

          People

            Unassigned Unassigned
            xtsong Xintong Song
            Votes:
            0 Vote for this issue
            Watchers:
            2 Start watching this issue

            Dates

              Created:
              Updated:
              Resolved:

              Slack

                Issue deployment